Build 6960

Properties

Run GHC Validate Build

When
Completed at Oct 23 2015, 4:37 AM · Built for 31 m, 57 s
Status
Failed
Description

Run GHC ./validate build.

Build Log 118393 (remote - stderr)
25 - 50 - 100 - Unlimited Lines

1ERROR: validate failed! Last 1000 lines of log file:
2 Probable fix: add INLINEABLE pragma on ‘Outputable.$fOutputableIntMap_$cppr1’
3
4compiler/typecheck/TcEvidence.hs: warning:
5 Could not specialise imported function ‘Outputable.$fOutputableIntMap_$cppr1’
6 Probable fix: add INLINEABLE pragma on ‘Outputable.$fOutputableIntMap_$cppr1’
7
8compiler/typecheck/TcEvidence.hs: warning:
9 Could not specialise imported function ‘Outputable.$w$cppr’
10 when specialising ‘Outputable.$fOutputable(,)_$cppr’
11 Probable fix: add INLINEABLE pragma on ‘Outputable.$w$cppr’
12
13compiler/typecheck/TcEvidence.hs: warning:
14 Could not specialise imported function ‘Data.Traversable.$fTraversable[]_$csequenceA’
15 Probable fix: add INLINEABLE pragma on ‘Data.Traversable.$fTraversable[]_$csequenceA’
16 HC [stage 1] compiler/stage2/build/HsBinds.o
17
18compiler/hsSyn/HsBinds.hs: warning:
19 Could not specialise imported function ‘Data.Data.$fData[]_$cp1Data’
20 when specialising ‘Data.Data.$fData[]’
21 Probable fix: add INLINEABLE pragma on ‘Data.Data.$fData[]_$cp1Data’
22
23compiler/hsSyn/HsBinds.hs: warning:
24 Could not specialise imported function ‘SrcLoc.$fDataGenLocated_$cgmapMo’
25 when specialising ‘SrcLoc.$fDataGenLocated’
26 Probable fix: add INLINEABLE pragma on ‘SrcLoc.$fDataGenLocated_$cgmapMo’
27
28compiler/hsSyn/HsBinds.hs: warning:
29 Could not specialise imported function ‘SrcLoc.$fDataGenLocated_$cgmapMp’
30 when specialising ‘SrcLoc.$fDataGenLocated’
31 Probable fix: add INLINEABLE pragma on ‘SrcLoc.$fDataGenLocated_$cgmapMp’
32
33compiler/hsSyn/HsBinds.hs: warning:
34 Could not specialise imported function ‘SrcLoc.$w$cgmapM’
35 when specialising ‘SrcLoc.$fDataGenLocated_$cgmapM’
36 when specialising ‘SrcLoc.$fDataGenLocated’
37 Probable fix: add INLINEABLE pragma on ‘SrcLoc.$w$cgmapM’
38
39compiler/hsSyn/HsBinds.hs: warning:
40 Could not specialise imported function ‘pprHsContextMaybe’
41 Probable fix: add INLINEABLE pragma on ‘pprHsContextMaybe’
42
43compiler/hsSyn/HsBinds.hs: warning:
44 Could not specialise imported function ‘PprCore.$fOutputableTickish_$cppr’
45 when specialising ‘PprCore.$fOutputableTickish_$cpprPrec’
46 when specialising ‘PprCore.$fOutputableTickish’
47 Probable fix: add INLINEABLE pragma on ‘PprCore.$fOutputableTickish_$cppr’
48
49compiler/hsSyn/HsBinds.hs: warning:
50 Could not specialise imported function ‘PprCore.$fOutputableTickish_$cppr’
51 when specialising ‘PprCore.$fOutputableTickish’
52 Probable fix: add INLINEABLE pragma on ‘PprCore.$fOutputableTickish_$cppr’
53
54compiler/hsSyn/HsBinds.hs: warning:
55 Could not specialise imported function ‘Outputable.$fOutputableIntMap_$cppr1’
56 Probable fix: add INLINEABLE pragma on ‘Outputable.$fOutputableIntMap_$cppr1’
57
58compiler/hsSyn/HsBinds.hs: warning:
59 Could not specialise imported function ‘SrcLoc.$w$cppr’
60 when specialising ‘SrcLoc.$fOutputableGenLocated_$cppr’
61 when specialising ‘SrcLoc.$fOutputableGenLocated_$cpprPrec’
62 when specialising ‘SrcLoc.$fOutputableGenLocated’
63 Probable fix: add INLINEABLE pragma on ‘SrcLoc.$w$cppr’
64
65compiler/hsSyn/HsBinds.hs: warning:
66 Could not specialise imported function ‘SrcLoc.$w$cppr’
67 when specialising ‘SrcLoc.$fOutputableGenLocated_$cppr’
68 Probable fix: add INLINEABLE pragma on ‘SrcLoc.$w$cppr’
69
70compiler/hsSyn/HsBinds.hs: warning:
71 Could not specialise imported function ‘BooleanFormula.$fOutputableBooleanFormula_$cppr’
72 Probable fix: add INLINEABLE pragma on ‘BooleanFormula.$fOutputableBooleanFormula_$cppr’
73
74compiler/hsSyn/HsBinds.hs: warning:
75 Could not specialise imported function ‘UniqFM.$fDataUniqFM_$cgmapMo’
76 when specialising ‘UniqFM.$fDataUniqFM’
77 Probable fix: add INLINEABLE pragma on ‘UniqFM.$fDataUniqFM_$cgmapMo’
78
79compiler/hsSyn/HsBinds.hs: warning:
80 Could not specialise imported function ‘UniqFM.$fDataUniqFM_$cgmapMp’
81 when specialising ‘UniqFM.$fDataUniqFM’
82 Probable fix: add INLINEABLE pragma on ‘UniqFM.$fDataUniqFM_$cgmapMp’
83
84compiler/hsSyn/HsBinds.hs: warning:
85 Could not specialise imported function ‘UniqFM.$fDataUniqFM_$cgmapM’
86 when specialising ‘UniqFM.$fDataUniqFM’
87 Probable fix: add INLINEABLE pragma on ‘UniqFM.$fDataUniqFM_$cgmapM’
88
89compiler/hsSyn/HsBinds.hs: warning:
90 Could not specialise imported function ‘containers-0.5.6.2:Data.IntMap.Base.$fDataIntMap_$cgmapMo’
91 when specialising ‘containers-0.5.6.2:Data.IntMap.Base.$fDataIntMap’
92 when specialising ‘UniqFM.$fDataUniqFM_$cgmapQi’
93 when specialising ‘UniqFM.$fDataUniqFM’
94 Probable fix: add INLINEABLE pragma on ‘containers-0.5.6.2:Data.IntMap.Base.$fDataIntMap_$cgmapMo’
95
96compiler/hsSyn/HsBinds.hs: warning:
97 Could not specialise imported function ‘containers-0.5.6.2:Data.IntMap.Base.$fDataIntMap_$cgmapMp’
98 when specialising ‘containers-0.5.6.2:Data.IntMap.Base.$fDataIntMap’
99 when specialising ‘UniqFM.$fDataUniqFM_$cgmapQi’
100 when specialising ‘UniqFM.$fDataUniqFM’
101 Probable fix: add INLINEABLE pragma on ‘containers-0.5.6.2:Data.IntMap.Base.$fDataIntMap_$cgmapMp’
102
103compiler/hsSyn/HsBinds.hs: warning:
104 Could not specialise imported function ‘containers-0.5.6.2:Data.IntMap.Base.$fDataIntMap_$cgmapM’
105 when specialising ‘containers-0.5.6.2:Data.IntMap.Base.$fDataIntMap’
106 when specialising ‘UniqFM.$fDataUniqFM_$cgmapQi’
107 when specialising ‘UniqFM.$fDataUniqFM’
108 Probable fix: add INLINEABLE pragma on ‘containers-0.5.6.2:Data.IntMap.Base.$fDataIntMap_$cgmapM’
109
110compiler/hsSyn/HsBinds.hs: warning:
111 Could not specialise imported function ‘containers-0.5.6.2:Data.IntMap.Base.$fDataIntMap_$cgmapQi’
112 when specialising ‘containers-0.5.6.2:Data.IntMap.Base.$fDataIntMap’
113 when specialising ‘UniqFM.$fDataUniqFM_$cgmapQi’
114 when specialising ‘UniqFM.$fDataUniqFM’
115 Probable fix: add INLINEABLE pragma on ‘containers-0.5.6.2:Data.IntMap.Base.$fDataIntMap_$cgmapQi’
116
117compiler/hsSyn/HsBinds.hs: warning:
118 Could not specialise imported function ‘containers-0.5.6.2:Data.IntMap.Base.$fDataIntMap_$cgmapQ’
119 when specialising ‘containers-0.5.6.2:Data.IntMap.Base.$fDataIntMap’
120 when specialising ‘UniqFM.$fDataUniqFM_$cgmapQi’
121 when specialising ‘UniqFM.$fDataUniqFM’
122 Probable fix: add INLINEABLE pragma on ‘containers-0.5.6.2:Data.IntMap.Base.$fDataIntMap_$cgmapQ’
123
124compiler/hsSyn/HsBinds.hs: warning:
125 Could not specialise imported function ‘containers-0.5.6.2:Data.IntMap.Base.$fDataIntMap_$cgmapQr’
126 when specialising ‘containers-0.5.6.2:Data.IntMap.Base.$fDataIntMap’
127 when specialising ‘UniqFM.$fDataUniqFM_$cgmapQi’
128 when specialising ‘UniqFM.$fDataUniqFM’
129 Probable fix: add INLINEABLE pragma on ‘containers-0.5.6.2:Data.IntMap.Base.$fDataIntMap_$cgmapQr’
130
131compiler/hsSyn/HsBinds.hs: warning:
132 Could not specialise imported function ‘containers-0.5.6.2:Data.IntMap.Base.$fDataIntMap_$cgmapQl’
133 when specialising ‘containers-0.5.6.2:Data.IntMap.Base.$fDataIntMap’
134 when specialising ‘UniqFM.$fDataUniqFM_$cgmapQi’
135 when specialising ‘UniqFM.$fDataUniqFM’
136 Probable fix: add INLINEABLE pragma on ‘containers-0.5.6.2:Data.IntMap.Base.$fDataIntMap_$cgmapQl’
137
138compiler/hsSyn/HsBinds.hs: warning:
139 Could not specialise imported function ‘containers-0.5.6.2:Data.IntMap.Base.$fDataIntMap_$cgunfold’
140 when specialising ‘containers-0.5.6.2:Data.IntMap.Base.$fDataIntMap’
141 when specialising ‘UniqFM.$fDataUniqFM_$cgmapQi’
142 when specialising ‘UniqFM.$fDataUniqFM’
143 Probable fix: add INLINEABLE pragma on ‘containers-0.5.6.2:Data.IntMap.Base.$fDataIntMap_$cgunfold’
144
145compiler/hsSyn/HsBinds.hs: warning:
146 Could not specialise imported function ‘containers-0.5.6.2:Data.IntMap.Base.$fDataIntMap_$cgfoldl’
147 when specialising ‘containers-0.5.6.2:Data.IntMap.Base.$fDataIntMap’
148 when specialising ‘UniqFM.$fDataUniqFM_$cgmapQi’
149 when specialising ‘UniqFM.$fDataUniqFM’
150 Probable fix: add INLINEABLE pragma on ‘containers-0.5.6.2:Data.IntMap.Base.$fDataIntMap_$cgfoldl’
151
152compiler/hsSyn/HsBinds.hs: warning:
153 Could not specialise imported function ‘containers-0.5.6.2:Data.IntMap.Base.$fDataIntMap_$cp1Data’
154 when specialising ‘containers-0.5.6.2:Data.IntMap.Base.$fDataIntMap’
155 when specialising ‘UniqFM.$fDataUniqFM_$cgmapQi’
156 when specialising ‘UniqFM.$fDataUniqFM’
157 Probable fix: add INLINEABLE pragma on ‘containers-0.5.6.2:Data.IntMap.Base.$fDataIntMap_$cp1Data’
158
159compiler/hsSyn/HsBinds.hs: warning:
160 Could not specialise imported function ‘UniqFM.$fDataUniqFM_$cgunfold’
161 when specialising ‘UniqFM.$fDataUniqFM’
162 Probable fix: add INLINEABLE pragma on ‘UniqFM.$fDataUniqFM_$cgunfold’
163
164compiler/hsSyn/HsBinds.hs: warning:
165 Could not specialise imported function ‘UniqFM.$fDataUniqFM_$cgfoldl’
166 when specialising ‘UniqFM.$fDataUniqFM’
167 Probable fix: add INLINEABLE pragma on ‘UniqFM.$fDataUniqFM_$cgfoldl’
168
169compiler/hsSyn/HsBinds.hs: warning:
170 Could not specialise imported function ‘UniqFM.$fDataUniqFM_$cp1Data’
171 when specialising ‘UniqFM.$fDataUniqFM’
172 Probable fix: add INLINEABLE pragma on ‘UniqFM.$fDataUniqFM_$cp1Data’
173 HC [stage 1] compiler/stage2/build/StgSyn.o
174 HC [stage 1] compiler/stage2/build/CLabel.o
175 HC [stage 1] compiler/stage2/build/CoreUtils.o
176
177compiler/stgSyn/StgSyn.hs: warning:
178 Could not specialise imported function ‘PprCore.$fOutputableTickish_$cppr’
179 Probable fix: add INLINEABLE pragma on ‘PprCore.$fOutputableTickish_$cppr’
180
181compiler/cmm/CLabel.hs: warning:
182 Could not specialise imported function ‘Outputable.$fOutputableMaybe_$cppr’
183 Probable fix: add INLINEABLE pragma on ‘Outputable.$fOutputableMaybe_$cppr’
184
185compiler/cmm/CLabel.hs: warning:
186 Could not specialise imported function ‘mkUniqSet’
187 Probable fix: add INLINEABLE pragma on ‘mkUniqSet’
188
189compiler/coreSyn/CoreUtils.hs: warning:
190 Could not specialise imported function ‘CoreSyn.$fEqTickish_$c==’
191 Probable fix: add INLINEABLE pragma on ‘CoreSyn.$fEqTickish_$c==’
192
193compiler/coreSyn/CoreUtils.hs: warning:
194 Could not specialise imported function ‘tickishContains’
195 Probable fix: add INLINEABLE pragma on ‘tickishContains’
196
197compiler/coreSyn/CoreUtils.hs: warning:
198 Could not specialise imported function ‘PprCore.ppr_bind’
199 when specialising ‘PprCore.$fOutputableBind_$cppr’
200 Probable fix: add INLINEABLE pragma on ‘PprCore.ppr_bind’
201
202compiler/coreSyn/CoreUtils.hs: warning:
203 Could not specialise imported function ‘minusList’
204 Probable fix: add INLINEABLE pragma on ‘minusList’
205
206compiler/coreSyn/CoreUtils.hs: warning:
207 Could not specialise imported function ‘Outputable.$fOutputableIntMap_$cppr1’
208 Probable fix: add INLINEABLE pragma on ‘Outputable.$fOutputableIntMap_$cppr1’
209 HC [stage 1] compiler/stage2/build/StgStats.o
210 HC [stage 1] compiler/stage2/build/StgLint.o
211 HC [stage 1] compiler/stage2/build/SCCfinal.o
212 HC [stage 1] libraries/Cabal/Cabal/dist-install/build/Distribution/Simple/BuildPaths.o
213 HC [stage 1] libraries/Cabal/Cabal/dist-install/build/Distribution/Simple/Test/Log.o
214 HC [stage 1] libraries/Cabal/Cabal/dist-install/build/Distribution/Simple/Hpc.o
215
216compiler/profiling/SCCfinal.hs: warning:
217 Could not specialise imported function ‘Data.Traversable.$fTraversable[]_$cmapM’
218 Probable fix: add INLINEABLE pragma on ‘Data.Traversable.$fTraversable[]_$cmapM’
219
220compiler/stgSyn/StgLint.hs: warning:
221 Could not specialise imported function ‘mapM_’
222 Probable fix: add INLINEABLE pragma on ‘mapM_’
223
224compiler/stgSyn/StgLint.hs: warning:
225 Could not specialise imported function ‘Outputable.$fOutputableIntMap_$cppr1’
226 Probable fix: add INLINEABLE pragma on ‘Outputable.$fOutputableIntMap_$cppr1’
227
228compiler/stgSyn/StgLint.hs: warning:
229 Could not specialise imported function ‘Data.Traversable.$fTraversable[]_$cmapM’
230 Probable fix: add INLINEABLE pragma on ‘Data.Traversable.$fTraversable[]_$cmapM’
231 HC [stage 1] libraries/Cabal/Cabal/dist-install/build/Distribution/Simple/Program/Ar.o
232 HC [stage 1] libraries/Cabal/Cabal/dist-install/build/Distribution/Simple/BuildTarget.o
233 HC [stage 1] libraries/Cabal/Cabal/dist-install/build/Distribution/Simple/Build/Macros.o
234 HC [stage 1] compiler/stage2/build/OccurAnal.o
235 HC [stage 1] compiler/stage2/build/SAT.o
236 HC [stage 1] libraries/Cabal/Cabal/dist-install/build/Distribution/Simple/Build/PathsModule.o
237 HC [stage 1] libraries/Cabal/Cabal/dist-install/build/Distribution/Simple/HaskellSuite.o
238 HC [stage 1] libraries/Cabal/Cabal/dist-install/build/Distribution/Simple/UHC.o
239
240compiler/simplCore/OccurAnal.hs: warning:
241 Could not specialise imported function ‘listToUFM’
242 Probable fix: add INLINEABLE pragma on ‘listToUFM’
243
244compiler/simplCore/SAT.hs: warning:
245 Could not specialise imported function ‘Data.Traversable.$fTraversable[]_$cmapM’
246 Probable fix: add INLINEABLE pragma on ‘Data.Traversable.$fTraversable[]_$cmapM’
247 HC [stage 1] libraries/Cabal/Cabal/dist-install/build/Distribution/Simple/LHC.o
248 HC [stage 1] libraries/Cabal/Cabal/dist-install/build/Distribution/Simple/GHC/Internal.o
249 HC [stage 1] libraries/Cabal/Cabal/dist-install/build/Distribution/Simple/JHC.o
250 HC [stage 1] compiler/stage2/build/BlockId.o
251 HC [stage 1] compiler/stage2/build/ProfInit.o
252 HC [stage 1] compiler/stage2/build/StaticPtrTable.o
253 HC [stage 1] libraries/Cabal/Cabal/dist-install/build/Distribution/Simple/Test/LibV09.o
254
255compiler/cmm/BlockId.hs: warning:
256 Could not specialise imported function ‘Outputable.$fOutputableIntMap_$cppr1’
257 Probable fix: add INLINEABLE pragma on ‘Outputable.$fOutputableIntMap_$cppr1’
258 HC [stage 1] libraries/Cabal/Cabal/dist-install/build/Distribution/Simple/Test/ExeV10.o
259 HC [stage 1] compiler/stage2/build/CmmExpr.o
260 HC [stage 1] compiler/stage2/build/CoreSubst.o
261 HC [stage 1] libraries/Cabal/Cabal/dist-install/build/Distribution/Simple/PreProcess.o
262 HC [stage 1] libraries/Cabal/Cabal/dist-install/build/Distribution/Simple/GHCJS.o
263 HC [stage 1] libraries/Cabal/Cabal/dist-install/build/Distribution/Simple/GHC.o
264 HC [stage 1] compiler/stage2/build/IfaceSyn.o
265 HC [stage 1] compiler/stage2/build/HsPat.o
266
267compiler/coreSyn/CoreSubst.hs: warning:
268 Could not specialise imported function ‘Outputable.$fOutputableIntMap_$cppr1’
269 Probable fix: add INLINEABLE pragma on ‘Outputable.$fOutputableIntMap_$cppr1’
270 HC [stage 1] compiler/stage2/build/CodeGen/Platform/NoRegs.o
271 HC [stage 1] compiler/stage2/build/CodeGen/Platform/X86_64.o
272 HC [stage 1] compiler/stage2/build/CodeGen/Platform/X86.o
273 HC [stage 1] compiler/stage2/build/CodeGen/Platform/SPARC.o
274
275compiler/iface/IfaceSyn.hs: warning:
276 Could not specialise imported function ‘pprFundeps’
277 Probable fix: add INLINEABLE pragma on ‘pprFundeps’
278
279compiler/iface/IfaceSyn.hs: warning:
280 Could not specialise imported function ‘Annotations.$fOutputableAnnTarget_$cppr’
281 Probable fix: add INLINEABLE pragma on ‘Annotations.$fOutputableAnnTarget_$cppr’
282
283compiler/iface/IfaceSyn.hs: warning:
284 Could not specialise imported function ‘Outputable.$fOutputableIntMap_$cppr1’
285 Probable fix: add INLINEABLE pragma on ‘Outputable.$fOutputableIntMap_$cppr1’
286
287compiler/iface/IfaceSyn.hs: warning:
288 Could not specialise imported function ‘Outputable.$w$cppr1’
289 when specialising ‘Outputable.$fOutputable(,,)_$cppr’
290 Probable fix: add INLINEABLE pragma on ‘Outputable.$w$cppr1’
291
292compiler/iface/IfaceSyn.hs: warning:
293 Could not specialise imported function ‘find’
294 Probable fix: add INLINEABLE pragma on ‘find’
295 HC [stage 1] compiler/stage2/build/CodeGen/Platform/PPC_Darwin.o
296
297compiler/hsSyn/HsPat.hs: warning:
298 Could not specialise imported function ‘Data.Data.$fData[]_$cp1Data’
299 when specialising ‘Data.Data.$fData[]’
300 Probable fix: add INLINEABLE pragma on ‘Data.Data.$fData[]_$cp1Data’
301 HC [stage 1] compiler/stage2/build/CodeGen/Platform/PPC.o
302
303compiler/hsSyn/HsPat.hs: warning:
304 Could not specialise imported function ‘SrcLoc.$fDataGenLocated_$cgmapMo’
305 when specialising ‘SrcLoc.$fDataGenLocated’
306 Probable fix: add INLINEABLE pragma on ‘SrcLoc.$fDataGenLocated_$cgmapMo’
307
308compiler/hsSyn/HsPat.hs: warning:
309 Could not specialise imported function ‘SrcLoc.$fDataGenLocated_$cgmapMp’
310 when specialising ‘SrcLoc.$fDataGenLocated’
311 Probable fix: add INLINEABLE pragma on ‘SrcLoc.$fDataGenLocated_$cgmapMp’
312
313compiler/hsSyn/HsPat.hs: warning:
314 Could not specialise imported function ‘SrcLoc.$w$cgmapM’
315 when specialising ‘SrcLoc.$fDataGenLocated_$cgmapM’
316 when specialising ‘SrcLoc.$fDataGenLocated’
317 Probable fix: add INLINEABLE pragma on ‘SrcLoc.$w$cgmapM’
318
319compiler/hsSyn/HsPat.hs: warning:
320 Could not specialise imported function ‘Data.Data.$fDataMaybe_$cgmapMo’
321 when specialising ‘Data.Data.$fDataMaybe’
322 Probable fix: add INLINEABLE pragma on ‘Data.Data.$fDataMaybe_$cgmapMo’
323
324compiler/hsSyn/HsPat.hs: warning:
325 Could not specialise imported function ‘Data.Data.$fDataMaybe_$cgmapMp’
326 when specialising ‘Data.Data.$fDataMaybe’
327 Probable fix: add INLINEABLE pragma on ‘Data.Data.$fDataMaybe_$cgmapMp’
328
329compiler/hsSyn/HsPat.hs: warning:
330 Could not specialise imported function ‘Data.Data.$fDataMaybe_$cgmapM’
331 when specialising ‘Data.Data.$fDataMaybe’
332 Probable fix: add INLINEABLE pragma on ‘Data.Data.$fDataMaybe_$cgmapM’
333
334compiler/hsSyn/HsPat.hs: warning:
335 Could not specialise imported function ‘Data.Data.$w$cgunfold11’
336 when specialising ‘Data.Data.$fDataMaybe_$cgunfold’
337 when specialising ‘Data.Data.$fDataMaybe’
338 Probable fix: add INLINEABLE pragma on ‘Data.Data.$w$cgunfold11’
339
340compiler/hsSyn/HsPat.hs: warning:
341 Could not specialise imported function ‘Data.Data.$fDataMaybe_$cp1Data’
342 when specialising ‘Data.Data.$fDataMaybe’
343 Probable fix: add INLINEABLE pragma on ‘Data.Data.$fDataMaybe_$cp1Data’
344 HC [stage 1] compiler/stage2/build/CodeGen/Platform/ARM64.o
345
346compiler/hsSyn/HsPat.hs: warning:
347 Could not specialise imported function ‘SrcLoc.$w$cppr’
348 when specialising ‘SrcLoc.$fOutputableGenLocated_$cppr’
349 Probable fix: add INLINEABLE pragma on ‘SrcLoc.$w$cppr’
350 HC [stage 1] compiler/stage2/build/CodeGen/Platform/ARM.o
351 HC [stage 1] compiler/stage2/build/PprCmmExpr.o
352 HC [stage 1] compiler/stage2/build/LlvmCodeGen/Regs.o
353 HC [stage 1] compiler/stage2/build/CmmLex.o
354 HC [stage 1] compiler/stage2/build/CodeGen/Platform.o
355
356compiler/stage2/build/CmmLex.hs: warning:
357 Could not specialise imported function ‘readEither’
358 when specialising ‘read’
359 Probable fix: add INLINEABLE pragma on ‘readEither’
360
361compiler/stage2/build/CmmLex.hs: warning:
362 Could not specialise imported function ‘listToUFM’
363 Probable fix: add INLINEABLE pragma on ‘listToUFM’
364 HC [stage 1] libraries/Cabal/Cabal/dist-install/build/Distribution/Simple/UserHooks.o
365 HC [stage 1] libraries/Cabal/Cabal/dist-install/build/Distribution/Simple/SrcDist.o
366 HC [stage 1] compiler/stage2/build/CmmNode.o
367
368compiler/cmm/CmmNode.hs: warning:
369 Could not specialise imported function ‘CoreSyn.$fEqTickish_$c==’
370 Probable fix: add INLINEABLE pragma on ‘CoreSyn.$fEqTickish_$c==’
371 HC [stage 1] compiler/stage2/build/CoreArity.o
372 HC [stage 1] compiler/stage2/build/CSE.o
373 HC [stage 1] libraries/Cabal/Cabal/dist-install/build/Distribution/Simple/Test.o
374 HC [stage 1] libraries/Cabal/Cabal/dist-install/build/Distribution/Simple/Bench.o
375 HC [stage 1] compiler/stage2/build/HsDecls.o
376 HC [stage 1] compiler/stage2/build/Cmm.o
377 HC [stage 1] compiler/stage2/build/CoreUnfold.o
378 HC [stage 1] compiler/stage2/build/CoreTidy.o
379 HC [stage 1] compiler/stage2/build/CallArity.o
380 HC [stage 1] compiler/stage2/build/CmmUtils.o
381 HC [stage 1] compiler/stage2/build/PprCmmDecl.o
382 HC [stage 1] compiler/stage2/build/StgCmmClosure.o
383
384compiler/cmm/PprCmmDecl.hs: warning:
385 Could not specialise imported function ‘Outputable.$fOutputableIntMap_$cppr1’
386 Probable fix: add INLINEABLE pragma on ‘Outputable.$fOutputableIntMap_$cppr1’
387 HC [stage 1] compiler/stage2/build/LlvmCodeGen/Base.o
388
389compiler/cmm/CmmUtils.hs: warning:
390 Could not specialise imported function ‘addBlock’
391 Probable fix: add INLINEABLE pragma on ‘addBlock’
392
393compiler/coreSyn/CoreUnfold.hs: warning:
394 Could not specialise imported function ‘Outputable.$fOutputableIntMap_$cppr1’
395 Probable fix: add INLINEABLE pragma on ‘Outputable.$fOutputableIntMap_$cppr1’
396 HC [stage 1] compiler/stage2/build/X86/Regs.o
397 HC [stage 1] compiler/stage2/build/Format.o
398
399compiler/llvmGen/LlvmCodeGen/Base.hs: warning:
400 Could not specialise imported function ‘Data.Traversable.$fTraversable[]_$cmapM’
401 Probable fix: add INLINEABLE pragma on ‘Data.Traversable.$fTraversable[]_$cmapM’
402
403compiler/codeGen/StgCmmClosure.hs: warning:
404 Could not specialise imported function ‘getOccString’
405 Probable fix: add INLINEABLE pragma on ‘getOccString’
406
407compiler/codeGen/StgCmmClosure.hs: warning:
408 Could not specialise imported function ‘Outputable.$fOutputableIntMap_$cppr1’
409 Probable fix: add INLINEABLE pragma on ‘Outputable.$fOutputableIntMap_$cppr1’
410 HC [stage 1] compiler/stage2/build/Instruction.o
411 HC [stage 1] compiler/stage2/build/SPARC/Imm.o
412
413compiler/hsSyn/HsDecls.hs: warning:
414 Could not specialise imported function ‘Data.Data.$fData(,)_$cgmapMo’
415 when specialising ‘Data.Data.$fData(,)’
416 Probable fix: add INLINEABLE pragma on ‘Data.Data.$fData(,)_$cgmapMo’
417
418compiler/hsSyn/HsDecls.hs: warning:
419 Could not specialise imported function ‘Data.Data.$fData(,)_$cgmapMp’
420 when specialising ‘Data.Data.$fData(,)’
421 Probable fix: add INLINEABLE pragma on ‘Data.Data.$fData(,)_$cgmapMp’
422
423compiler/hsSyn/HsDecls.hs: warning:
424 Could not specialise imported function ‘Data.Data.$w$cgmapM’
425 when specialising ‘Data.Data.$fData(,)_$cgmapM’
426 when specialising ‘Data.Data.$fData(,)’
427 Probable fix: add INLINEABLE pragma on ‘Data.Data.$w$cgmapM’
428
429compiler/hsSyn/HsDecls.hs: warning:
430 Could not specialise imported function ‘Data.Data.$w$cgunfold’
431 when specialising ‘Data.Data.$fData(,)_$cgunfold’
432 when specialising ‘Data.Data.$fData(,)’
433 Probable fix: add INLINEABLE pragma on ‘Data.Data.$w$cgunfold’
434
435compiler/hsSyn/HsDecls.hs: warning:
436 Could not specialise imported function ‘SrcLoc.$fDataGenLocated_$cgmapMo’
437 when specialising ‘SrcLoc.$fDataGenLocated’
438 Probable fix: add INLINEABLE pragma on ‘SrcLoc.$fDataGenLocated_$cgmapMo’
439
440compiler/hsSyn/HsDecls.hs: warning:
441 Could not specialise imported function ‘SrcLoc.$fDataGenLocated_$cgmapMp’
442 when specialising ‘SrcLoc.$fDataGenLocated’
443 Probable fix: add INLINEABLE pragma on ‘SrcLoc.$fDataGenLocated_$cgmapMp’
444
445compiler/hsSyn/HsDecls.hs: warning:
446 Could not specialise imported function ‘SrcLoc.$w$cgmapM’
447 when specialising ‘SrcLoc.$fDataGenLocated_$cgmapM’
448 when specialising ‘SrcLoc.$fDataGenLocated’
449 Probable fix: add INLINEABLE pragma on ‘SrcLoc.$w$cgmapM’
450
451compiler/hsSyn/HsDecls.hs: warning:
452 Could not specialise imported function ‘Data.Data.$fDataMaybe_$cgmapMo’
453 when specialising ‘Data.Data.$fDataMaybe’
454 Probable fix: add INLINEABLE pragma on ‘Data.Data.$fDataMaybe_$cgmapMo’
455
456compiler/hsSyn/HsDecls.hs: warning:
457 Could not specialise imported function ‘Data.Data.$fDataMaybe_$cgmapMp’
458 when specialising ‘Data.Data.$fDataMaybe’
459 Probable fix: add INLINEABLE pragma on ‘Data.Data.$fDataMaybe_$cgmapMp’
460
461compiler/hsSyn/HsDecls.hs: warning:
462 Could not specialise imported function ‘Data.Data.$fDataMaybe_$cgmapM’
463 when specialising ‘Data.Data.$fDataMaybe’
464 Probable fix: add INLINEABLE pragma on ‘Data.Data.$fDataMaybe_$cgmapM’
465
466compiler/hsSyn/HsDecls.hs: warning:
467 Could not specialise imported function ‘Data.Data.$w$cgunfold11’
468 when specialising ‘Data.Data.$fDataMaybe_$cgunfold’
469 when specialising ‘Data.Data.$fDataMaybe’
470 Probable fix: add INLINEABLE pragma on ‘Data.Data.$w$cgunfold11’
471
472compiler/hsSyn/HsDecls.hs: warning:
473 Could not specialise imported function ‘Data.Data.$fDataMaybe_$cp1Data’
474 when specialising ‘Data.Data.$fDataMaybe’
475 Probable fix: add INLINEABLE pragma on ‘Data.Data.$fDataMaybe_$cp1Data’
476
477compiler/hsSyn/HsDecls.hs: warning:
478 Could not specialise imported function ‘SrcLoc.$w$cppr’
479 when specialising ‘SrcLoc.$fOutputableGenLocated_$cppr’
480 Probable fix: add INLINEABLE pragma on ‘SrcLoc.$w$cppr’
481 HC [stage 1] libraries/Cabal/Cabal/dist-install/build/Distribution/Simple/Register.o
482 HC [stage 1] libraries/Cabal/Cabal/dist-install/build/Distribution/Simple/Install.o
483 HC [stage 1] libraries/Cabal/Cabal/dist-install/build/Distribution/Simple/Configure.o
484 HC [stage 1] compiler/stage2/build/Rules.o
485 HC [stage 1] compiler/stage2/build/Dwarf/Constants.o
486 HC [stage 1] compiler/stage2/build/SPARC/Regs.o
487
488compiler/specialise/Rules.hs: warning:
489 Could not specialise imported function ‘Outputable.$fOutputableIntMap_$cppr1’
490 Probable fix: add INLINEABLE pragma on ‘Outputable.$fOutputableIntMap_$cppr1’
491 HC [stage 1] compiler/stage2/build/PPC/Regs.o
492 HC [stage 1] compiler/stage2/build/X86/RegInfo.o
493 HC [stage 1] compiler/stage2/build/RegAlloc/Linear/X86_64/FreeRegs.o
494
495compiler/nativeGen/X86/RegInfo.hs: warning:
496 Could not specialise imported function ‘listToUFM’
497 Probable fix: add INLINEABLE pragma on ‘listToUFM’
498 HC [stage 1] compiler/stage2/build/RegAlloc/Linear/X86/FreeRegs.o
499 HC [stage 1] compiler/stage2/build/SPARC/AddrMode.o
500 HC [stage 1] compiler/stage2/build/LiberateCase.o
501 HC [stage 1] libraries/Cabal/Cabal/dist-install/build/Distribution/Simple/Build.o
502 HC [stage 1] compiler/stage2/build/CmmInfo.o
503 HC [stage 1] compiler/stage2/build/PprCmm.o
504 HC [stage 1] compiler/stage2/build/StgCmmArgRep.o
505
506compiler/cmm/CmmInfo.hs: warning:
507 Could not specialise imported function ‘Data.Traversable.$fTraversable[]_$cmapM’
508 Probable fix: add INLINEABLE pragma on ‘Data.Traversable.$fTraversable[]_$cmapM’
509
510compiler/cmm/CmmInfo.hs: warning:
511 Could not specialise imported function ‘concatMapM’
512 Probable fix: add INLINEABLE pragma on ‘concatMapM’
513 HC [stage 1] compiler/stage2/build/CgUtils.o
514 HC [stage 1] compiler/stage2/build/LlvmCodeGen/Data.o
515
516compiler/cmm/PprCmm.hs: warning:
517 Could not specialise imported function ‘BlockId.$fOutputableLabelMap_$cppr’
518 Probable fix: add INLINEABLE pragma on ‘BlockId.$fOutputableLabelMap_$cppr’
519
520compiler/cmm/PprCmm.hs: warning:
521 Could not specialise imported function ‘Outputable.$fOutputableMaybe_$cppr’
522 Probable fix: add INLINEABLE pragma on ‘Outputable.$fOutputableMaybe_$cppr’
523
524compiler/cmm/PprCmm.hs: warning:
525 Could not specialise imported function ‘Outputable.$fOutputableIntMap_$cppr1’
526 Probable fix: add INLINEABLE pragma on ‘Outputable.$fOutputableIntMap_$cppr1’
527
528compiler/cmm/PprCmm.hs: warning:
529 Could not specialise imported function ‘PprCore.$fOutputableTickish_$cppr’
530 Probable fix: add INLINEABLE pragma on ‘PprCore.$fOutputableTickish_$cppr’
531 HC [stage 1] compiler/stage2/build/CmmLive.o
532 HC [stage 1] compiler/stage2/build/CmmOpt.o
533
534compiler/cmm/CmmLive.hs: warning:
535 Could not specialise imported function ‘CmmUtils.$wdataflowAnalBwd’
536 when specialising ‘dataflowAnalBwd’
537 Probable fix: add INLINEABLE pragma on ‘CmmUtils.$wdataflowAnalBwd’
538
539compiler/cmm/CmmLive.hs: warning:
540 Could not specialise imported function ‘hoopl-3.10.0.2:Compiler.Hoopl.XUtil.$wjoinOutFacts’
541 when specialising ‘joinOutFacts’
542 Probable fix: add INLINEABLE pragma on ‘hoopl-3.10.0.2:Compiler.Hoopl.XUtil.$wjoinOutFacts’
543
544compiler/cmm/CmmLive.hs: warning:
545 Could not specialise imported function ‘Outputable.$fOutputableSet_$cppr’
546 Probable fix: add INLINEABLE pragma on ‘Outputable.$fOutputableSet_$cppr’
547
548compiler/llvmGen/LlvmCodeGen/Data.hs: warning:
549 Could not specialise imported function ‘Data.Traversable.$fTraversable[]_$cmapM’
550 Probable fix: add INLINEABLE pragma on ‘Data.Traversable.$fTraversable[]_$cmapM’
551 HC [stage 1] compiler/stage2/build/Debug.o
552 HC [stage 1] compiler/stage2/build/TargetReg.o
553
554compiler/cmm/Debug.hs: warning:
555 Could not specialise imported function ‘mapUnions’
556 Probable fix: add INLINEABLE pragma on ‘mapUnions’
557
558compiler/cmm/Debug.hs: warning:
559 Could not specialise imported function ‘tickishContains’
560 Probable fix: add INLINEABLE pragma on ‘tickishContains’
561
562compiler/cmm/Debug.hs: warning:
563 Could not specialise imported function ‘Outputable.$fOutputableIntMap_$cppr1’
564 Probable fix: add INLINEABLE pragma on ‘Outputable.$fOutputableIntMap_$cppr1’
565
566compiler/cmm/Debug.hs: warning:
567 Could not specialise imported function ‘PprCore.$fOutputableTickish_$cppr’
568 Probable fix: add INLINEABLE pragma on ‘PprCore.$fOutputableTickish_$cppr’
569
570compiler/cmm/Debug.hs: warning:
571 Could not specialise imported function ‘minimumBy’
572 Probable fix: add INLINEABLE pragma on ‘minimumBy’
573 HC [stage 1] compiler/stage2/build/RegAlloc/Linear/SPARC/FreeRegs.o
574 HC [stage 1] compiler/stage2/build/RegAlloc/Linear/PPC/FreeRegs.o
575 HC [stage 1] compiler/stage2/build/SPARC/Stack.o
576 HC [stage 1] compiler/stage2/build/CmmContFlowOpt.o
577*** Core Lint warnings : in result of CorePrep ***
578<no location info>: warning:
579 [RHS of link_sfq4 :: DebugBlock -> DebugBlock]
580 INLINE binder is (non-rule) loop breaker: link_sfq4
581
582 HC [stage 1] compiler/stage2/build/CmmImplementSwitchPlans.o
583*** Core Lint warnings : in result of CorePrep ***
584<no location info>: warning:
585 [RHS of link_shRK :: DebugBlock -> DebugBlock]
586 INLINE binder is (non-rule) loop breaker: link_shRK
587
588 HC [stage 1] libraries/Cabal/Cabal/dist-install/build/Distribution/Simple/Haddock.o
589 HC [stage 1] compiler/stage2/build/CmmCallConv.o
590
591compiler/cmm/CmmContFlowOpt.hs: warning:
592 Could not specialise imported function ‘addBlock’
593 Probable fix: add INLINEABLE pragma on ‘addBlock’
594 HC [stage 1] compiler/stage2/build/LlvmCodeGen/Ppr.o
595
596compiler/cmm/CmmImplementSwitchPlans.hs: warning:
597 Could not specialise imported function ‘Data.Traversable.$fTraversable[]_$cmapM’
598 Probable fix: add INLINEABLE pragma on ‘Data.Traversable.$fTraversable[]_$cmapM’
599 HC [stage 1] compiler/stage2/build/LlvmCodeGen/CodeGen.o
600 HC [stage 1] compiler/stage2/build/CmmLint.o
601 HC [stage 1] compiler/stage2/build/PprC.o
602
603compiler/llvmGen/LlvmCodeGen/Ppr.hs: warning:
604 Could not specialise imported function ‘Data.Traversable.$fTraversable[]_$cmapM’
605 Probable fix: add INLINEABLE pragma on ‘Data.Traversable.$fTraversable[]_$cmapM’
606
607compiler/cmm/CmmLint.hs: warning:
608 Could not specialise imported function ‘mapM_’
609 Probable fix: add INLINEABLE pragma on ‘mapM_’
610
611compiler/cmm/CmmLint.hs: warning:
612 Could not specialise imported function ‘Outputable.$fOutputableIntMap_$cppr1’
613 Probable fix: add INLINEABLE pragma on ‘Outputable.$fOutputableIntMap_$cppr1’
614
615compiler/cmm/CmmLint.hs: warning:
616 Could not specialise imported function ‘Data.Traversable.$fTraversable[]_$cmapM’
617 Probable fix: add INLINEABLE pragma on ‘Data.Traversable.$fTraversable[]_$cmapM’
618
619compiler/llvmGen/LlvmCodeGen/CodeGen.hs: warning:
620 Could not specialise imported function ‘Data.Traversable.$fTraversable[]_$cmapM’
621 Probable fix: add INLINEABLE pragma on ‘Data.Traversable.$fTraversable[]_$cmapM’
622 HC [stage 1] compiler/stage2/build/Dwarf/Types.o
623
624compiler/cmm/PprC.hs: warning:
625 Could not specialise imported function ‘mapM_’
626 Probable fix: add INLINEABLE pragma on ‘mapM_’
627 HC [stage 1] compiler/stage2/build/NCGMonad.o
628 HC [stage 1] compiler/stage2/build/X86/Instr.o
629
630compiler/nativeGen/Dwarf/Types.hs: warning:
631 Could not specialise imported function ‘containers-0.5.6.2:Data.Map.Base.$fEqMap_$c==’
632 Probable fix: add INLINEABLE pragma on ‘containers-0.5.6.2:Data.Map.Base.$fEqMap_$c==’
633 HC [stage 1] compiler/stage2/build/RegAlloc/Liveness.o
634 HC [stage 1] compiler/stage2/build/SPARC/Instr.o
635
636compiler/nativeGen/X86/Instr.hs: warning:
637 Could not specialise imported function ‘Data.Traversable.$fTraversable[]_$csequenceA’
638 when specialising ‘Data.Traversable.$fTraversable[]_$csequence’
639 when specialising ‘replicateM’
640 Probable fix: add INLINEABLE pragma on ‘Data.Traversable.$fTraversable[]_$csequenceA’
641 HC [stage 1] compiler/stage2/build/CmmSink.o
642
643compiler/nativeGen/RegAlloc/Liveness.hs: warning:
644 Could not specialise imported function ‘mapM_’
645 Probable fix: add INLINEABLE pragma on ‘mapM_’
646
647compiler/nativeGen/RegAlloc/Liveness.hs: warning:
648 Could not specialise imported function ‘BlockId.$fOutputableLabelMap_$cppr’
649 when specialising ‘BlockId.$fOutputableLabelMap_$cpprPrec’
650 when specialising ‘BlockId.$fOutputableLabelMap’
651 Probable fix: add INLINEABLE pragma on ‘BlockId.$fOutputableLabelMap_$cppr’
652
653compiler/nativeGen/RegAlloc/Liveness.hs: warning:
654 Could not specialise imported function ‘BlockId.$fOutputableLabelMap_$cppr’
655 when specialising ‘BlockId.$fOutputableLabelMap’
656 Probable fix: add INLINEABLE pragma on ‘BlockId.$fOutputableLabelMap_$cppr’
657
658compiler/nativeGen/RegAlloc/Liveness.hs: warning:
659 Could not specialise imported function ‘BlockId.$fOutputableLabelMap_$cppr’
660 Probable fix: add INLINEABLE pragma on ‘BlockId.$fOutputableLabelMap_$cppr’
661
662compiler/nativeGen/RegAlloc/Liveness.hs: warning:
663 Could not specialise imported function ‘ghc-prim-0.4.0.0:GHC.Classes.$w$c/=’
664 when specialising ‘ghc-prim-0.4.0.0:GHC.Classes.$fEq(,)_$c/=’
665 when specialising ‘ghc-prim-0.4.0.0:GHC.Classes.$fEq(,)’
666 Probable fix: add INLINEABLE pragma on ‘ghc-prim-0.4.0.0:GHC.Classes.$w$c/=’
667
668compiler/nativeGen/RegAlloc/Liveness.hs: warning:
669 Could not specialise imported function ‘ghc-prim-0.4.0.0:GHC.Classes.$w$c==’
670 when specialising ‘ghc-prim-0.4.0.0:GHC.Classes.$fEq(,)_$c==’
671 when specialising ‘ghc-prim-0.4.0.0:GHC.Classes.$fEq(,)’
672 Probable fix: add INLINEABLE pragma on ‘ghc-prim-0.4.0.0:GHC.Classes.$w$c==’
673
674compiler/nativeGen/RegAlloc/Liveness.hs: warning:
675 Could not specialise imported function ‘Data.Traversable.$fTraversable[]_$cmapM’
676 Probable fix: add INLINEABLE pragma on ‘Data.Traversable.$fTraversable[]_$cmapM’
677
678compiler/nativeGen/RegAlloc/Liveness.hs: warning:
679 Could not specialise imported function ‘Outputable.$fOutputableMaybe_$cppr’
680 Probable fix: add INLINEABLE pragma on ‘Outputable.$fOutputableMaybe_$cppr’
681
682compiler/nativeGen/RegAlloc/Liveness.hs: warning:
683 Could not specialise imported function ‘Outputable.$fOutputableIntMap_$cppr1’
684 Probable fix: add INLINEABLE pragma on ‘Outputable.$fOutputableIntMap_$cppr1’
685
686compiler/nativeGen/RegAlloc/Liveness.hs: warning:
687 Could not specialise imported function ‘mkUniqSet’
688 Probable fix: add INLINEABLE pragma on ‘mkUniqSet’
689
690compiler/nativeGen/RegAlloc/Liveness.hs: warning:
691 Could not specialise imported function ‘delListFromUFM’
692 when specialising ‘delListFromUniqSet’
693 Probable fix: add INLINEABLE pragma on ‘delListFromUFM’
694
695compiler/nativeGen/RegAlloc/Liveness.hs: warning:
696 Could not specialise imported function ‘addListToUniqSet’
697 Probable fix: add INLINEABLE pragma on ‘addListToUniqSet’
698
699compiler/nativeGen/RegAlloc/Liveness.hs: warning:
700 Could not specialise imported function ‘listToUFM’
701 Probable fix: add INLINEABLE pragma on ‘listToUFM’
702
703compiler/nativeGen/RegAlloc/Liveness.hs: warning:
704 Could not specialise imported function ‘containers-0.5.6.2:Data.Map.Base.$fShowMap_$cshow’
705 Probable fix: add INLINEABLE pragma on ‘containers-0.5.6.2:Data.Map.Base.$fShowMap_$cshow’
706
707compiler/nativeGen/RegAlloc/Liveness.hs: warning:
708 Could not specialise imported function ‘containers-0.5.6.2:Data.Set.Base.$w$cshowsPrec’
709 when specialising ‘containers-0.5.6.2:Data.Set.Base.$fShowSet_$cshowsPrec’
710 when specialising ‘containers-0.5.6.2:Data.Set.Base.$fShowSet_$cshowList’
711 when specialising ‘containers-0.5.6.2:Data.Set.Base.$fShowSet’
712 Probable fix: add INLINEABLE pragma on ‘containers-0.5.6.2:Data.Set.Base.$w$cshowsPrec’
713 HC [stage 1] compiler/stage2/build/CmmCommonBlockElim.o
714 HC [stage 1] libraries/Cabal/Cabal/dist-install/build/Distribution/Simple.o
715
716compiler/cmm/CmmCommonBlockElim.hs: warning:
717 Could not specialise imported function ‘find’
718 Probable fix: add INLINEABLE pragma on ‘find’
719
720compiler/cmm/CmmCommonBlockElim.hs: warning:
721 Could not specialise imported function ‘GHC.Real.$w$s$cproperFraction’
722 when specialising ‘GHC.Real.$fEnumRatio_$s$cproperFraction’
723 when specialising ‘GHC.Real.$fRealFracRatio_$s$ctruncate’
724 Probable fix: add INLINEABLE pragma on ‘GHC.Real.$w$s$cproperFraction’
725 HC [stage 1] compiler/stage2/build/MkGraph.o
726 HC [stage 1] compiler/stage2/build/PPC/Instr.o
727 HC [stage 1] compiler/stage2/build/SPARC/Ppr.o
728 HC [stage 1] compiler/stage2/build/SPARC/ShortcutJump.o
729
730compiler/cmm/MkGraph.hs: warning:
731 Could not specialise imported function ‘addBlock’
732 Probable fix: add INLINEABLE pragma on ‘addBlock’
733
734compiler/nativeGen/PPC/Instr.hs: warning:
735 Could not specialise imported function ‘listToUFM’
736 Probable fix: add INLINEABLE pragma on ‘listToUFM’
737
738compiler/nativeGen/PPC/Instr.hs: warning:
739 Could not specialise imported function ‘Data.Traversable.$fTraversable[]_$csequenceA’
740 when specialising ‘Data.Traversable.$fTraversable[]_$csequence’
741 when specialising ‘replicateM’
742 Probable fix: add INLINEABLE pragma on ‘Data.Traversable.$fTraversable[]_$csequenceA’
743
744compiler/nativeGen/SPARC/Ppr.hs: warning:
745 Could not specialise imported function ‘largeOffsetError’
746 Probable fix: add INLINEABLE pragma on ‘largeOffsetError’
747 HC [stage 1] compiler/stage2/build/SPARC/CodeGen/Base.o
748 HC [stage 1] compiler/stage2/build/X86/Ppr.o
749 HC [stage 1] compiler/stage2/build/CmmProcPoint.o
750 HC [stage 1] compiler/stage2/build/CmmBuildInfoTables.o
751
752compiler/cmm/CmmProcPoint.hs: warning:
753 Could not specialise imported function ‘CmmUtils.$wdataflowAnalFwdBlocks’
754 when specialising ‘dataflowAnalFwdBlocks’
755 Probable fix: add INLINEABLE pragma on ‘CmmUtils.$wdataflowAnalFwdBlocks’
756
757compiler/cmm/CmmProcPoint.hs: warning:
758 Could not specialise imported function ‘labelsDefined’
759 Probable fix: add INLINEABLE pragma on ‘labelsDefined’
760 AR libraries/Cabal/Cabal/dist-install/build/libHSCabal-1.23.0.0.a
761/usr/bin/ar: creating libraries/Cabal/Cabal/dist-install/build/libHSCabal-1.23.0.0.a
762 HC [stage 1] compiler/stage2/build/StgCmmMonad.o
763
764compiler/cmm/CmmBuildInfoTables.hs: warning:
765 Could not specialise imported function ‘hoopl-3.10.0.2:Compiler.Hoopl.XUtil.$wjoinOutFacts’
766 when specialising ‘joinOutFacts’
767 Probable fix: add INLINEABLE pragma on ‘hoopl-3.10.0.2:Compiler.Hoopl.XUtil.$wjoinOutFacts’
768
769compiler/cmm/CmmBuildInfoTables.hs: warning:
770 Could not specialise imported function ‘CmmUtils.$wdataflowAnalBwd’
771 when specialising ‘dataflowAnalBwd’
772 Probable fix: add INLINEABLE pragma on ‘CmmUtils.$wdataflowAnalBwd’
773
774compiler/cmm/CmmBuildInfoTables.hs: warning:
775 Could not specialise imported function ‘Outputable.$fOutputableMap_$cppr’
776 Probable fix: add INLINEABLE pragma on ‘Outputable.$fOutputableMap_$cppr’
777
778compiler/cmm/CmmBuildInfoTables.hs: warning:
779 Could not specialise imported function ‘Outputable.$fOutputableIntMap_$cppr1’
780 Probable fix: add INLINEABLE pragma on ‘Outputable.$fOutputableIntMap_$cppr1’
781 HC [stage 1] compiler/stage2/build/PIC.o
782 HC [stage 1] compiler/stage2/build/RegAlloc/Graph/SpillCost.o
783 HC [stage 1] compiler/stage2/build/RegAlloc/Graph/Spill.o
784
785compiler/nativeGen/RegAlloc/Graph/SpillCost.hs: warning:
786 Could not specialise imported function ‘mapM_’
787 Probable fix: add INLINEABLE pragma on ‘mapM_’
788
789compiler/nativeGen/RegAlloc/Graph/SpillCost.hs: warning:
790 Could not specialise imported function ‘listToUFM’
791 Probable fix: add INLINEABLE pragma on ‘listToUFM’
792
793compiler/nativeGen/RegAlloc/Graph/SpillCost.hs: warning:
794 Could not specialise imported function ‘minimumBy’
795 Probable fix: add INLINEABLE pragma on ‘minimumBy’
796
797compiler/nativeGen/RegAlloc/Graph/Spill.hs: warning:
798 Could not specialise imported function ‘Data.Traversable.$fTraversable[]_$cmapM’
799 Probable fix: add INLINEABLE pragma on ‘Data.Traversable.$fTraversable[]_$cmapM’
800
801compiler/nativeGen/RegAlloc/Graph/Spill.hs: warning:
802 Could not specialise imported function ‘mapSCCM’
803 Probable fix: add INLINEABLE pragma on ‘mapSCCM’
804
805compiler/nativeGen/RegAlloc/Graph/Spill.hs: warning:
806 Could not specialise imported function ‘listToUFM’
807 Probable fix: add INLINEABLE pragma on ‘listToUFM’
808
809compiler/nativeGen/RegAlloc/Graph/Spill.hs: warning:
810 Could not specialise imported function ‘mkUniqSet’
811 Probable fix: add INLINEABLE pragma on ‘mkUniqSet’
812
813compiler/nativeGen/RegAlloc/Graph/Spill.hs: warning:
814 Could not specialise imported function ‘\\’
815 Probable fix: add INLINEABLE pragma on ‘\\’
816 HC [stage 1] compiler/stage2/build/RegAlloc/Graph/SpillClean.o
817
818compiler/nativeGen/RegAlloc/Graph/SpillClean.hs: warning:
819 Could not specialise imported function ‘mapM_’
820 Probable fix: add INLINEABLE pragma on ‘mapM_’
821
822compiler/nativeGen/RegAlloc/Graph/SpillClean.hs: warning:
823 Could not specialise imported function ‘ghc-prim-0.4.0.0:GHC.Classes.$w$c/=’
824 when specialising ‘ghc-prim-0.4.0.0:GHC.Classes.$fEq(,)_$c/=’
825 when specialising ‘ghc-prim-0.4.0.0:GHC.Classes.$fEq(,)’
826 Probable fix: add INLINEABLE pragma on ‘ghc-prim-0.4.0.0:GHC.Classes.$w$c/=’
827
828compiler/nativeGen/RegAlloc/Graph/SpillClean.hs: warning:
829 Could not specialise imported function ‘ghc-prim-0.4.0.0:GHC.Classes.$w$c==’
830 when specialising ‘ghc-prim-0.4.0.0:GHC.Classes.$fEq(,)_$c==’
831 when specialising ‘ghc-prim-0.4.0.0:GHC.Classes.$fEq(,)’
832 Probable fix: add INLINEABLE pragma on ‘ghc-prim-0.4.0.0:GHC.Classes.$w$c==’
833
834compiler/nativeGen/RegAlloc/Graph/SpillClean.hs: warning:
835 Could not specialise imported function ‘Data.Traversable.$fTraversable[]_$cmapM’
836 Probable fix: add INLINEABLE pragma on ‘Data.Traversable.$fTraversable[]_$cmapM’
837
838compiler/nativeGen/RegAlloc/Graph/SpillClean.hs: warning:
839 Could not specialise imported function ‘mapSCCM’
840 Probable fix: add INLINEABLE pragma on ‘mapSCCM’
841
842compiler/nativeGen/RegAlloc/Graph/SpillClean.hs: warning:
843 Could not specialise imported function ‘mapBlockTopM’
844 Probable fix: add INLINEABLE pragma on ‘mapBlockTopM’
845
846compiler/nativeGen/RegAlloc/Graph/SpillClean.hs: warning:
847 Could not specialise imported function ‘find’
848 Probable fix: add INLINEABLE pragma on ‘find’
849 HC [stage 1] compiler/stage2/build/RegAlloc/Linear/FreeRegs.o
850 HC [stage 1] compiler/stage2/build/RegAlloc/Linear/Base.o
851 HC [stage 1] compiler/stage2/build/PPC/Ppr.o
852 HC [stage 1] compiler/stage2/build/PPC/RegInfo.o
853 HC [stage 1] compiler/stage2/build/SPARC/CodeGen/Expand.o
854 HC [stage 1] compiler/stage2/build/SPARC/CodeGen/Gen32.o-boot
855
856compiler/nativeGen/PPC/Ppr.hs: warning:
857 Could not specialise imported function ‘fits16Bits’
858 Probable fix: add INLINEABLE pragma on ‘fits16Bits’
859 HC [stage 1] compiler/stage2/build/SPARC/CodeGen/Sanity.o
860 HC [stage 1] compiler/stage2/build/RegAlloc/Graph/Coalesce.o
861 HC [stage 1] libraries/Cabal/Cabal/dist-install/build/libHSCabal-1.23.0.0-ghc7.11.20151022.so
862Warning: -rtsopts and -with-rtsopts have no effect with -shared.
863 Call hs_init_ghc() from your main() function to set these options.
864 HC [stage 1] utils/ghc-cabal/dist-install/build/Main.dyn_o
865
866compiler/nativeGen/SPARC/CodeGen/Sanity.hs: warning:
867 Could not specialise imported function ‘Cmm.pprBBlock1’
868 when specialising ‘pprBBlock’
869 Probable fix: add INLINEABLE pragma on ‘Cmm.pprBBlock1’
870 HC [stage 1] compiler/stage2/build/StgCmmUtils.o
871 HC [stage 1] compiler/stage2/build/LlvmCodeGen.o
872 HC [stage 1] compiler/stage2/build/Dwarf.o
873 HC [stage 1] compiler/stage2/build/RegAlloc/Graph/Stats.o
874
875compiler/llvmGen/LlvmCodeGen.hs: warning:
876 Could not specialise imported function ‘mapM_’
877 Probable fix: add INLINEABLE pragma on ‘mapM_’
878
879compiler/llvmGen/LlvmCodeGen.hs: warning:
880 Could not specialise imported function ‘ghc-prim-0.4.0.0:GHC.Classes.$w$c/=’
881 when specialising ‘ghc-prim-0.4.0.0:GHC.Classes.$fEq(,)_$c/=’
882 Probable fix: add INLINEABLE pragma on ‘ghc-prim-0.4.0.0:GHC.Classes.$w$c/=’
883
884compiler/llvmGen/LlvmCodeGen.hs: warning:
885 Could not specialise imported function ‘Stream.collect’
886 Probable fix: add INLINEABLE pragma on ‘Stream.collect’
887
888compiler/llvmGen/LlvmCodeGen.hs: warning:
889 Could not specialise imported function ‘BlockId.$fOutputableLabelMap_$cppr’
890 when specialising ‘BlockId.$fOutputableLabelMap’
891 Probable fix: add INLINEABLE pragma on ‘BlockId.$fOutputableLabelMap_$cppr’
892
893compiler/llvmGen/LlvmCodeGen.hs: warning:
894 Could not specialise imported function ‘BlockId.$fOutputableLabelMap_$cppr’
895 when specialising ‘BlockId.$fOutputableLabelMap_$cpprPrec’
896 when specialising ‘BlockId.$fOutputableLabelMap’
897 Probable fix: add INLINEABLE pragma on ‘BlockId.$fOutputableLabelMap_$cppr’
898
899compiler/llvmGen/LlvmCodeGen.hs: warning:
900 Could not specialise imported function ‘Data.Traversable.$fTraversable[]_$cmapM’
901 Probable fix: add INLINEABLE pragma on ‘Data.Traversable.$fTraversable[]_$cmapM’
902
903compiler/codeGen/StgCmmUtils.hs: warning:
904 Could not specialise imported function ‘mapM_’
905 Probable fix: add INLINEABLE pragma on ‘mapM_’
906
907compiler/codeGen/StgCmmUtils.hs: warning:
908 Could not specialise imported function ‘Data.Traversable.$fTraversable[]_$cmapM’
909 Probable fix: add INLINEABLE pragma on ‘Data.Traversable.$fTraversable[]_$cmapM’
910 HC [stage 1] compiler/stage2/build/RegAlloc/Linear/Stats.o
911
912compiler/nativeGen/RegAlloc/Graph/Stats.hs: warning:
913 Could not specialise imported function ‘Data.Traversable.$fTraversable[]_$cmapM’
914 Probable fix: add INLINEABLE pragma on ‘Data.Traversable.$fTraversable[]_$cmapM’
915
916compiler/nativeGen/RegAlloc/Graph/Stats.hs: warning:
917 Could not specialise imported function ‘mapBlockTopM’
918 Probable fix: add INLINEABLE pragma on ‘mapBlockTopM’
919
920compiler/nativeGen/RegAlloc/Graph/Stats.hs: warning:
921 Could not specialise imported function ‘Outputable.$w$cppr1’
922 when specialising ‘Outputable.$fOutputable(,,)_$cppr’
923 Probable fix: add INLINEABLE pragma on ‘Outputable.$w$cppr1’
924
925compiler/nativeGen/RegAlloc/Graph/Stats.hs: warning:
926 Could not specialise imported function ‘Outputable.$w$cppr’
927 when specialising ‘Outputable.$fOutputable(,)_$cppr’
928 Probable fix: add INLINEABLE pragma on ‘Outputable.$w$cppr’
929
930compiler/nativeGen/RegAlloc/Graph/Stats.hs: warning:
931 Could not specialise imported function ‘addListToUFM_C’
932 Probable fix: add INLINEABLE pragma on ‘addListToUFM_C’
933
934compiler/nativeGen/RegAlloc/Graph/Stats.hs: warning:
935 Could not specialise imported function ‘BlockId.$fOutputableLabelMap_$cppr’
936 when specialising ‘BlockId.$fOutputableLabelMap’
937 Probable fix: add INLINEABLE pragma on ‘BlockId.$fOutputableLabelMap_$cppr’
938
939compiler/nativeGen/RegAlloc/Graph/Stats.hs: warning:
940 Could not specialise imported function ‘BlockId.$fOutputableLabelMap_$cppr’
941 when specialising ‘BlockId.$fOutputableLabelMap_$cpprPrec’
942 when specialising ‘BlockId.$fOutputableLabelMap’
943 Probable fix: add INLINEABLE pragma on ‘BlockId.$fOutputableLabelMap_$cppr’
944
945compiler/nativeGen/RegAlloc/Linear/Stats.hs: warning:
946 Could not specialise imported function ‘mapM_’
947 Probable fix: add INLINEABLE pragma on ‘mapM_’
948
949compiler/nativeGen/RegAlloc/Linear/Stats.hs: warning:
950 Could not specialise imported function ‘mapGenBlockTopM’
951 Probable fix: add INLINEABLE pragma on ‘mapGenBlockTopM’
952
953compiler/nativeGen/RegAlloc/Linear/Stats.hs: warning:
954 Could not specialise imported function ‘addListToUFM_C’
955 Probable fix: add INLINEABLE pragma on ‘addListToUFM_C’
956 HC [stage 1] compiler/stage2/build/PPC/CodeGen.o
957 HC [stage 1] compiler/stage2/build/SPARC/CodeGen/Amode.o
958 HC [stage 1] compiler/stage2/build/SPARC/CodeGen/CondCode.o
959 HC [stage 1] compiler/stage2/build/X86/CodeGen.o
960
961compiler/nativeGen/PPC/CodeGen.hs: warning:
962 Could not specialise imported function ‘Data.Traversable.$fTraversable[]_$csequenceA’
963 when specialising ‘Data.Traversable.$fTraversable[]_$csequence’
964 when specialising ‘mapAndUnzipM’
965 Probable fix: add INLINEABLE pragma on ‘Data.Traversable.$fTraversable[]_$csequenceA’
966
967compiler/nativeGen/PPC/CodeGen.hs: warning:
968 Could not specialise imported function ‘Data.Traversable.$fTraversable[]_$cmapM’
969 Probable fix: add INLINEABLE pragma on ‘Data.Traversable.$fTraversable[]_$cmapM’
970 HC [stage 1] compiler/stage2/build/StgCmmBind.o-boot
971 HC [stage 1] compiler/stage2/build/StgCmmExtCode.o
972 HC [stage 1] utils/dll-split/dist-install/build/tmp/dll-split
973/srv/builds/patches/rGHC/B6960-D1198-4612/libraries/base/dist-install/build/libHSbase-4.8.2.0-ghc7.11.20151022.so: undefined reference to `libdw_pool_take'
974/srv/builds/patches/rGHC/B6960-D1198-4612/libraries/base/dist-install/build/libHSbase-4.8.2.0-ghc7.11.20151022.so: undefined reference to `libdw_pool_clear'
975/srv/builds/patches/rGHC/B6960-D1198-4612/libraries/base/dist-install/build/libHSbase-4.8.2.0-ghc7.11.20151022.so: undefined reference to `libdw_pool_release'
976/srv/builds/patches/rGHC/B6960-D1198-4612/libraries/base/dist-install/build/libHSbase-4.8.2.0-ghc7.11.20151022.so: undefined reference to `libdw_get_backtrace'
977/srv/builds/patches/rGHC/B6960-D1198-4612/libraries/base/dist-install/build/libHSbase-4.8.2.0-ghc7.11.20151022.so: undefined reference to `backtrace_free'
978/srv/builds/patches/rGHC/B6960-D1198-4612/libraries/base/dist-install/build/libHSbase-4.8.2.0-ghc7.11.20151022.so: undefined reference to `libdw_lookup_location'
979collect2: error: ld returned 1 exit status
980`gcc' failed in phase `Linker'. (Exit code: 1)
981make[1]: *** [utils/dll-split/dist-install/build/tmp/dll-split] Error 1
982make[1]: *** Waiting for unfinished jobs....
983
984compiler/codeGen/StgCmmExtCode.hs: warning:
985 Could not specialise imported function ‘addListToUFM’
986 Probable fix: add INLINEABLE pragma on ‘addListToUFM’
987
988compiler/nativeGen/X86/CodeGen.hs: warning:
989 Could not specialise imported function ‘Outputable.$fOutputableIntMap_$cppr1’
990 Probable fix: add INLINEABLE pragma on ‘Outputable.$fOutputableIntMap_$cppr1’
991
992compiler/nativeGen/X86/CodeGen.hs: warning:
993 Could not specialise imported function ‘Data.Traversable.$fTraversable[]_$csequenceA’
994 when specialising ‘Data.Traversable.$fTraversable[]_$csequence’
995 when specialising ‘mapAndUnzipM’
996 Probable fix: add INLINEABLE pragma on ‘Data.Traversable.$fTraversable[]_$csequenceA’
997
998compiler/nativeGen/X86/CodeGen.hs: warning:
999 Could not specialise imported function ‘Data.Traversable.$fTraversable[]_$cmapM’
1000 Probable fix: add INLINEABLE pragma on ‘Data.Traversable.$fTraversable[]_$cmapM’
1001make: *** [all] Error 2
1002

Build Log 118392 (remote - stdout)
25 - 50 - 100 - Unlimited Lines

1Now building B6960: patch rGHC/D1198:4612
2 - Base directory: /srv/builds/patches/rGHC/B6960-D1198-4612
3 - Cloning repository.............. OK (took about 55.027669151 seconds)
4 - Updating HEAD and grabbing submodules.... OK (took about 5.005034238 seconds)
5 - Applying diff 4612 via Arcanist... OK (took about 48.360875647 seconds)
6
7OK, starting build on Fri Oct 23 09:02:04 UTC 2015
8 - Using 8 CPUs on Linux phab-ghc07 3.13.0-33-generic #58-Ubuntu SMP Tue Jul 29 16:45:05 UTC 2014 x86_64 x86_64 x86_64 GNU/Linux
9 - Running validate.............................................................................................ERROR: validate failed!
10 - LZMA compressing full build logs.... OK (took about 5.004406659 seconds)
11

Lease GHC Build Machine

When
Completed at Oct 23 2015, 4:05 AM · Built for 1 s
Status
Passed
Description

Lease a build machine to perform a GHC build.