Build 6960

Properties

Run GHC Validate Build

When
Completed at Oct 23 2015, 4:37 AM · Built for 31 m, 57 s
Status
Failed
Description

Run GHC ./validate build.

Build Log 118393 (remote - stderr)
25 - 50 - 100 - Unlimited Lines

977/srv/builds/patches/rGHC/B6960-D1198-4612/libraries/base/dist-install/build/libHSbase-4.8.2.0-ghc7.11.20151022.so: undefined reference to `libdw_lookup_location'
978collect2: error: ld returned 1 exit status
979`gcc' failed in phase `Linker'. (Exit code: 1)
980make[1]: *** [utils/dll-split/dist-install/build/tmp/dll-split] Error 1
981make[1]: *** Waiting for unfinished jobs....
982
983compiler/codeGen/StgCmmExtCode.hs: warning:
984 Could not specialise imported function ‘addListToUFM’
985 Probable fix: add INLINEABLE pragma on ‘addListToUFM’
986
987compiler/nativeGen/X86/CodeGen.hs: warning:
988 Could not specialise imported function ‘Outputable.$fOutputableIntMap_$cppr1’
989 Probable fix: add INLINEABLE pragma on ‘Outputable.$fOutputableIntMap_$cppr1’
990
991compiler/nativeGen/X86/CodeGen.hs: warning:
992 Could not specialise imported function ‘Data.Traversable.$fTraversable[]_$csequenceA’
993 when specialising ‘Data.Traversable.$fTraversable[]_$csequence’
994 when specialising ‘mapAndUnzipM’
995 Probable fix: add INLINEABLE pragma on ‘Data.Traversable.$fTraversable[]_$csequenceA’
996
997compiler/nativeGen/X86/CodeGen.hs: warning:
998 Could not specialise imported function ‘Data.Traversable.$fTraversable[]_$cmapM’
999 Probable fix: add INLINEABLE pragma on ‘Data.Traversable.$fTraversable[]_$cmapM’
1000make: *** [all] Error 2
1001

Build Log 118392 (remote - stdout)
25 - 50 - 100 - Unlimited Lines

1Now building B6960: patch rGHC/D1198:4612
2 - Base directory: /srv/builds/patches/rGHC/B6960-D1198-4612
3 - Cloning repository.............. OK (took about 55.027669151 seconds)
4 - Updating HEAD and grabbing submodules.... OK (took about 5.005034238 seconds)
5 - Applying diff 4612 via Arcanist... OK (took about 48.360875647 seconds)
6
7OK, starting build on Fri Oct 23 09:02:04 UTC 2015
8 - Using 8 CPUs on Linux phab-ghc07 3.13.0-33-generic #58-Ubuntu SMP Tue Jul 29 16:45:05 UTC 2014 x86_64 x86_64 x86_64 GNU/Linux
9 - Running validate.............................................................................................ERROR: validate failed!
10 - LZMA compressing full build logs.... OK (took about 5.004406659 seconds)
11

Lease GHC Build Machine

When
Completed at Oct 23 2015, 4:05 AM · Built for 1 s
Status
Passed
Description

Lease a build machine to perform a GHC build.