Build 64773

Properties

Drydock: Build

When
Completed at Dec 18 2018, 1:07 PM · Built for 1 h, 22 m
Status
Failed

Build Log 342930 (remote - stderr)
25 - 50 - 100 - Unlimited Lines

521ar: creating libraries/haskeline/dist-install/build/libHShaskeline-0.7.4.3.a
522Warning: -rtsopts and -with-rtsopts have no effect with -shared.
523 Call hs_init_ghc() from your main() function to set these options.
524ar: creating libraries/parsec/dist-install/build/libHSparsec-3.1.13.0.a
525ar: creating libraries/text/dist-install/build/libHStext-1.2.3.1.a
526Warning: -rtsopts and -with-rtsopts have no effect with -shared.
527 Call hs_init_ghc() from your main() function to set these options.
528Warning: -rtsopts and -with-rtsopts have no effect with -shared.
529 Call hs_init_ghc() from your main() function to set these options.
530Warning: -rtsopts and -with-rtsopts have no effect with -shared.
531 Call hs_init_ghc() from your main() function to set these options.
532ar: creating libraries/ghci/dist-install/build/libHSghci-8.7.a
533ar: creating libraries/libiserv/dist-install/build/libHSlibiserv-8.7.a
534Warning: -rtsopts and -with-rtsopts have no effect with -shared.
535 Call hs_init_ghc() from your main() function to set these options.
536
537compiler/stranal/WwLib.hs:21:1: error: [-Wunused-imports, -Werror=unused-imports]
538 The import of ‘vanillaIdInfo’ from module ‘IdInfo’ is redundant
539 |
54021 | import IdInfo ( JoinArity, vanillaIdInfo )
541 | ^^^^^^^^^^^^^^^^^^^^^^^^^^^^^^^^^^^^^^^^^^^^^^^^^^^^
542make[1]: *** [compiler/stage2/build/WwLib.o] Error 1
543make[1]: *** Waiting for unfinished jobs....
544make: *** [all] Error 2
545

Build Log 342929 (remote - stdout)
25 - 50 - 100 - Unlimited Lines

5148 HC [stage 1] compiler/stage2/build/ExtractDocs.o
5149 HC [stage 1] compiler/stage2/build/DsUsage.o
5150 HC [stage 1] compiler/stage2/build/CodeOutput.o
5151 HC [stage 1] compiler/stage2/build/SetLevels.o
5152 HC [stage 1] compiler/stage2/build/FloatIn.o
5153 HC [stage 1] compiler/stage2/build/SimplMonad.o
5154 HC [stage 1] libraries/Cabal/Cabal/dist-install/build/Distribution/Types/LocalBuildInfo.o
5155 HC [stage 1] libraries/Cabal/Cabal/dist-install/build/Distribution/Make.o
5156 HC [stage 1] compiler/stage2/build/TcRnMonad.o
5157 HC [stage 1] compiler/stage2/build/MkId.o
5158 HC [stage 1] compiler/stage2/build/GHCi.o
5159 HC [stage 1] compiler/stage2/build/HeaderInfo.o
5160 HC [stage 1] compiler/stage2/build/FloatOut.o
5161 HC [stage 1] compiler/stage2/build/SimplEnv.o
5162 HC [stage 1] compiler/stage2/build/PrelInfo.o
5163 HC [stage 1] compiler/stage2/build/ByteCodeItbls.o
5164 HC [stage 1] compiler/stage2/build/ByteCodeLink.o
5165 HC [stage 1] compiler/stage2/build/ToIface.o
5166 HC [stage 1] compiler/stage2/build/Coverage.o
5167 HC [stage 1] compiler/stage2/build/UnariseStg.o
5168 HC [stage 1] compiler/stage2/build/CoreToStg.o
5169 HC [stage 1] compiler/stage2/build/WwLib.o
5170compiler/ghc.mk:445: recipe for target 'compiler/stage2/build/WwLib.o' failed
5171Makefile:123: recipe for target 'all' failed
5172

Drydock: Prepare tree

When
Completed at Dec 18 2018, 11:44 AM · Built for 18 s
Status
Passed

Build Log 342926 (remote - stderr)
25 - 50 - 100 - Unlimited Lines

1+ git clean -qxfd
2+ git submodule sync
3+ git submodule update --init --recursive
4+ git submodule foreach -q git clean -qxfd
5

Build Log 342925 (remote - stdout)
25 - 50 - 100 - Unlimited Lines

5Synchronizing submodule url for 'libraries/binary'
6Synchronizing submodule url for 'libraries/bytestring'
7Synchronizing submodule url for 'libraries/containers'
8Synchronizing submodule url for 'libraries/deepseq'
9Synchronizing submodule url for 'libraries/directory'
10Synchronizing submodule url for 'libraries/filepath'
11Synchronizing submodule url for 'libraries/haskeline'
12Synchronizing submodule url for 'libraries/hpc'
13Synchronizing submodule url for 'libraries/integer-gmp/gmp/gmp-tarballs'
14Synchronizing submodule url for 'libraries/mtl'
15Synchronizing submodule url for 'libraries/parallel'
16Synchronizing submodule url for 'libraries/parsec'
17Synchronizing submodule url for 'libraries/pretty'
18Synchronizing submodule url for 'libraries/process'
19Synchronizing submodule url for 'libraries/stm'
20Synchronizing submodule url for 'libraries/terminfo'
21Synchronizing submodule url for 'libraries/text'
22Synchronizing submodule url for 'libraries/time'
23Synchronizing submodule url for 'libraries/transformers'
24Synchronizing submodule url for 'libraries/unix'
25Synchronizing submodule url for 'libraries/xhtml'
26Synchronizing submodule url for 'nofib'
27Synchronizing submodule url for 'utils/haddock'
28Synchronizing submodule url for 'utils/hsc2hs'
29

Build Working Copy

When
Completed at Dec 18 2018, 11:44 AM · Built for 7 s
Status
Passed
Description

Lease a working copy for Linux/amd64 builds.