Build 64772

Properties

Drydock: Build

When
Completed at Dec 18 2018, 1:13 PM · Built for 1 h, 29 m
Status
Failed
Description

Run the build.

Build Log 342932 (remote - stderr)
25 - 50 - 100 - Unlimited Lines

653 Call hs_init_ghc() from your main() function to set these options.
654Warning: -rtsopts and -with-rtsopts have no effect with -shared.
655 Call hs_init_ghc() from your main() function to set these options.
656Warning: -rtsopts and -with-rtsopts have no effect with -shared.
657 Call hs_init_ghc() from your main() function to set these options.
658Warning: -rtsopts and -with-rtsopts have no effect with -shared.
659 Call hs_init_ghc() from your main() function to set these options.
660Warning: -rtsopts and -with-rtsopts have no effect with -shared.
661 Call hs_init_ghc() from your main() function to set these options.
662Warning: -rtsopts and -with-rtsopts have no effect with -shared.
663 Call hs_init_ghc() from your main() function to set these options.
664Warning: -rtsopts and -with-rtsopts have no effect with -shared.
665 Call hs_init_ghc() from your main() function to set these options.
666Warning: -rtsopts and -with-rtsopts have no effect with -shared.
667 Call hs_init_ghc() from your main() function to set these options.
668
669compiler/stranal/WwLib.hs:21:1: error: [-Wunused-imports, -Werror=unused-imports]
670 The import of ‘vanillaIdInfo’ from module ‘IdInfo’ is redundant
671 |
67221 | import IdInfo ( JoinArity, vanillaIdInfo )
673 | ^^^^^^^^^^^^^^^^^^^^^^^^^^^^^^^^^^^^^^^^^^^^^^^^^^^^
674make[1]: *** [compiler/stage2/build/WwLib.o] Error 1
675make[1]: *** Waiting for unfinished jobs....
676make: *** [all] Error 2
677

Build Log 342931 (remote - stdout)
25 - 50 - 100 - Unlimited Lines

5085 HC [stage 1] compiler/stage2/build/RnExpr.o-boot
5086 HC [stage 1] compiler/stage2/build/RnHsDoc.o
5087 HC [stage 1] compiler/stage2/build/TcRnDriver.o-boot
5088 HC [stage 1] compiler/stage2/build/TcHoleErrors.o-boot
5089 HC [stage 1] compiler/stage2/build/TcMatches.o-boot
5090 HC [stage 1] compiler/stage2/build/HeaderInfo.o
5091 HC [stage 1] compiler/stage2/build/ExtractDocs.o
5092 HC [stage 1] compiler/stage2/build/DsUsage.o
5093 HC [stage 1] compiler/stage2/build/FloatOut.o
5094 HC [stage 1] compiler/stage2/build/SimplEnv.o
5095 HC [stage 1] libraries/Cabal/Cabal/dist-install/build/Distribution/Backpack/ConfiguredComponent.o
5096 HC [stage 1] libraries/Cabal/Cabal/dist-install/build/Distribution/PackageDescription/Check.o
5097 HC [stage 1] libraries/Cabal/Cabal/dist-install/build/Distribution/Simple/HaskellSuite.o
5098 HC [stage 1] libraries/Cabal/Cabal/dist-install/build/Distribution/Simple/UHC.o
5099 HC [stage 1] libraries/Cabal/Cabal/dist-install/build/Distribution/Simple/GHC/Internal.o
5100 HC [stage 1] libraries/Cabal/Cabal/dist-install/build/Distribution/Simple/Build/PathsModule.o
5101 HC [stage 1] compiler/stage2/build/TcRnMonad.o
5102 HC [stage 1] compiler/stage2/build/PrelInfo.o
5103 HC [stage 1] compiler/stage2/build/GHCi.o
5104 HC [stage 1] compiler/stage2/build/ToIface.o
5105 HC [stage 1] compiler/stage2/build/UnariseStg.o
5106 HC [stage 1] compiler/stage2/build/CoreToStg.o
5107 HC [stage 1] compiler/stage2/build/WwLib.o
5108 HC [stage 1] compiler/stage2/build/Specialise.o
5109

Drydock: Prepare tree

When
Completed at Dec 18 2018, 11:44 AM · Built for 19 s
Status
Passed

Build Log 342928 (remote - stderr)
25 - 50 - 100 - Unlimited Lines

1+ git clean -qxfd
2+ git submodule sync
3+ git submodule update --init --recursive
4+ git submodule foreach -q git clean -qxfd
5

Build Log 342927 (remote - stdout)
25 - 50 - 100 - Unlimited Lines

5Synchronizing submodule url for 'libraries/binary'
6Synchronizing submodule url for 'libraries/bytestring'
7Synchronizing submodule url for 'libraries/containers'
8Synchronizing submodule url for 'libraries/deepseq'
9Synchronizing submodule url for 'libraries/directory'
10Synchronizing submodule url for 'libraries/filepath'
11Synchronizing submodule url for 'libraries/haskeline'
12Synchronizing submodule url for 'libraries/hpc'
13Synchronizing submodule url for 'libraries/integer-gmp/gmp/gmp-tarballs'
14Synchronizing submodule url for 'libraries/mtl'
15Synchronizing submodule url for 'libraries/parallel'
16Synchronizing submodule url for 'libraries/parsec'
17Synchronizing submodule url for 'libraries/pretty'
18Synchronizing submodule url for 'libraries/process'
19Synchronizing submodule url for 'libraries/stm'
20Synchronizing submodule url for 'libraries/terminfo'
21Synchronizing submodule url for 'libraries/text'
22Synchronizing submodule url for 'libraries/time'
23Synchronizing submodule url for 'libraries/transformers'
24Synchronizing submodule url for 'libraries/unix'
25Synchronizing submodule url for 'libraries/xhtml'
26Synchronizing submodule url for 'nofib'
27Synchronizing submodule url for 'utils/haddock'
28Synchronizing submodule url for 'utils/hsc2hs'
29

Lease Working Copy

When
Completed at Dec 18 2018, 11:44 AM · Built for 17 s
Status
Passed
Description

Lease a working copy for OSX/amd64 builds.