Build 64771

Properties

Drydock: Build

When
Completed at Dec 18 2018, 12:49 PM · Built for 1 h, 3 m
Status
Failed

Build Log 342936 (remote - stderr)
25 - 50 - 100 - Unlimited Lines

523WARNING: file compiler\\simplCore\\SimplCore.hs, line 977
524 Not shorting out: happySpecReduce_3
525WARNING: file compiler\\simplCore\\SimplCore.hs, line 977
526 Not shorting out: happySpecReduce_1
527WARNING: file compiler\\simplCore\\SimplCore.hs, line 977
528 Not shorting out: happySpecReduce_0
529WARNING: file compiler\\simplCore\\SimplCore.hs, line 977
530 Not shorting out: happySpecReduce_2
531WARNING: file compiler\\simplCore\\SimplCore.hs, line 977
532 Not shorting out: happyGoto
533C:\msys64\var\drydock\workingcopy-121292\repo\glasgow-haskell-compiler\inplace\mingw\bin\ar.exe: creating libraries/ghc-heap/dist-install/build/libHSghc-heap-8.7.a
534C:\msys64\var\drydock\workingcopy-121292\repo\glasgow-haskell-compiler\inplace\mingw\bin\ar.exe: creating libraries/deepseq/dist-install/build/libHSdeepseq-1.4.4.0.a
535C:\msys64\var\drydock\workingcopy-121292\repo\glasgow-haskell-compiler\inplace\mingw\bin\ar.exe: creating libraries/transformers/dist-install/build/libHStransformers-0.5.5.0.a
536C:\msys64\var\drydock\workingcopy-121292\repo\glasgow-haskell-compiler\inplace\mingw\bin\ar.exe: creating libraries/stm/dist-install/build/libHSstm-2.5.0.0.a
537C:\msys64\var\drydock\workingcopy-121292\repo\glasgow-haskell-compiler\inplace\mingw\bin\ar.exe: creating libraries/pretty/dist-install/build/libHSpretty-1.1.3.6.a
538C:\msys64\var\drydock\workingcopy-121292\repo\glasgow-haskell-compiler\inplace\mingw\bin\ar.exe: creating libraries/array/dist-install/build/libHSarray-0.5.2.0.a
539C:\msys64\var\drydock\workingcopy-121292\repo\glasgow-haskell-compiler\inplace\mingw\bin\ar.exe: creating libraries/xhtml/dist-install/build/libHSxhtml-3000.2.2.1.a
540C:\msys64\var\drydock\workingcopy-121292\repo\glasgow-haskell-compiler\inplace\mingw\bin\ar.exe: creating libraries/Win32/dist-install/build/libHSWin32-2.6.1.0.a
541C:\msys64\var\drydock\workingcopy-121292\repo\glasgow-haskell-compiler\inplace\mingw\bin\ar.exe: creating libraries/ghc-compact/dist-install/build/libHSghc-compact-0.1.0.0.a
542C:\msys64\var\drydock\workingcopy-121292\repo\glasgow-haskell-compiler\inplace\mingw\bin\ar.exe: creating libraries/mtl/dist-install/build/libHSmtl-2.2.2.a
543C:\msys64\var\drydock\workingcopy-121292\repo\glasgow-haskell-compiler\inplace\mingw\bin\ar.exe: creating libraries/template-haskell/dist-install/build/libHStemplate-haskell-2.15.0.0.a
544C:\msys64\var\drydock\workingcopy-121292\repo\glasgow-haskell-compiler\inplace\mingw\bin\ar.exe: creating libraries/bytestring/dist-install/build/libHSbytestring-0.10.9.0.a
545C:\msys64\var\drydock\workingcopy-121292\repo\glasgow-haskell-compiler\inplace\mingw\bin\ar.exe: creating libraries/containers/dist-install/build/libHScontainers-0.6.0.1.a
546C:\msys64\var\drydock\workingcopy-121292\repo\glasgow-haskell-compiler\inplace\mingw\bin\ar.exe: creating libraries/hpc/dist-install/build/libHShpc-0.6.0.3.a
547WARNING: file compiler\\simplCore\\SimplCore.hs, line 678
548 Simplifier bailing out after 4 iterations [715, 10, 1, 4]
549 Size = {terms: 1,969, types: 2,087, coercions: 8, joins: 2/14}
550C:\msys64\var\drydock\workingcopy-121292\repo\glasgow-haskell-compiler\inplace\mingw\bin\ar.exe: creating libraries/time/dist-install/build/libHStime-1.9.2.a
551C:\msys64\var\drydock\workingcopy-121292\repo\glasgow-haskell-compiler\inplace\mingw\bin\ar.exe: creating libraries/directory/dist-install/build/libHSdirectory-1.3.3.1.a
552C:\msys64\var\drydock\workingcopy-121292\repo\glasgow-haskell-compiler\inplace\mingw\bin\ar.exe: creating libraries/process/dist-install/build/libHSprocess-1.6.3.0.a
553WARNING: file compiler\\simplCore\\SimplCore.hs, line 678
554 Simplifier bailing out after 4 iterations [57, 2, 1, 1]
555 Size = {terms: 687, types: 903, coercions: 12, joins: 0/27}
556C:\msys64\var\drydock\workingcopy-121292\repo\glasgow-haskell-compiler\inplace\mingw\bin\ar.exe: creating libraries/binary/dist-install/build/libHSbinary-0.8.6.0.a
557C:\msys64\var\drydock\workingcopy-121292\repo\glasgow-haskell-compiler\inplace\mingw\bin\ar.exe: creating libraries/ghc-boot/dist-install/build/libHSghc-boot-8.7.a
558C:\msys64\var\drydock\workingcopy-121292\repo\glasgow-haskell-compiler\inplace\mingw\bin\ar.exe: creating libraries/haskeline/dist-install/build/libHShaskeline-0.7.4.3.a
559C:\msys64\var\drydock\workingcopy-121292\repo\glasgow-haskell-compiler\inplace\mingw\bin\ar.exe: creating libraries/parsec/dist-install/build/libHSparsec-3.1.13.0.a
560C:\msys64\var\drydock\workingcopy-121292\repo\glasgow-haskell-compiler\inplace\mingw\bin\ar.exe: creating libraries/text/dist-install/build/libHStext-1.2.3.1.a
561C:\msys64\var\drydock\workingcopy-121292\repo\glasgow-haskell-compiler\inplace\mingw\bin\ar.exe: creating libraries/ghci/dist-install/build/libHSghci-8.7.a
562C:\msys64\var\drydock\workingcopy-121292\repo\glasgow-haskell-compiler\inplace\mingw\bin\ar.exe: creating libraries/libiserv/dist-install/build/libHSlibiserv-8.7.a
563
564compiler\stranal\WwLib.hs:21:1: error: [-Wunused-imports, -Werror=unused-imports]
565 The import of ‘vanillaIdInfo’ from module ‘IdInfo’ is redundant
566 |
56721 | import IdInfo ( JoinArity, vanillaIdInfo )
568 | ^^^^^^^^^^^^^^^^^^^^^^^^^^^^^^^^^^^^^^^^^^^^^^^^^^^^
569make[1]: *** [compiler/ghc.mk:445: compiler/stage2/build/WwLib.o] Error 1
570make[1]: *** Waiting for unfinished jobs....
571make: *** [Makefile:128: all] Error 2
572

Build Log 342935 (remote - stdout)
25 - 50 - 100 - Unlimited Lines

6242 HC [stage 1] libraries/Cabal/Cabal/dist-install/build/Distribution/PackageDescription/PrettyPrint.o
6243 HC [stage 1] libraries/Cabal/Cabal/dist-install/build/Distribution/PackageDescription/Parsec.o
6244 HC [stage 1] libraries/Cabal/Cabal/dist-install/build/Distribution/Simple/Program/Db.o
6245 HC [stage 1] libraries/Cabal/Cabal/dist-install/build/Distribution/Simple/Program.o
6246 HC [stage 1] libraries/Cabal/Cabal/dist-install/build/Distribution/Simple/Setup.o
6247 HC [stage 1] libraries/Cabal/Cabal/dist-install/build/Distribution/Simple/Program/Strip.o
6248 HC [stage 1] compiler/stage2/build/Convert.o
6249 HC [stage 1] compiler/stage2/build/TcRnTypes.o
6250 HC [stage 1] compiler/stage2/build/Finder.o
6251 HC [stage 1] compiler/stage2/build/GhcMonad.o
6252 HC [stage 1] compiler/stage2/build/PipelineMonad.o
6253 HC [stage 1] compiler/stage2/build/MkCore.o
6254 HC [stage 1] compiler/stage2/build/CoreMonad.o
6255 HC [stage 1] compiler/stage2/build/Parser.o
6256 HC [stage 1] compiler/stage2/build/StgCmmHpc.o
6257 HC [stage 1] compiler/stage2/build/CmmPipeline.o
6258 HC [stage 1] compiler/stage2/build/TcEnv.o-boot
6259 HC [stage 1] compiler/stage2/build/TcIface.o-boot
6260 HC [stage 1] compiler/stage2/build/Plugins.o
6261 HC [stage 1] compiler/stage2/build/Hooks.o
6262 HC [stage 1] compiler/stage2/build/TcTypeNats.o
6263 HC [stage 1] compiler/stage2/build/PrelRules.o
6264 HC [stage 1] compiler/stage2/build/CoreLint.o
6265 HC [stage 1] compiler/stage2/build/TcUnify.o-boot
6266 HC [stage 1] compiler/stage2/build/TcExpr.o-boot
6267 HC [stage 1] compiler/stage2/build/TcSplice.o-boot
6268 HC [stage 1] compiler/stage2/build/RnExpr.o-boot
6269 HC [stage 1] compiler/stage2/build/RnHsDoc.o
6270 HC [stage 1] compiler/stage2/build/TcRnDriver.o-boot
6271 HC [stage 1] compiler/stage2/build/TcHoleErrors.o-boot
6272 HC [stage 1] compiler/stage2/build/TcEvTerm.o
6273 HC [stage 1] compiler/stage2/build/TcMatches.o-boot
6274 HC [stage 1] compiler/stage2/build/HeaderInfo.o
6275 HC [stage 1] compiler/stage2/build/ExtractDocs.o
6276 HC [stage 1] compiler/stage2/build/DsUsage.o
6277 HC [stage 1] compiler/stage2/build/CodeOutput.o
6278 HC [stage 1] compiler/stage2/build/SetLevels.o
6279 HC [stage 1] compiler/stage2/build/FloatIn.o
6280 HC [stage 1] compiler/stage2/build/SimplMonad.o
6281 HC [stage 1] compiler/stage2/build/TcRnMonad.o
6282 HC [stage 1] compiler/stage2/build/MkId.o
6283 HC [stage 1] compiler/stage2/build/GHCi.o
6284 HC [stage 1] compiler/stage2/build/SimplEnv.o
6285 HC [stage 1] compiler/stage2/build/PrelInfo.o
6286 HC [stage 1] compiler/stage2/build/ToIface.o
6287 HC [stage 1] compiler/stage2/build/UnariseStg.o
6288 HC [stage 1] compiler/stage2/build/CoreToStg.o
6289 HC [stage 1] compiler/stage2/build/WwLib.o
6290 HC [stage 1] compiler/stage2/build/Specialise.o
6291

Drydock: Prepare tree

When
Completed at Dec 18 2018, 11:45 AM · Built for 1 m, 2 s
Status
Passed

Build Log 342934 (remote - stderr)
25 - 50 - 100 - Unlimited Lines

1+ git clean -qxfd
2+ git submodule foreach git checkout .
3+ git submodule foreach git clean -qxfd
4+ git submodule sync
5+ git submodule update --init --recursive
6+ git submodule foreach -q git clean -qxfd
7

Build Log 342933 (remote - stdout)
25 - 50 - 100 - Unlimited Lines

38Entering 'libraries/directory'
39Entering 'libraries/filepath'
40Entering 'libraries/haskeline'
41Entering 'libraries/hpc'
42Entering 'libraries/integer-gmp/gmp/gmp-tarballs'
43Entering 'libraries/mtl'
44Entering 'libraries/parallel'
45Entering 'libraries/parsec'
46Entering 'libraries/pretty'
47Entering 'libraries/process'
48Entering 'libraries/stm'
49Entering 'libraries/terminfo'
50Entering 'libraries/text'
51Entering 'libraries/time'
52Entering 'libraries/transformers'
53Entering 'libraries/unix'
54Entering 'libraries/xhtml'
55Entering 'nofib'
56Entering 'utils/haddock'
57Entering 'utils/hsc2hs'
58Synchronizing submodule url for '.arc-linters/arcanist-external-json-linter'
59Synchronizing submodule url for 'libffi-tarballs'
60Synchronizing submodule url for 'libraries/Cabal'
61Synchronizing submodule url for 'libraries/Win32'
62Synchronizing submodule url for 'libraries/array'
63Synchronizing submodule url for 'libraries/binary'
64Synchronizing submodule url for 'libraries/bytestring'
65Synchronizing submodule url for 'libraries/containers'
66Synchronizing submodule url for 'libraries/deepseq'
67Synchronizing submodule url for 'libraries/directory'
68Synchronizing submodule url for 'libraries/filepath'
69Synchronizing submodule url for 'libraries/haskeline'
70Synchronizing submodule url for 'libraries/hpc'
71Synchronizing submodule url for 'libraries/integer-gmp/gmp/gmp-tarballs'
72Synchronizing submodule url for 'libraries/mtl'
73Synchronizing submodule url for 'libraries/parallel'
74Synchronizing submodule url for 'libraries/parsec'
75Synchronizing submodule url for 'libraries/pretty'
76Synchronizing submodule url for 'libraries/process'
77Synchronizing submodule url for 'libraries/stm'
78Synchronizing submodule url for 'libraries/terminfo'
79Synchronizing submodule url for 'libraries/text'
80Synchronizing submodule url for 'libraries/time'
81Synchronizing submodule url for 'libraries/transformers'
82Synchronizing submodule url for 'libraries/unix'
83Synchronizing submodule url for 'libraries/xhtml'
84Synchronizing submodule url for 'nofib'
85Synchronizing submodule url for 'utils/haddock'
86Synchronizing submodule url for 'utils/hsc2hs'
87

Lease Working Copy

When
Completed at Dec 18 2018, 11:44 AM · Built for 37 s
Status
Passed