Build 64771

Properties

Drydock: Build

When
Completed at Dec 18 2018, 12:49 PM · Built for 1 h, 3 m
Status
Failed

Build Log 342936 (remote - stderr)
25 - 50 - 100 - Unlimited Lines

473C:/msys64/var/drydock/workingcopy-121292/repo/glasgow-haskell-compiler/docs/users_guide/glasgow_exts.rst:12222: WARNING: Could not lex literal_block as "haskell". Highlighting skipped.
474C:/msys64/var/drydock/workingcopy-121292/repo/glasgow-haskell-compiler/docs/users_guide/glasgow_exts.rst:12238: WARNING: Could not lex literal_block as "haskell". Highlighting skipped.
475C:/msys64/var/drydock/workingcopy-121292/repo/glasgow-haskell-compiler/docs/users_guide/glasgow_exts.rst:12255: WARNING: Could not lex literal_block as "haskell". Highlighting skipped.
476C:/msys64/var/drydock/workingcopy-121292/repo/glasgow-haskell-compiler/docs/users_guide/glasgow_exts.rst:12478: WARNING: Could not lex literal_block as "haskell". Highlighting skipped.
477C:/msys64/var/drydock/workingcopy-121292/repo/glasgow-haskell-compiler/docs/users_guide/separate_compilation.rst:678: WARNING: Could not lex literal_block as "haskell". Highlighting skipped.
478Warning: -rtsopts and -with-rtsopts have no effect with -no-hs-main.
479 Call hs_init_ghc() from your main() function to set these options.
480Warning: -rtsopts and -with-rtsopts have no effect with -no-hs-main.
481 Call hs_init_ghc() from your main() function to set these options.
482Warning: -rtsopts and -with-rtsopts have no effect with -no-hs-main.
483 Call hs_init_ghc() from your main() function to set these options.
484C:\msys64\var\drydock\workingcopy-121292\repo\glasgow-haskell-compiler\inplace\mingw\bin\ar.exe: creating rts/dist/build/libHSrts.a
485C:\msys64\var\drydock\workingcopy-121292\repo\glasgow-haskell-compiler\inplace\mingw\bin\ar.exe: creating rts/dist/build/libHSrts_l.a
486C:\msys64\var\drydock\workingcopy-121292\repo\glasgow-haskell-compiler\inplace\mingw\bin\ar.exe: creating rts/dist/build/libHSrts_thr.a
487C:\msys64\var\drydock\workingcopy-121292\repo\glasgow-haskell-compiler\inplace\mingw\bin\ar.exe: creating rts/dist/build/libHSrts_thr_l.a
488C:\msys64\var\drydock\workingcopy-121292\repo\glasgow-haskell-compiler\inplace\mingw\bin\ar.exe: creating rts/dist/build/libHSrts_debug.a
489C:\msys64\var\drydock\workingcopy-121292\repo\glasgow-haskell-compiler\inplace\mingw\bin\ar.exe: creating rts/dist/build/libHSrts_thr_debug.a
490C:\msys64\var\drydock\workingcopy-121292\repo\glasgow-haskell-compiler\inplace\mingw\bin\ar.exe: creating libraries/ghc-prim/dist-install/build/libHSghc-prim-0.5.3.a
491C:\msys64\var\drydock\workingcopy-121292\repo\glasgow-haskell-compiler\inplace\mingw\bin\ar.exe: creating libraries/integer-gmp/dist-install/build/libHSinteger-gmp-1.0.2.0.a
492WARNING: file compiler\\stgSyn\\CoreToStg.hs, line 309
493 joinLines_s4sW True False
494C:\msys64\var\drydock\workingcopy-121292\repo\glasgow-haskell-compiler\inplace\mingw\bin\ar.exe: creating libraries/ghc-boot-th/dist-install/build/libHSghc-boot-th-8.7.a
495C:\msys64\var\drydock\workingcopy-121292\repo\glasgow-haskell-compiler\inplace\mingw\bin\ar.exe: creating libraries/filepath/dist-install/build/libHSfilepath-1.4.2.1.a
496C:\msys64\var\drydock\workingcopy-121292\repo\glasgow-haskell-compiler\inplace\mingw\bin\ar.exe: creating libraries/base/dist-install/build/libHSbase-4.12.0.0.a
497WARNING: file compiler\\simplCore\\SimplCore.hs, line 977
498 Not shorting out: happyReduce
499WARNING: file compiler\\simplCore\\SimplCore.hs, line 977
500 Not shorting out: happyDoAction
501WARNING: file compiler\\simplCore\\SimplCore.hs, line 977
502 Not shorting out: happyShift
503WARNING: file compiler\\simplCore\\SimplCore.hs, line 977
504 Not shorting out: happyFail
505WARNING: file compiler\\simplCore\\SimplCore.hs, line 977
506 Not shorting out: happySpecReduce_3
507WARNING: file compiler\\simplCore\\SimplCore.hs, line 977
508 Not shorting out: happySpecReduce_1
509WARNING: file compiler\\simplCore\\SimplCore.hs, line 977
510 Not shorting out: happySpecReduce_0
511WARNING: file compiler\\simplCore\\SimplCore.hs, line 977
512 Not shorting out: happySpecReduce_2
513WARNING: file compiler\\simplCore\\SimplCore.hs, line 977
514 Not shorting out: happyGoto
515WARNING: file compiler\\simplCore\\SimplCore.hs, line 977
516 Not shorting out: happyReduce
517WARNING: file compiler\\simplCore\\SimplCore.hs, line 977
518 Not shorting out: happyDoAction
519WARNING: file compiler\\simplCore\\SimplCore.hs, line 977
520 Not shorting out: happyShift
521WARNING: file compiler\\simplCore\\SimplCore.hs, line 977
522 Not shorting out: happyFail
523WARNING: file compiler\\simplCore\\SimplCore.hs, line 977
524 Not shorting out: happySpecReduce_3
525WARNING: file compiler\\simplCore\\SimplCore.hs, line 977
526 Not shorting out: happySpecReduce_1
527WARNING: file compiler\\simplCore\\SimplCore.hs, line 977
528 Not shorting out: happySpecReduce_0
529WARNING: file compiler\\simplCore\\SimplCore.hs, line 977
530 Not shorting out: happySpecReduce_2
531WARNING: file compiler\\simplCore\\SimplCore.hs, line 977
532 Not shorting out: happyGoto
533C:\msys64\var\drydock\workingcopy-121292\repo\glasgow-haskell-compiler\inplace\mingw\bin\ar.exe: creating libraries/ghc-heap/dist-install/build/libHSghc-heap-8.7.a
534C:\msys64\var\drydock\workingcopy-121292\repo\glasgow-haskell-compiler\inplace\mingw\bin\ar.exe: creating libraries/deepseq/dist-install/build/libHSdeepseq-1.4.4.0.a
535C:\msys64\var\drydock\workingcopy-121292\repo\glasgow-haskell-compiler\inplace\mingw\bin\ar.exe: creating libraries/transformers/dist-install/build/libHStransformers-0.5.5.0.a
536C:\msys64\var\drydock\workingcopy-121292\repo\glasgow-haskell-compiler\inplace\mingw\bin\ar.exe: creating libraries/stm/dist-install/build/libHSstm-2.5.0.0.a
537C:\msys64\var\drydock\workingcopy-121292\repo\glasgow-haskell-compiler\inplace\mingw\bin\ar.exe: creating libraries/pretty/dist-install/build/libHSpretty-1.1.3.6.a
538C:\msys64\var\drydock\workingcopy-121292\repo\glasgow-haskell-compiler\inplace\mingw\bin\ar.exe: creating libraries/array/dist-install/build/libHSarray-0.5.2.0.a
539C:\msys64\var\drydock\workingcopy-121292\repo\glasgow-haskell-compiler\inplace\mingw\bin\ar.exe: creating libraries/xhtml/dist-install/build/libHSxhtml-3000.2.2.1.a
540C:\msys64\var\drydock\workingcopy-121292\repo\glasgow-haskell-compiler\inplace\mingw\bin\ar.exe: creating libraries/Win32/dist-install/build/libHSWin32-2.6.1.0.a
541C:\msys64\var\drydock\workingcopy-121292\repo\glasgow-haskell-compiler\inplace\mingw\bin\ar.exe: creating libraries/ghc-compact/dist-install/build/libHSghc-compact-0.1.0.0.a
542C:\msys64\var\drydock\workingcopy-121292\repo\glasgow-haskell-compiler\inplace\mingw\bin\ar.exe: creating libraries/mtl/dist-install/build/libHSmtl-2.2.2.a
543C:\msys64\var\drydock\workingcopy-121292\repo\glasgow-haskell-compiler\inplace\mingw\bin\ar.exe: creating libraries/template-haskell/dist-install/build/libHStemplate-haskell-2.15.0.0.a
544C:\msys64\var\drydock\workingcopy-121292\repo\glasgow-haskell-compiler\inplace\mingw\bin\ar.exe: creating libraries/bytestring/dist-install/build/libHSbytestring-0.10.9.0.a
545C:\msys64\var\drydock\workingcopy-121292\repo\glasgow-haskell-compiler\inplace\mingw\bin\ar.exe: creating libraries/containers/dist-install/build/libHScontainers-0.6.0.1.a
546C:\msys64\var\drydock\workingcopy-121292\repo\glasgow-haskell-compiler\inplace\mingw\bin\ar.exe: creating libraries/hpc/dist-install/build/libHShpc-0.6.0.3.a
547WARNING: file compiler\\simplCore\\SimplCore.hs, line 678
548 Simplifier bailing out after 4 iterations [715, 10, 1, 4]
549 Size = {terms: 1,969, types: 2,087, coercions: 8, joins: 2/14}
550C:\msys64\var\drydock\workingcopy-121292\repo\glasgow-haskell-compiler\inplace\mingw\bin\ar.exe: creating libraries/time/dist-install/build/libHStime-1.9.2.a
551C:\msys64\var\drydock\workingcopy-121292\repo\glasgow-haskell-compiler\inplace\mingw\bin\ar.exe: creating libraries/directory/dist-install/build/libHSdirectory-1.3.3.1.a
552C:\msys64\var\drydock\workingcopy-121292\repo\glasgow-haskell-compiler\inplace\mingw\bin\ar.exe: creating libraries/process/dist-install/build/libHSprocess-1.6.3.0.a
553WARNING: file compiler\\simplCore\\SimplCore.hs, line 678
554 Simplifier bailing out after 4 iterations [57, 2, 1, 1]
555 Size = {terms: 687, types: 903, coercions: 12, joins: 0/27}
556C:\msys64\var\drydock\workingcopy-121292\repo\glasgow-haskell-compiler\inplace\mingw\bin\ar.exe: creating libraries/binary/dist-install/build/libHSbinary-0.8.6.0.a
557C:\msys64\var\drydock\workingcopy-121292\repo\glasgow-haskell-compiler\inplace\mingw\bin\ar.exe: creating libraries/ghc-boot/dist-install/build/libHSghc-boot-8.7.a
558C:\msys64\var\drydock\workingcopy-121292\repo\glasgow-haskell-compiler\inplace\mingw\bin\ar.exe: creating libraries/haskeline/dist-install/build/libHShaskeline-0.7.4.3.a
559C:\msys64\var\drydock\workingcopy-121292\repo\glasgow-haskell-compiler\inplace\mingw\bin\ar.exe: creating libraries/parsec/dist-install/build/libHSparsec-3.1.13.0.a
560C:\msys64\var\drydock\workingcopy-121292\repo\glasgow-haskell-compiler\inplace\mingw\bin\ar.exe: creating libraries/text/dist-install/build/libHStext-1.2.3.1.a
561C:\msys64\var\drydock\workingcopy-121292\repo\glasgow-haskell-compiler\inplace\mingw\bin\ar.exe: creating libraries/ghci/dist-install/build/libHSghci-8.7.a
562C:\msys64\var\drydock\workingcopy-121292\repo\glasgow-haskell-compiler\inplace\mingw\bin\ar.exe: creating libraries/libiserv/dist-install/build/libHSlibiserv-8.7.a
563
564compiler\stranal\WwLib.hs:21:1: error: [-Wunused-imports, -Werror=unused-imports]
565 The import of ‘vanillaIdInfo’ from module ‘IdInfo’ is redundant
566 |
56721 | import IdInfo ( JoinArity, vanillaIdInfo )
568 | ^^^^^^^^^^^^^^^^^^^^^^^^^^^^^^^^^^^^^^^^^^^^^^^^^^^^
569make[1]: *** [compiler/ghc.mk:445: compiler/stage2/build/WwLib.o] Error 1
570make[1]: *** Waiting for unfinished jobs....
571make: *** [Makefile:128: all] Error 2
572

Build Log 342935 (remote - stdout)
25 - 50 - 100 - Unlimited Lines

6192 HC [stage 1] libraries/Cabal/Cabal/dist-install/build/Distribution/Types/ForeignLib.o
6193 HC [stage 1] libraries/Cabal/Cabal/dist-install/build/Distribution/Types/Library.o
6194 HC [stage 1] libraries/Cabal/Cabal/dist-install/build/Distribution/Types/InstalledPackageInfo/Lens.o
6195 HC [stage 1] compiler/stage2/build/SysTools.o
6196 HC [stage 1] compiler/stage2/build/AsmCodeGen.o
6197 HC [stage 1] compiler/stage2/build/StgLiftLams.o
6198 HC [stage 1] libraries/Cabal/Cabal/dist-install/build/Distribution/Types/Component.o
6199 HC [stage 1] libraries/Cabal/Cabal/dist-install/build/Distribution/Types/InstalledPackageInfo/FieldGrammar.o
6200 HC [stage 1] libraries/Cabal/Cabal/dist-install/build/Distribution/Types/TestSuite/Lens.o
6201 HC [stage 1] libraries/Cabal/Cabal/dist-install/build/Distribution/Types/Library/Lens.o
6202 HC [stage 1] libraries/Cabal/Cabal/dist-install/build/Distribution/Types/ForeignLib/Lens.o
6203 HC [stage 1] libraries/Cabal/Cabal/dist-install/build/Distribution/Types/Executable/Lens.o
6204 HC [stage 1] libraries/Cabal/Cabal/dist-install/build/Distribution/Types/Benchmark/Lens.o
6205 HC [stage 1] compiler/stage2/build/LlvmCodeGen.o
6206 HC [stage 1] libraries/Cabal/Cabal/dist-install/build/Distribution/Types/ComponentRequestedSpec.o
6207 HC [stage 1] libraries/Cabal/Cabal/dist-install/build/Distribution/Types/PackageDescription.o
6208 HC [stage 1] libraries/Cabal/Cabal/dist-install/build/Distribution/InstalledPackageInfo.o
6209 HC [stage 1] libraries/Cabal/Cabal/dist-install/build/Distribution/Simple/PackageIndex.o
6210 HC [stage 1] libraries/Cabal/Cabal/dist-install/build/Distribution/Backpack/ModuleShape.o
6211 HC [stage 1] libraries/Cabal/Cabal/dist-install/build/Distribution/Backpack/PreModuleShape.o
6212 HC [stage 1] libraries/Cabal/Cabal/dist-install/build/Distribution/Backpack/PreExistingComponent.o
6213 HC [stage 1] utils/ghc-pkg/dist-install/build/Main.o
6214 HC [stage 1] libraries/Cabal/Cabal/dist-install/build/Distribution/Types/GenericPackageDescription.o
6215 HC [stage 1] libraries/Cabal/Cabal/dist-install/build/Distribution/Types/PackageDescription/Lens.o
6216 HC [stage 1] libraries/Cabal/Cabal/dist-install/build/Distribution/PackageDescription.o
6217 HC [stage 1] libraries/Cabal/Cabal/dist-install/build/Distribution/Types/GenericPackageDescription/Lens.o
6218 HC [stage 1] libraries/Cabal/Cabal/dist-install/build/Distribution/Parsec/ConfVar.o
6219 HC [stage 1] libraries/Cabal/Cabal/dist-install/build/Distribution/Types/ComponentLocalBuildInfo.o
6220 HC [stage 1] libraries/Cabal/Cabal/dist-install/build/Distribution/Simple/Program/Types.o
6221 HC [stage 1] libraries/Cabal/Cabal/dist-install/build/Distribution/Simple/BuildToolDepends.o
6222 HC [stage 1] libraries/Cabal/Cabal/dist-install/build/Distribution/Backpack/UnifyM.o
6223 HC [stage 1] libraries/Cabal/Cabal/dist-install/build/Distribution/PackageDescription/Configuration.o
6224 HC [stage 1] libraries/Cabal/Cabal/dist-install/build/Distribution/Types/Lens.o
6225 HC [stage 1] libraries/Cabal/Cabal/dist-install/build/Distribution/Simple/Program/Run.o
6226 HC [stage 1] libraries/Cabal/Cabal/dist-install/build/Distribution/PackageDescription/FieldGrammar.o
6227 HC [stage 1] libraries/Cabal/Cabal/dist-install/build/Distribution/Backpack/MixLink.o
6228 HC [stage 1] libraries/Cabal/Cabal/dist-install/build/Distribution/Simple/Program/GHC.o
6229 HC [stage 1] libraries/Cabal/Cabal/dist-install/build/Distribution/Simple/Program/HcPkg.o
6230 HC [stage 1] libraries/Cabal/Cabal/dist-install/build/Distribution/Simple/Program/Script.o
6231 HC [stage 1] libraries/Cabal/Cabal/dist-install/build/Distribution/Simple/Program/Hpc.o
6232 HC [stage 1] compiler/stage2/build/HsSyn.o
6233 HC [stage 1] libraries/Cabal/Cabal/dist-install/build/Distribution/Types/TargetInfo.o
6234 HC [stage 1] compiler/stage2/build/PmExpr.o
6235 HC [stage 1] compiler/stage2/build/HscTypes.o
6236 HC [stage 1] compiler/stage2/build/RdrHsSyn.o
6237 HC [stage 1] compiler/stage2/build/HsDumpAst.o
6238 HC [stage 1] compiler/stage2/build/HaddockUtils.o
6239 HC [stage 1] compiler/stage2/build/BkpSyn.o
6240 HC [stage 1] libraries/Cabal/Cabal/dist-install/build/Distribution/Simple/Program/Builtin.o
6241 HC [stage 1] compiler/stage2/build/HscStats.o
6242 HC [stage 1] libraries/Cabal/Cabal/dist-install/build/Distribution/PackageDescription/PrettyPrint.o
6243 HC [stage 1] libraries/Cabal/Cabal/dist-install/build/Distribution/PackageDescription/Parsec.o
6244 HC [stage 1] libraries/Cabal/Cabal/dist-install/build/Distribution/Simple/Program/Db.o
6245 HC [stage 1] libraries/Cabal/Cabal/dist-install/build/Distribution/Simple/Program.o
6246 HC [stage 1] libraries/Cabal/Cabal/dist-install/build/Distribution/Simple/Setup.o
6247 HC [stage 1] libraries/Cabal/Cabal/dist-install/build/Distribution/Simple/Program/Strip.o
6248 HC [stage 1] compiler/stage2/build/Convert.o
6249 HC [stage 1] compiler/stage2/build/TcRnTypes.o
6250 HC [stage 1] compiler/stage2/build/Finder.o
6251 HC [stage 1] compiler/stage2/build/GhcMonad.o
6252 HC [stage 1] compiler/stage2/build/PipelineMonad.o
6253 HC [stage 1] compiler/stage2/build/MkCore.o
6254 HC [stage 1] compiler/stage2/build/CoreMonad.o
6255 HC [stage 1] compiler/stage2/build/Parser.o
6256 HC [stage 1] compiler/stage2/build/StgCmmHpc.o
6257 HC [stage 1] compiler/stage2/build/CmmPipeline.o
6258 HC [stage 1] compiler/stage2/build/TcEnv.o-boot
6259 HC [stage 1] compiler/stage2/build/TcIface.o-boot
6260 HC [stage 1] compiler/stage2/build/Plugins.o
6261 HC [stage 1] compiler/stage2/build/Hooks.o
6262 HC [stage 1] compiler/stage2/build/TcTypeNats.o
6263 HC [stage 1] compiler/stage2/build/PrelRules.o
6264 HC [stage 1] compiler/stage2/build/CoreLint.o
6265 HC [stage 1] compiler/stage2/build/TcUnify.o-boot
6266 HC [stage 1] compiler/stage2/build/TcExpr.o-boot
6267 HC [stage 1] compiler/stage2/build/TcSplice.o-boot
6268 HC [stage 1] compiler/stage2/build/RnExpr.o-boot
6269 HC [stage 1] compiler/stage2/build/RnHsDoc.o
6270 HC [stage 1] compiler/stage2/build/TcRnDriver.o-boot
6271 HC [stage 1] compiler/stage2/build/TcHoleErrors.o-boot
6272 HC [stage 1] compiler/stage2/build/TcEvTerm.o
6273 HC [stage 1] compiler/stage2/build/TcMatches.o-boot
6274 HC [stage 1] compiler/stage2/build/HeaderInfo.o
6275 HC [stage 1] compiler/stage2/build/ExtractDocs.o
6276 HC [stage 1] compiler/stage2/build/DsUsage.o
6277 HC [stage 1] compiler/stage2/build/CodeOutput.o
6278 HC [stage 1] compiler/stage2/build/SetLevels.o
6279 HC [stage 1] compiler/stage2/build/FloatIn.o
6280 HC [stage 1] compiler/stage2/build/SimplMonad.o
6281 HC [stage 1] compiler/stage2/build/TcRnMonad.o
6282 HC [stage 1] compiler/stage2/build/MkId.o
6283 HC [stage 1] compiler/stage2/build/GHCi.o
6284 HC [stage 1] compiler/stage2/build/SimplEnv.o
6285 HC [stage 1] compiler/stage2/build/PrelInfo.o
6286 HC [stage 1] compiler/stage2/build/ToIface.o
6287 HC [stage 1] compiler/stage2/build/UnariseStg.o
6288 HC [stage 1] compiler/stage2/build/CoreToStg.o
6289 HC [stage 1] compiler/stage2/build/WwLib.o
6290 HC [stage 1] compiler/stage2/build/Specialise.o
6291

Drydock: Prepare tree

When
Completed at Dec 18 2018, 11:45 AM · Built for 1 m, 2 s
Status
Passed

Build Log 342934 (remote - stderr)
25 - 50 - 100 - Unlimited Lines

1+ git clean -qxfd
2+ git submodule foreach git checkout .
3+ git submodule foreach git clean -qxfd
4+ git submodule sync
5+ git submodule update --init --recursive
6+ git submodule foreach -q git clean -qxfd
7

Build Log 342933 (remote - stdout)
25 - 50 - 100 - Unlimited Lines

1Entering '.arc-linters/arcanist-external-json-linter'
2Entering 'libffi-tarballs'
3Entering 'libraries/Cabal'
4Entering 'libraries/Win32'
5Entering 'libraries/array'
6Entering 'libraries/binary'
7Entering 'libraries/bytestring'
8Entering 'libraries/containers'
9Entering 'libraries/deepseq'
10Entering 'libraries/directory'
11Entering 'libraries/filepath'
12Entering 'libraries/haskeline'
13Entering 'libraries/hpc'
14Entering 'libraries/integer-gmp/gmp/gmp-tarballs'
15Entering 'libraries/mtl'
16Entering 'libraries/parallel'
17Entering 'libraries/parsec'
18Entering 'libraries/pretty'
19Entering 'libraries/process'
20Entering 'libraries/stm'
21Entering 'libraries/terminfo'
22Entering 'libraries/text'
23Entering 'libraries/time'
24Entering 'libraries/transformers'
25Entering 'libraries/unix'
26Entering 'libraries/xhtml'
27Entering 'nofib'
28Entering 'utils/haddock'
29Entering 'utils/hsc2hs'
30Entering '.arc-linters/arcanist-external-json-linter'
31Entering 'libffi-tarballs'
32Entering 'libraries/Cabal'
33Entering 'libraries/Win32'
34Entering 'libraries/array'
35Entering 'libraries/binary'
36Entering 'libraries/bytestring'
37Entering 'libraries/containers'
38Entering 'libraries/deepseq'
39Entering 'libraries/directory'
40Entering 'libraries/filepath'
41Entering 'libraries/haskeline'
42Entering 'libraries/hpc'
43Entering 'libraries/integer-gmp/gmp/gmp-tarballs'
44Entering 'libraries/mtl'
45Entering 'libraries/parallel'
46Entering 'libraries/parsec'
47Entering 'libraries/pretty'
48Entering 'libraries/process'
49Entering 'libraries/stm'
50Entering 'libraries/terminfo'
51Entering 'libraries/text'
52Entering 'libraries/time'
53Entering 'libraries/transformers'
54Entering 'libraries/unix'
55Entering 'libraries/xhtml'
56Entering 'nofib'
57Entering 'utils/haddock'
58Entering 'utils/hsc2hs'
59Synchronizing submodule url for '.arc-linters/arcanist-external-json-linter'
60Synchronizing submodule url for 'libffi-tarballs'
61Synchronizing submodule url for 'libraries/Cabal'
62Synchronizing submodule url for 'libraries/Win32'
63Synchronizing submodule url for 'libraries/array'
64Synchronizing submodule url for 'libraries/binary'
65Synchronizing submodule url for 'libraries/bytestring'
66Synchronizing submodule url for 'libraries/containers'
67Synchronizing submodule url for 'libraries/deepseq'
68Synchronizing submodule url for 'libraries/directory'
69Synchronizing submodule url for 'libraries/filepath'
70Synchronizing submodule url for 'libraries/haskeline'
71Synchronizing submodule url for 'libraries/hpc'
72Synchronizing submodule url for 'libraries/integer-gmp/gmp/gmp-tarballs'
73Synchronizing submodule url for 'libraries/mtl'
74Synchronizing submodule url for 'libraries/parallel'
75Synchronizing submodule url for 'libraries/parsec'
76Synchronizing submodule url for 'libraries/pretty'
77Synchronizing submodule url for 'libraries/process'
78Synchronizing submodule url for 'libraries/stm'
79Synchronizing submodule url for 'libraries/terminfo'
80Synchronizing submodule url for 'libraries/text'
81Synchronizing submodule url for 'libraries/time'
82Synchronizing submodule url for 'libraries/transformers'
83Synchronizing submodule url for 'libraries/unix'
84Synchronizing submodule url for 'libraries/xhtml'
85Synchronizing submodule url for 'nofib'
86Synchronizing submodule url for 'utils/haddock'
87Synchronizing submodule url for 'utils/hsc2hs'
88

Lease Working Copy

When
Completed at Dec 18 2018, 11:44 AM · Built for 37 s
Status
Passed