Build 64731

Properties

Drydock: Build

When
Completed at Dec 17 2018, 2:59 PM · Built for 36 m, 21 s
Status
Failed

Build Log 342842 (remote - stderr)
25 - 50 - 100 - Unlimited Lines

325utils/runghc/ghc.mk:30: utils/runghc/dist-install/build/.depend.haskell: No such file or directory
326utils/runghc/ghc.mk:30: utils/runghc/dist-install/build/.depend.c_asm: No such file or directory
327ghc/ghc.mk:112: ghc/stage2/build/.depend.haskell: No such file or directory
328ghc/ghc.mk:112: ghc/stage2/build/.depend.c_asm: No such file or directory
329utils/compare_sizes/ghc.mk:8: utils/compare_sizes/dist-install/build/.depend.haskell: No such file or directory
330utils/compare_sizes/ghc.mk:8: utils/compare_sizes/dist-install/build/.depend.c_asm: No such file or directory
331utils/iserv/ghc.mk:100: utils/iserv/stage2/build/.depend.haskell: No such file or directory
332utils/iserv/ghc.mk:100: utils/iserv/stage2/build/.depend.c_asm: No such file or directory
333utils/iserv/ghc.mk:108: utils/iserv/stage2_dyn/build/.depend.haskell: No such file or directory
334utils/iserv/ghc.mk:108: utils/iserv/stage2_dyn/build/.depend.c_asm: No such file or directory
335unused terminals: 1
336unused terminals: 2
337Makefile:3406: warning: overriding recipe for target 'libffi.map'
338Makefile:731: warning: ignoring old recipe for target 'libffi.map'
339Makefile:1804: warning: overriding recipe for target 'libffi.map'
340Makefile:672: warning: ignoring old recipe for target 'libffi.map'
341Makefile:1804: warning: overriding recipe for target 'libffi.map'
342Makefile:672: warning: ignoring old recipe for target 'libffi.map'
343Makefile:1804: warning: overriding recipe for target 'libffi.map'
344Makefile:672: warning: ignoring old recipe for target 'libffi.map'
345ar: `u' modifier ignored since `D' is the default (see `U')
346ar: `u' modifier ignored since `D' is the default (see `U')
347Makefile:3406: warning: overriding recipe for target 'libffi.map'
348Makefile:731: warning: ignoring old recipe for target 'libffi.map'
349Makefile:1804: warning: overriding recipe for target 'libffi.map'
350Makefile:672: warning: ignoring old recipe for target 'libffi.map'
351Makefile:1804: warning: overriding recipe for target 'libffi.map'
352Makefile:672: warning: ignoring old recipe for target 'libffi.map'
353Makefile:1804: warning: overriding recipe for target 'libffi.map'
354Makefile:672: warning: ignoring old recipe for target 'libffi.map'
355/var/drydock/workingcopy-121291/repo/glasgow-haskell-compiler/utils/haddock/doc/markup.rst:11: WARNING: malformed hyperlink target.
356/var/drydock/workingcopy-121291/repo/glasgow-haskell-compiler/utils/haddock/doc/invoking.rst:549: WARNING: unknown option: -cpp
357/var/drydock/workingcopy-121291/repo/glasgow-haskell-compiler/utils/haddock/doc/markup.rst:178: WARNING: undefined label: top-level-declaration (if the link has no caption the label must precede a section header)
358Warning: -rtsopts and -with-rtsopts have no effect with -no-hs-main.
359 Call hs_init_ghc() from your main() function to set these options.
360Warning: -rtsopts and -with-rtsopts have no effect with -no-hs-main.
361 Call hs_init_ghc() from your main() function to set these options.
362Warning: -rtsopts and -with-rtsopts have no effect with -no-hs-main.
363 Call hs_init_ghc() from your main() function to set these options.
364
365Sphinx error:
366ghc-flag ([u'-Wmissing-deriving-strategies', u':shortdesc: warn when a deriving clause is missing a deriving strategy', u':type: dynamic', u':reverse: -Wno-missing-deriving-strategies', u':category:']) directive missing :shortdesc: key
367make[1]: *** [docs/users_guide/build-man/ghc.1] Error 1
368make[1]: *** Waiting for unfinished jobs....
369
370Sphinx error:
371ghc-flag ([u'-Wmissing-deriving-strategies', u':shortdesc: warn when a deriving clause is missing a deriving strategy', u':type: dynamic', u':reverse: -Wno-missing-deriving-strategies', u':category:']) directive missing :shortdesc: key
372make[1]: *** [docs/users_guide/build-html/users_guide/index.html] Error 1
373make: *** [all] Error 2
374

Build Log 342841 (remote - stdout)
25 - 50 - 100 - Unlimited Lines

3658 rts_dist_HC rts/dist/build/posix/GetTime.o
3659reading sources... [ 57%] parallel
3660 rts_dist_HC rts/dist/build/posix/OSThreads.o
3661reading sources... [ 60%] phases
3662reading sources... [ 63%] profiling
3663 rts_dist_HC rts/dist/build/posix/Itimer.o
3664 rts_dist_HC rts/dist/build/posix/TTY.o
3665reading sources... [ 63%] profiling
3666reading sources... [ 65%] runghc
3667 rts_dist_HC rts/dist/build/posix/Signals.o
3668reading sources... [ 68%] runtime_control
3669reading sources... [ 65%] runghc
3670reading sources... [ 68%] runtime_control
3671 rts_dist_HC rts/dist/build/posix/Select.o
3672 rts_dist_HC rts/dist/build/posix/GetEnv.o
3673reading sources... [ 71%] safe_haskell
3674 HC [stage 0] utils/genapply/dist/build/tmp/genapply
3675reading sources... [ 71%] safe_haskell
3676reading sources... [ 73%] separate_compilation
3677reading sources... [ 73%] separate_compilation
3678 HC [stage 1] libraries/haskeline/dist-install/build/cbits/h_wcwidth.o
3679reading sources... [ 76%] shared_libs
3680reading sources... [ 78%] sooner
3681 HC [stage 1] libraries/haskeline/dist-install/build/cbits/h_wcwidth.dyn_o
3682reading sources... [ 81%] usage
3683reading sources... [ 84%] using
3684reading sources... [ 76%] shared_libs
3685reading sources... [ 78%] sooner
3686 HC [stage 1] libraries/base/dist-install/build/cbits/CastFloatWord.dyn_o
3687reading sources... [ 81%] usage
3688reading sources... [ 84%] using
3689 HC [stage 1] libraries/base/dist-install/build/cbits/DarwinUtils.dyn_o
3690 HC [stage 1] libraries/base/dist-install/build/cbits/PrelIOUtils.dyn_o
3691reading sources... [ 86%] using-concurrent
3692reading sources... [ 89%] using-optimisation
3693 HC [stage 1] libraries/base/dist-install/build/cbits/SetEnv.dyn_o
3694reading sources... [ 86%] using-concurrent
3695 HC [stage 1] libraries/base/dist-install/build/cbits/WCsubst.dyn_o
3696reading sources... [ 89%] using-optimisation
3697 HC [stage 1] libraries/base/dist-install/build/cbits/Win32Utils.dyn_o
3698 HC [stage 1] libraries/base/dist-install/build/cbits/consUtils.dyn_o
3699 HC [stage 1] libraries/base/dist-install/build/cbits/iconv.dyn_o
3700 HC [stage 1] libraries/base/dist-install/build/cbits/inputReady.dyn_o
3701reading sources... [ 92%] using-warnings
3702reading sources... [ 92%] using-warnings
3703 HC [stage 1] libraries/base/dist-install/build/cbits/md5.dyn_o
3704docs/users_guide/ghc.mk:28: recipe for target 'docs/users_guide/build-man/ghc.1' failed
3705docs/users_guide/ghc.mk:16: recipe for target 'docs/users_guide/build-html/users_guide/index.html' failed
3706Makefile:123: recipe for target 'all' failed
3707

Drydock: Prepare tree

When
Completed at Dec 17 2018, 2:23 PM · Built for 18 s
Status
Passed

Build Log 342840 (remote - stderr)
25 - 50 - 100 - Unlimited Lines

1+ git clean -qxfd
2+ git submodule sync
3+ git submodule update --init --recursive
4+ git submodule foreach -q git clean -qxfd
5

Build Log 342839 (remote - stdout)
25 - 50 - 100 - Unlimited Lines

1Synchronizing submodule url for '.arc-linters/arcanist-external-json-linter'
2Synchronizing submodule url for 'libffi-tarballs'
3Synchronizing submodule url for 'libraries/Cabal'
4Synchronizing submodule url for 'libraries/Win32'
5Synchronizing submodule url for 'libraries/array'
6Synchronizing submodule url for 'libraries/binary'
7Synchronizing submodule url for 'libraries/bytestring'
8Synchronizing submodule url for 'libraries/containers'
9Synchronizing submodule url for 'libraries/deepseq'
10Synchronizing submodule url for 'libraries/directory'
11Synchronizing submodule url for 'libraries/filepath'
12Synchronizing submodule url for 'libraries/haskeline'
13Synchronizing submodule url for 'libraries/hpc'
14Synchronizing submodule url for 'libraries/integer-gmp/gmp/gmp-tarballs'
15Synchronizing submodule url for 'libraries/mtl'
16Synchronizing submodule url for 'libraries/parallel'
17Synchronizing submodule url for 'libraries/parsec'
18Synchronizing submodule url for 'libraries/pretty'
19Synchronizing submodule url for 'libraries/process'
20Synchronizing submodule url for 'libraries/stm'
21Synchronizing submodule url for 'libraries/terminfo'
22Synchronizing submodule url for 'libraries/text'
23Synchronizing submodule url for 'libraries/time'
24Synchronizing submodule url for 'libraries/transformers'
25Synchronizing submodule url for 'libraries/unix'
26Synchronizing submodule url for 'libraries/xhtml'
27Synchronizing submodule url for 'nofib'
28Synchronizing submodule url for 'utils/haddock'
29Synchronizing submodule url for 'utils/hsc2hs'
30

Build Working Copy

When
Completed at Dec 17 2018, 2:22 PM · Built for 5 h, 10 m
Status
Passed
Description

Lease a working copy for Linux/amd64 builds.