Build 64731

Properties

Drydock: Build

When
Completed at Dec 17 2018, 2:59 PM · Built for 36 m, 21 s
Status
Failed

Build Log 342842 (remote - stderr)
25 - 50 - 100 - Unlimited Lines

275libraries/text/ghc.mk:4: libraries/text/dist-install/build/.depend-v-dyn.haskell: No such file or directory
276libraries/text/ghc.mk:4: libraries/text/dist-install/build/.depend-v-dyn.c_asm: No such file or directory
277libraries/transformers/ghc.mk:4: libraries/transformers/dist-install/build/.depend-v-dyn.haskell: No such file or directory
278libraries/transformers/ghc.mk:4: libraries/transformers/dist-install/build/.depend-v-dyn.c_asm: No such file or directory
279libraries/mtl/ghc.mk:4: libraries/mtl/dist-install/build/.depend-v-dyn.haskell: No such file or directory
280libraries/mtl/ghc.mk:4: libraries/mtl/dist-install/build/.depend-v-dyn.c_asm: No such file or directory
281libraries/parsec/ghc.mk:4: libraries/parsec/dist-install/build/.depend-v-dyn.haskell: No such file or directory
282libraries/parsec/ghc.mk:4: libraries/parsec/dist-install/build/.depend-v-dyn.c_asm: No such file or directory
283libraries/Cabal/Cabal/ghc.mk:4: libraries/Cabal/Cabal/dist-install/build/.depend-v-dyn.haskell: No such file or directory
284libraries/Cabal/Cabal/ghc.mk:4: libraries/Cabal/Cabal/dist-install/build/.depend-v-dyn.c_asm: No such file or directory
285libraries/ghc-boot-th/ghc.mk:4: libraries/ghc-boot-th/dist-install/build/.depend-v-dyn.haskell: No such file or directory
286libraries/ghc-boot-th/ghc.mk:4: libraries/ghc-boot-th/dist-install/build/.depend-v-dyn.c_asm: No such file or directory
287libraries/ghc-boot/ghc.mk:4: libraries/ghc-boot/dist-install/build/.depend-v-dyn.haskell: No such file or directory
288libraries/ghc-boot/ghc.mk:4: libraries/ghc-boot/dist-install/build/.depend-v-dyn.c_asm: No such file or directory
289libraries/template-haskell/ghc.mk:4: libraries/template-haskell/dist-install/build/.depend-v-dyn.haskell: No such file or directory
290libraries/template-haskell/ghc.mk:4: libraries/template-haskell/dist-install/build/.depend-v-dyn.c_asm: No such file or directory
291libraries/ghc-compact/ghc.mk:4: libraries/ghc-compact/dist-install/build/.depend-v-dyn.haskell: No such file or directory
292libraries/ghc-compact/ghc.mk:4: libraries/ghc-compact/dist-install/build/.depend-v-dyn.c_asm: No such file or directory
293libraries/ghc-heap/ghc.mk:4: libraries/ghc-heap/dist-install/build/.depend-v-dyn.haskell: No such file or directory
294libraries/ghc-heap/ghc.mk:4: libraries/ghc-heap/dist-install/build/.depend-v-dyn.c_asm: No such file or directory
295libraries/xhtml/ghc.mk:4: libraries/xhtml/dist-install/build/.depend-v-dyn.haskell: No such file or directory
296libraries/xhtml/ghc.mk:4: libraries/xhtml/dist-install/build/.depend-v-dyn.c_asm: No such file or directory
297libraries/terminfo/ghc.mk:4: libraries/terminfo/dist-install/build/.depend-v-dyn.haskell: No such file or directory
298libraries/terminfo/ghc.mk:4: libraries/terminfo/dist-install/build/.depend-v-dyn.c_asm: No such file or directory
299libraries/stm/ghc.mk:4: libraries/stm/dist-install/build/.depend-v-dyn.haskell: No such file or directory
300libraries/stm/ghc.mk:4: libraries/stm/dist-install/build/.depend-v-dyn.c_asm: No such file or directory
301libraries/haskeline/ghc.mk:4: libraries/haskeline/dist-install/build/.depend-v-dyn.haskell: No such file or directory
302libraries/haskeline/ghc.mk:4: libraries/haskeline/dist-install/build/.depend-v-dyn.c_asm: No such file or directory
303libraries/ghci/ghc.mk:4: libraries/ghci/dist-install/build/.depend-v-dyn.haskell: No such file or directory
304libraries/ghci/ghc.mk:4: libraries/ghci/dist-install/build/.depend-v-dyn.c_asm: No such file or directory
305libraries/libiserv/ghc.mk:4: libraries/libiserv/dist-install/build/.depend-v-dyn.haskell: No such file or directory
306libraries/libiserv/ghc.mk:4: libraries/libiserv/dist-install/build/.depend-v-dyn.c_asm: No such file or directory
307utils/haddock/ghc.mk:20: utils/haddock/dist/build/.depend.haskell: No such file or directory
308utils/haddock/ghc.mk:20: utils/haddock/dist/build/.depend.c_asm: No such file or directory
309compiler/ghc.mk:445: compiler/stage2/build/.depend-v-dyn.haskell: No such file or directory
310compiler/ghc.mk:445: compiler/stage2/build/.depend-v-dyn.c_asm: No such file or directory
311utils/hsc2hs/ghc.mk:22: utils/hsc2hs/dist-install/build/.depend.haskell: No such file or directory
312utils/hsc2hs/ghc.mk:22: utils/hsc2hs/dist-install/build/.depend.c_asm: No such file or directory
313utils/ghc-pkg/ghc.mk:93: utils/ghc-pkg/dist-install/build/.depend.haskell: No such file or directory
314utils/ghc-pkg/ghc.mk:93: utils/ghc-pkg/dist-install/build/.depend.c_asm: No such file or directory
315utils/ghctags/ghc.mk:18: utils/ghctags/dist-install/build/.depend.haskell: No such file or directory
316utils/ghctags/ghc.mk:18: utils/ghctags/dist-install/build/.depend.c_asm: No such file or directory
317utils/check-api-annotations/ghc.mk:18: utils/check-api-annotations/dist-install/build/.depend.haskell: No such file or directory
318utils/check-api-annotations/ghc.mk:18: utils/check-api-annotations/dist-install/build/.depend.c_asm: No such file or directory
319utils/check-ppr/ghc.mk:18: utils/check-ppr/dist-install/build/.depend.haskell: No such file or directory
320utils/check-ppr/ghc.mk:18: utils/check-ppr/dist-install/build/.depend.c_asm: No such file or directory
321utils/ghc-cabal/ghc.mk:103: utils/ghc-cabal/dist-install/build/.depend.haskell: No such file or directory
322utils/ghc-cabal/ghc.mk:103: utils/ghc-cabal/dist-install/build/.depend.c_asm: No such file or directory
323utils/hpc/ghc.mk:21: utils/hpc/dist-install/build/.depend.haskell: No such file or directory
324utils/hpc/ghc.mk:21: utils/hpc/dist-install/build/.depend.c_asm: No such file or directory
325utils/runghc/ghc.mk:30: utils/runghc/dist-install/build/.depend.haskell: No such file or directory
326utils/runghc/ghc.mk:30: utils/runghc/dist-install/build/.depend.c_asm: No such file or directory
327ghc/ghc.mk:112: ghc/stage2/build/.depend.haskell: No such file or directory
328ghc/ghc.mk:112: ghc/stage2/build/.depend.c_asm: No such file or directory
329utils/compare_sizes/ghc.mk:8: utils/compare_sizes/dist-install/build/.depend.haskell: No such file or directory
330utils/compare_sizes/ghc.mk:8: utils/compare_sizes/dist-install/build/.depend.c_asm: No such file or directory
331utils/iserv/ghc.mk:100: utils/iserv/stage2/build/.depend.haskell: No such file or directory
332utils/iserv/ghc.mk:100: utils/iserv/stage2/build/.depend.c_asm: No such file or directory
333utils/iserv/ghc.mk:108: utils/iserv/stage2_dyn/build/.depend.haskell: No such file or directory
334utils/iserv/ghc.mk:108: utils/iserv/stage2_dyn/build/.depend.c_asm: No such file or directory
335unused terminals: 1
336unused terminals: 2
337Makefile:3406: warning: overriding recipe for target 'libffi.map'
338Makefile:731: warning: ignoring old recipe for target 'libffi.map'
339Makefile:1804: warning: overriding recipe for target 'libffi.map'
340Makefile:672: warning: ignoring old recipe for target 'libffi.map'
341Makefile:1804: warning: overriding recipe for target 'libffi.map'
342Makefile:672: warning: ignoring old recipe for target 'libffi.map'
343Makefile:1804: warning: overriding recipe for target 'libffi.map'
344Makefile:672: warning: ignoring old recipe for target 'libffi.map'
345ar: `u' modifier ignored since `D' is the default (see `U')
346ar: `u' modifier ignored since `D' is the default (see `U')
347Makefile:3406: warning: overriding recipe for target 'libffi.map'
348Makefile:731: warning: ignoring old recipe for target 'libffi.map'
349Makefile:1804: warning: overriding recipe for target 'libffi.map'
350Makefile:672: warning: ignoring old recipe for target 'libffi.map'
351Makefile:1804: warning: overriding recipe for target 'libffi.map'
352Makefile:672: warning: ignoring old recipe for target 'libffi.map'
353Makefile:1804: warning: overriding recipe for target 'libffi.map'
354Makefile:672: warning: ignoring old recipe for target 'libffi.map'
355/var/drydock/workingcopy-121291/repo/glasgow-haskell-compiler/utils/haddock/doc/markup.rst:11: WARNING: malformed hyperlink target.
356/var/drydock/workingcopy-121291/repo/glasgow-haskell-compiler/utils/haddock/doc/invoking.rst:549: WARNING: unknown option: -cpp
357/var/drydock/workingcopy-121291/repo/glasgow-haskell-compiler/utils/haddock/doc/markup.rst:178: WARNING: undefined label: top-level-declaration (if the link has no caption the label must precede a section header)
358Warning: -rtsopts and -with-rtsopts have no effect with -no-hs-main.
359 Call hs_init_ghc() from your main() function to set these options.
360Warning: -rtsopts and -with-rtsopts have no effect with -no-hs-main.
361 Call hs_init_ghc() from your main() function to set these options.
362Warning: -rtsopts and -with-rtsopts have no effect with -no-hs-main.
363 Call hs_init_ghc() from your main() function to set these options.
364
365Sphinx error:
366ghc-flag ([u'-Wmissing-deriving-strategies', u':shortdesc: warn when a deriving clause is missing a deriving strategy', u':type: dynamic', u':reverse: -Wno-missing-deriving-strategies', u':category:']) directive missing :shortdesc: key
367make[1]: *** [docs/users_guide/build-man/ghc.1] Error 1
368make[1]: *** Waiting for unfinished jobs....
369
370Sphinx error:
371ghc-flag ([u'-Wmissing-deriving-strategies', u':shortdesc: warn when a deriving clause is missing a deriving strategy', u':type: dynamic', u':reverse: -Wno-missing-deriving-strategies', u':category:']) directive missing :shortdesc: key
372make[1]: *** [docs/users_guide/build-html/users_guide/index.html] Error 1
373make: *** [all] Error 2
374

Build Log 342841 (remote - stdout)
25 - 50 - 100 - Unlimited Lines

3608 rts_dist_HC rts/dist/build/hooks/LongGCSync.o
3609 rts_dist_HC rts/dist/build/hooks/StackOverflow.o
3610 rts_dist_HC rts/dist/build/sm/MBlock.o
3611 rts_dist_HC rts/dist/build/sm/Scav.o
3612reading sources... [ 39%] glasgow_exts
3613reading sources... [ 39%] glasgow_exts
3614 rts_dist_HC rts/dist/build/sm/Compact.o
3615 rts_dist_HC rts/dist/build/sm/CNF.o
3616 rts_dist_HC rts/dist/build/sm/Sweep.o
3617 rts_dist_HC rts/dist/build/sm/GCAux.o
3618 rts_dist_HC rts/dist/build/sm/GCUtils.o
3619 rts_dist_HC rts/dist/build/sm/BlockAlloc.o
3620 rts_dist_HC rts/dist/build/sm/Evac_thr.o
3621 rts_dist_HC rts/dist/build/sm/MarkWeak.o
3622 rts_dist_HC rts/dist/build/sm/GC.o
3623 rts_dist_HC rts/dist/build/sm/Sanity.o
3624 rts_dist_HC rts/dist/build/sm/Evac.o
3625 rts_dist_HC rts/dist/build/sm/Storage.o
3626 rts_dist_HC rts/dist/build/sm/Scav_thr.o
3627 rts_dist_HC rts/dist/build/eventlog/EventLogWriter.o
3628 rts_dist_HC rts/dist/build/eventlog/EventLog.o
3629 rts_dist_HC rts/dist/build/linker/elf_reloc_aarch64.o
3630 rts_dist_HC rts/dist/build/linker/MachO.o
3631 rts_dist_HC rts/dist/build/linker/PEi386.o
3632 rts_dist_HC rts/dist/build/linker/elf_plt.o
3633 rts_dist_HC rts/dist/build/linker/elf_reloc.o
3634 rts_dist_HC rts/dist/build/linker/elf_plt_aarch64.o
3635 rts_dist_HC rts/dist/build/linker/M32Alloc.o
3636 rts_dist_HC rts/dist/build/linker/Elf.o
3637 rts_dist_HC rts/dist/build/linker/CacheFlush.o
3638 rts_dist_HC rts/dist/build/linker/elf_got.o
3639 rts_dist_HC rts/dist/build/linker/SymbolExtras.o
3640 rts_dist_HC rts/dist/build/linker/elf_plt_arm.o
3641 rts_dist_HC rts/dist/build/linker/LoadArchive.o
3642reading sources... [ 42%] gone_wrong
3643reading sources... [ 44%] index
3644reading sources... [ 47%] intro
3645reading sources... [ 50%] lang
3646reading sources... [ 52%] license
3647reading sources... [ 55%] packages
3648 rts_dist_HC rts/dist/build/linker/elf_util.o
3649reading sources... [ 42%] gone_wrong
3650reading sources... [ 44%] index
3651reading sources... [ 47%] intro
3652reading sources... [ 50%] lang
3653reading sources... [ 52%] license
3654 rts_dist_HC rts/dist/build/posix/OSMem.o
3655reading sources... [ 55%] packages
3656reading sources... [ 57%] parallel
3657reading sources... [ 60%] phases
3658 rts_dist_HC rts/dist/build/posix/GetTime.o
3659reading sources... [ 57%] parallel
3660 rts_dist_HC rts/dist/build/posix/OSThreads.o
3661reading sources... [ 60%] phases
3662reading sources... [ 63%] profiling
3663 rts_dist_HC rts/dist/build/posix/Itimer.o
3664 rts_dist_HC rts/dist/build/posix/TTY.o
3665reading sources... [ 63%] profiling
3666reading sources... [ 65%] runghc
3667 rts_dist_HC rts/dist/build/posix/Signals.o
3668reading sources... [ 68%] runtime_control
3669reading sources... [ 65%] runghc
3670reading sources... [ 68%] runtime_control
3671 rts_dist_HC rts/dist/build/posix/Select.o
3672 rts_dist_HC rts/dist/build/posix/GetEnv.o
3673reading sources... [ 71%] safe_haskell
3674 HC [stage 0] utils/genapply/dist/build/tmp/genapply
3675reading sources... [ 71%] safe_haskell
3676reading sources... [ 73%] separate_compilation
3677reading sources... [ 73%] separate_compilation
3678 HC [stage 1] libraries/haskeline/dist-install/build/cbits/h_wcwidth.o
3679reading sources... [ 76%] shared_libs
3680reading sources... [ 78%] sooner
3681 HC [stage 1] libraries/haskeline/dist-install/build/cbits/h_wcwidth.dyn_o
3682reading sources... [ 81%] usage
3683reading sources... [ 84%] using
3684reading sources... [ 76%] shared_libs
3685reading sources... [ 78%] sooner
3686 HC [stage 1] libraries/base/dist-install/build/cbits/CastFloatWord.dyn_o
3687reading sources... [ 81%] usage
3688reading sources... [ 84%] using
3689 HC [stage 1] libraries/base/dist-install/build/cbits/DarwinUtils.dyn_o
3690 HC [stage 1] libraries/base/dist-install/build/cbits/PrelIOUtils.dyn_o
3691reading sources... [ 86%] using-concurrent
3692reading sources... [ 89%] using-optimisation
3693 HC [stage 1] libraries/base/dist-install/build/cbits/SetEnv.dyn_o
3694reading sources... [ 86%] using-concurrent
3695 HC [stage 1] libraries/base/dist-install/build/cbits/WCsubst.dyn_o
3696reading sources... [ 89%] using-optimisation
3697 HC [stage 1] libraries/base/dist-install/build/cbits/Win32Utils.dyn_o
3698 HC [stage 1] libraries/base/dist-install/build/cbits/consUtils.dyn_o
3699 HC [stage 1] libraries/base/dist-install/build/cbits/iconv.dyn_o
3700 HC [stage 1] libraries/base/dist-install/build/cbits/inputReady.dyn_o
3701reading sources... [ 92%] using-warnings
3702reading sources... [ 92%] using-warnings
3703 HC [stage 1] libraries/base/dist-install/build/cbits/md5.dyn_o
3704docs/users_guide/ghc.mk:28: recipe for target 'docs/users_guide/build-man/ghc.1' failed
3705docs/users_guide/ghc.mk:16: recipe for target 'docs/users_guide/build-html/users_guide/index.html' failed
3706Makefile:123: recipe for target 'all' failed
3707

Drydock: Prepare tree

When
Completed at Dec 17 2018, 2:23 PM · Built for 18 s
Status
Passed

Build Log 342840 (remote - stderr)
25 - 50 - 100 - Unlimited Lines

1+ git clean -qxfd
2+ git submodule sync
3+ git submodule update --init --recursive
4+ git submodule foreach -q git clean -qxfd
5

Build Log 342839 (remote - stdout)
25 - 50 - 100 - Unlimited Lines

1Synchronizing submodule url for '.arc-linters/arcanist-external-json-linter'
2Synchronizing submodule url for 'libffi-tarballs'
3Synchronizing submodule url for 'libraries/Cabal'
4Synchronizing submodule url for 'libraries/Win32'
5Synchronizing submodule url for 'libraries/array'
6Synchronizing submodule url for 'libraries/binary'
7Synchronizing submodule url for 'libraries/bytestring'
8Synchronizing submodule url for 'libraries/containers'
9Synchronizing submodule url for 'libraries/deepseq'
10Synchronizing submodule url for 'libraries/directory'
11Synchronizing submodule url for 'libraries/filepath'
12Synchronizing submodule url for 'libraries/haskeline'
13Synchronizing submodule url for 'libraries/hpc'
14Synchronizing submodule url for 'libraries/integer-gmp/gmp/gmp-tarballs'
15Synchronizing submodule url for 'libraries/mtl'
16Synchronizing submodule url for 'libraries/parallel'
17Synchronizing submodule url for 'libraries/parsec'
18Synchronizing submodule url for 'libraries/pretty'
19Synchronizing submodule url for 'libraries/process'
20Synchronizing submodule url for 'libraries/stm'
21Synchronizing submodule url for 'libraries/terminfo'
22Synchronizing submodule url for 'libraries/text'
23Synchronizing submodule url for 'libraries/time'
24Synchronizing submodule url for 'libraries/transformers'
25Synchronizing submodule url for 'libraries/unix'
26Synchronizing submodule url for 'libraries/xhtml'
27Synchronizing submodule url for 'nofib'
28Synchronizing submodule url for 'utils/haddock'
29Synchronizing submodule url for 'utils/hsc2hs'
30

Build Working Copy

When
Completed at Dec 17 2018, 2:22 PM · Built for 5 h, 10 m
Status
Passed
Description

Lease a working copy for Linux/amd64 builds.