Build 64731

Properties

Drydock: Build

When
Completed at Dec 17 2018, 2:59 PM · Built for 36 m, 21 s
Status
Failed

Build Log 342842 (remote - stderr)
25 - 50 - 100 - Unlimited Lines

350Makefile:672: warning: ignoring old recipe for target 'libffi.map'
351Makefile:1804: warning: overriding recipe for target 'libffi.map'
352Makefile:672: warning: ignoring old recipe for target 'libffi.map'
353Makefile:1804: warning: overriding recipe for target 'libffi.map'
354Makefile:672: warning: ignoring old recipe for target 'libffi.map'
355/var/drydock/workingcopy-121291/repo/glasgow-haskell-compiler/utils/haddock/doc/markup.rst:11: WARNING: malformed hyperlink target.
356/var/drydock/workingcopy-121291/repo/glasgow-haskell-compiler/utils/haddock/doc/invoking.rst:549: WARNING: unknown option: -cpp
357/var/drydock/workingcopy-121291/repo/glasgow-haskell-compiler/utils/haddock/doc/markup.rst:178: WARNING: undefined label: top-level-declaration (if the link has no caption the label must precede a section header)
358Warning: -rtsopts and -with-rtsopts have no effect with -no-hs-main.
359 Call hs_init_ghc() from your main() function to set these options.
360Warning: -rtsopts and -with-rtsopts have no effect with -no-hs-main.
361 Call hs_init_ghc() from your main() function to set these options.
362Warning: -rtsopts and -with-rtsopts have no effect with -no-hs-main.
363 Call hs_init_ghc() from your main() function to set these options.
364
365Sphinx error:
366ghc-flag ([u'-Wmissing-deriving-strategies', u':shortdesc: warn when a deriving clause is missing a deriving strategy', u':type: dynamic', u':reverse: -Wno-missing-deriving-strategies', u':category:']) directive missing :shortdesc: key
367make[1]: *** [docs/users_guide/build-man/ghc.1] Error 1
368make[1]: *** Waiting for unfinished jobs....
369
370Sphinx error:
371ghc-flag ([u'-Wmissing-deriving-strategies', u':shortdesc: warn when a deriving clause is missing a deriving strategy', u':type: dynamic', u':reverse: -Wno-missing-deriving-strategies', u':category:']) directive missing :shortdesc: key
372make[1]: *** [docs/users_guide/build-html/users_guide/index.html] Error 1
373make: *** [all] Error 2
374

Build Log 342841 (remote - stdout)
25 - 50 - 100 - Unlimited Lines

3683reading sources... [ 84%] using
3684reading sources... [ 76%] shared_libs
3685reading sources... [ 78%] sooner
3686 HC [stage 1] libraries/base/dist-install/build/cbits/CastFloatWord.dyn_o
3687reading sources... [ 81%] usage
3688reading sources... [ 84%] using
3689 HC [stage 1] libraries/base/dist-install/build/cbits/DarwinUtils.dyn_o
3690 HC [stage 1] libraries/base/dist-install/build/cbits/PrelIOUtils.dyn_o
3691reading sources... [ 86%] using-concurrent
3692reading sources... [ 89%] using-optimisation
3693 HC [stage 1] libraries/base/dist-install/build/cbits/SetEnv.dyn_o
3694reading sources... [ 86%] using-concurrent
3695 HC [stage 1] libraries/base/dist-install/build/cbits/WCsubst.dyn_o
3696reading sources... [ 89%] using-optimisation
3697 HC [stage 1] libraries/base/dist-install/build/cbits/Win32Utils.dyn_o
3698 HC [stage 1] libraries/base/dist-install/build/cbits/consUtils.dyn_o
3699 HC [stage 1] libraries/base/dist-install/build/cbits/iconv.dyn_o
3700 HC [stage 1] libraries/base/dist-install/build/cbits/inputReady.dyn_o
3701reading sources... [ 92%] using-warnings
3702reading sources... [ 92%] using-warnings
3703 HC [stage 1] libraries/base/dist-install/build/cbits/md5.dyn_o
3704docs/users_guide/ghc.mk:28: recipe for target 'docs/users_guide/build-man/ghc.1' failed
3705docs/users_guide/ghc.mk:16: recipe for target 'docs/users_guide/build-html/users_guide/index.html' failed
3706Makefile:123: recipe for target 'all' failed
3707

Drydock: Prepare tree

When
Completed at Dec 17 2018, 2:23 PM · Built for 18 s
Status
Passed

Build Log 342840 (remote - stderr)
25 - 50 - 100 - Unlimited Lines

1+ git clean -qxfd
2+ git submodule sync
3+ git submodule update --init --recursive
4+ git submodule foreach -q git clean -qxfd
5

Build Log 342839 (remote - stdout)
25 - 50 - 100 - Unlimited Lines

5Synchronizing submodule url for 'libraries/binary'
6Synchronizing submodule url for 'libraries/bytestring'
7Synchronizing submodule url for 'libraries/containers'
8Synchronizing submodule url for 'libraries/deepseq'
9Synchronizing submodule url for 'libraries/directory'
10Synchronizing submodule url for 'libraries/filepath'
11Synchronizing submodule url for 'libraries/haskeline'
12Synchronizing submodule url for 'libraries/hpc'
13Synchronizing submodule url for 'libraries/integer-gmp/gmp/gmp-tarballs'
14Synchronizing submodule url for 'libraries/mtl'
15Synchronizing submodule url for 'libraries/parallel'
16Synchronizing submodule url for 'libraries/parsec'
17Synchronizing submodule url for 'libraries/pretty'
18Synchronizing submodule url for 'libraries/process'
19Synchronizing submodule url for 'libraries/stm'
20Synchronizing submodule url for 'libraries/terminfo'
21Synchronizing submodule url for 'libraries/text'
22Synchronizing submodule url for 'libraries/time'
23Synchronizing submodule url for 'libraries/transformers'
24Synchronizing submodule url for 'libraries/unix'
25Synchronizing submodule url for 'libraries/xhtml'
26Synchronizing submodule url for 'nofib'
27Synchronizing submodule url for 'utils/haddock'
28Synchronizing submodule url for 'utils/hsc2hs'
29

Build Working Copy

When
Completed at Dec 17 2018, 2:22 PM · Built for 5 h, 10 m
Status
Passed
Description

Lease a working copy for Linux/amd64 builds.