Build 64729

Properties

Drydock: Build

When
Completed at Dec 17 2018, 12:20 PM · Built for 32 m, 5 s
Status
Failed

Build Log 342816 (remote - stderr)
25 - 50 - 100 - Unlimited Lines

453 RemovedInSphinx17Warning)
454C:/msys64/var/drydock/workingcopy-121292/repo/glasgow-haskell-compiler/utils/haddock/doc/markup.rst:11: WARNING: malformed hyperlink target.
455C:/msys64/var/drydock/workingcopy-121292/repo/glasgow-haskell-compiler/utils/haddock/doc/invoking.rst:549: WARNING: unknown option: -cpp
456C:/msys64/var/drydock/workingcopy-121292/repo/glasgow-haskell-compiler/utils/haddock/doc/markup.rst:178: WARNING: undefined label: top-level-declaration (if the link has no caption the label must precede a section header)
457C:/msys64/var/drydock/workingcopy-121292/repo/glasgow-haskell-compiler/docs/users_guide/extending_ghc.rst:857: WARNING: Unexpected indentation.
458C:/msys64/var/drydock/workingcopy-121292/repo/glasgow-haskell-compiler/docs/users_guide/glasgow_exts.rst:14312: WARNING: Duplicate ID: "pragma-SPECIALIZE".
459C:/msys64/var/drydock/workingcopy-121292/repo/glasgow-haskell-compiler/docs/users_guide/glasgow_exts.rst:14312: WARNING: Duplicate ID: "pragma-SPECIALIZE".
460WARNING: C:/msys64/var/drydock/workingcopy-121292/repo/glasgow-haskell-compiler/docs/users_guide/using-optimisation.rst:: (ERROR/3) Anonymous hyperlink mismatch: 1 references but 0 targets.
461See "backrefs" attribute for IDs.
462
463Sphinx error:
464ghc-flag (['-Wmissing-deriving-strategies', ':shortdesc: warn when a deriving clause is missing a deriving strategy', ':type: dynamic', ':reverse: -Wno-missing-deriving-strategies', ':category:']) directive missing :shortdesc: key
465C:/msys64/var/drydock/workingcopy-121292/repo/glasgow-haskell-compiler/docs/users_guide/extending_ghc.rst:857: WARNING: Unexpected indentation.
466C:/msys64/var/drydock/workingcopy-121292/repo/glasgow-haskell-compiler/docs/users_guide/glasgow_exts.rst:14312: WARNING: Duplicate ID: "pragma-SPECIALIZE".
467C:/msys64/var/drydock/workingcopy-121292/repo/glasgow-haskell-compiler/docs/users_guide/glasgow_exts.rst:14312: WARNING: Duplicate ID: "pragma-SPECIALIZE".
468WARNING: C:/msys64/var/drydock/workingcopy-121292/repo/glasgow-haskell-compiler/docs/users_guide/using-optimisation.rst:: (ERROR/3) Anonymous hyperlink mismatch: 1 references but 0 targets.
469See "backrefs" attribute for IDs.
470
471Sphinx error:
472ghc-flag (['-Wmissing-deriving-strategies', ':shortdesc: warn when a deriving clause is missing a deriving strategy', ':type: dynamic', ':reverse: -Wno-missing-deriving-strategies', ':category:']) directive missing :shortdesc: key
473make[1]: *** [docs/users_guide/ghc.mk:28: docs/users_guide/build-man/ghc.1] Error 1
474make[1]: *** Waiting for unfinished jobs....
475make[1]: *** [docs/users_guide/ghc.mk:16: docs/users_guide/build-html/users_guide/index.html] Error 1
476make: *** [Makefile:128: all] Error 2
477

Build Log 342815 (remote - stdout)
25 - 50 - 100 - Unlimited Lines

4784reading sources... [ 68%] runtime_control
4785reading sources... [ 65%] runghc
4786reading sources... [ 68%] runtime_control
4787reading sources... [ 71%] safe_haskell
4788reading sources... [ 73%] separate_compilation
4789reading sources... [ 71%] safe_haskell
4790reading sources... [ 73%] separate_compilation
4791reading sources... [ 76%] shared_libs
4792reading sources... [ 78%] sooner
4793reading sources... [ 81%] usage
4794reading sources... [ 84%] using
4795reading sources... [ 76%] shared_libs
4796reading sources... [ 78%] sooner
4797 rts_dist_HC rts/dist/build/sm/GC.o
4798 rts_dist_HC rts/dist/build/sm/MarkWeak.o
4799reading sources... [ 81%] usage
4800reading sources... [ 84%] using
4801reading sources... [ 86%] using-concurrent
4802reading sources... [ 89%] using-optimisation
4803reading sources... [ 86%] using-concurrent
4804reading sources... [ 89%] using-optimisation
4805reading sources... [ 92%] using-warnings
4806reading sources... [ 92%] using-warnings
4807 rts_dist_HC rts/dist/build/sm/Evac_thr.o
4808

Drydock: Prepare tree

When
Completed at Dec 17 2018, 11:48 AM · Built for 58 s
Status
Passed

Build Log 342814 (remote - stderr)
25 - 50 - 100 - Unlimited Lines

1+ git clean -qxfd
2+ git submodule foreach git checkout .
3+ git submodule foreach git clean -qxfd
4+ git submodule sync
5+ git submodule update --init --recursive
6+ git submodule foreach -q git clean -qxfd
7

Build Log 342813 (remote - stdout)
25 - 50 - 100 - Unlimited Lines

63Synchronizing submodule url for 'libraries/binary'
64Synchronizing submodule url for 'libraries/bytestring'
65Synchronizing submodule url for 'libraries/containers'
66Synchronizing submodule url for 'libraries/deepseq'
67Synchronizing submodule url for 'libraries/directory'
68Synchronizing submodule url for 'libraries/filepath'
69Synchronizing submodule url for 'libraries/haskeline'
70Synchronizing submodule url for 'libraries/hpc'
71Synchronizing submodule url for 'libraries/integer-gmp/gmp/gmp-tarballs'
72Synchronizing submodule url for 'libraries/mtl'
73Synchronizing submodule url for 'libraries/parallel'
74Synchronizing submodule url for 'libraries/parsec'
75Synchronizing submodule url for 'libraries/pretty'
76Synchronizing submodule url for 'libraries/process'
77Synchronizing submodule url for 'libraries/stm'
78Synchronizing submodule url for 'libraries/terminfo'
79Synchronizing submodule url for 'libraries/text'
80Synchronizing submodule url for 'libraries/time'
81Synchronizing submodule url for 'libraries/transformers'
82Synchronizing submodule url for 'libraries/unix'
83Synchronizing submodule url for 'libraries/xhtml'
84Synchronizing submodule url for 'nofib'
85Synchronizing submodule url for 'utils/haddock'
86Synchronizing submodule url for 'utils/hsc2hs'
87

Lease Working Copy

When
Completed at Dec 17 2018, 11:47 AM · Built for 2 h, 34 m
Status
Passed