Build 64520

Properties

Drydock: Build

When
Completed at Dec 11 2018, 7:04 AM · Built for 1 h, 3 m
Status
Failed

Build Log 342167 (remote - stderr)
25 - 50 - 100 - Unlimited Lines

693 [TestMonad {runTest :: TestMonadEnv
694 -> Int -> IO (Either String a, Int)}]
695CheckWeights
696 [TestMonadEnv {testIsVerbose_ :: Bool,
697 testLogNestCount_ :: Int,
698 testKeepFiles_ :: Bool,
699 testGetBaseName_ :: FilePath,
700 testGetFlags_ :: [Flag],
701 testGetConfig_ :: Config,
702 testGetCompiler_ :: FilePath}]
703CheckWeights [Zipper (ZCursor a), End {zEnd :: S.Seq a}]
704CheckWeights
705 [ZCursor {zCursor :: a, zAbove :: S.Seq a, zBelow :: S.Seq a}]
706CheckWeights [Unsigned Integer, Signed Integer]
707CheckWeights
708 [LessOrEqual IntegerConstant, GreaterOrEqual IntegerConstant]
709WARNING: file compiler/simplCore/SimplCore.hs, line 680
710 Simplifier bailing out after 4 iterations [47, 2, 1, 1]
711 Size = {terms: 619, types: 829, coercions: 9, joins: 0/27}
712Warning: -rtsopts and -with-rtsopts have no effect with -shared.
713 Call hs_init_ghc() from your main() function to set these options.
714ar: creating libraries/binary/dist-install/build/libHSbinary-0.8.6.0.a
715ar: creating libraries/ghc-boot/dist-install/build/libHSghc-boot-8.7.a
716Warning: -rtsopts and -with-rtsopts have no effect with -shared.
717 Call hs_init_ghc() from your main() function to set these options.
718ar: creating libraries/haskeline/dist-install/build/libHShaskeline-0.7.4.3.a
719Warning: -rtsopts and -with-rtsopts have no effect with -shared.
720 Call hs_init_ghc() from your main() function to set these options.
721ar: creating libraries/parsec/dist-install/build/libHSparsec-3.1.13.0.a
722ar: creating libraries/text/dist-install/build/libHStext-1.2.3.1.a
723Warning: -rtsopts and -with-rtsopts have no effect with -shared.
724 Call hs_init_ghc() from your main() function to set these options.
725ar: creating libraries/ghci/dist-install/build/libHSghci-8.7.a
726Warning: -rtsopts and -with-rtsopts have no effect with -shared.
727 Call hs_init_ghc() from your main() function to set these options.
728Warning: -rtsopts and -with-rtsopts have no effect with -shared.
729 Call hs_init_ghc() from your main() function to set these options.
730ar: creating libraries/libiserv/dist-install/build/libHSlibiserv-8.7.1.a
731Warning: -rtsopts and -with-rtsopts have no effect with -shared.
732 Call hs_init_ghc() from your main() function to set these options.
733
734compiler/simplCore/HotCode.hs:5:1: error: [-Wunused-imports, -Werror=unused-imports]
735 The import of ‘defFreq’ from module ‘BasicTypes’ is redundant
736 |
7375 | import BasicTypes (defFreq, multiplyWeight)
738 | ^^^^^^^^^^^^^^^^^^^^^^^^^^^^^^^^^^^^^^^^^^^
739make[1]: *** [compiler/stage2/build/HotCode.o] Error 1
740make[1]: *** Waiting for unfinished jobs....
741make: *** [all] Error 2
742

Build Log 342166 (remote - stdout)
25 - 50 - 100 - Unlimited Lines

4802 HC [stage 1] compiler/stage2/build/RdrName.o
4803 HC [stage 1] compiler/stage2/build/FV.o
4804 HC [stage 1] compiler/stage2/build/ConLike.o-boot
4805 HC [stage 1] compiler/stage2/build/MkId.o-boot
4806 HC [stage 1] compiler/stage2/build/Coercion.o-boot
4807 HC [stage 1] compiler/stage2/build/PrelNames.o
4808 HC [stage 1] compiler/stage2/build/ApiAnnotation.o
4809 HC [stage 1] compiler/stage2/build/PlaceHolder.o
4810 HC [stage 1] compiler/stage2/build/HsExtension.o
4811 HC [stage 1] compiler/stage2/build/HsImpExp.o
4812 HC [stage 1] compiler/stage2/build/HsPat.o-boot
4813 HC [stage 1] compiler/stage2/build/HsExpr.o-boot
4814 HC [stage 1] compiler/stage2/build/Lexer.o
4815 HC [stage 1] compiler/stage2/build/TyCon.o
4816 HC [stage 1] compiler/stage2/build/THNames.o
4817 HC [stage 1] compiler/stage2/build/ToIface.o-boot
4818 HC [stage 1] compiler/stage2/build/Type.o-boot
4819 HC [stage 1] compiler/stage2/build/IfaceType.o
4820 HC [stage 1] compiler/stage2/build/CmmMonad.o
4821 HC [stage 1] compiler/stage2/build/TyCoRep.o
4822 HC [stage 1] compiler/stage2/build/Kind.o
4823 HC [stage 1] compiler/stage2/build/TysPrim.o
4824 HC [stage 1] compiler/stage2/build/Type.o
4825 HC [stage 1] compiler/stage2/build/Coercion.o
4826 HC [stage 1] compiler/stage2/build/Literal.o
4827 HC [stage 1] compiler/stage2/build/PatSyn.o
4828 HC [stage 1] compiler/stage2/build/HsLit.o
4829 HC [stage 1] compiler/stage2/build/TrieMap.o
4830 HC [stage 1] compiler/stage2/build/Unify.o
4831 HC [stage 1] compiler/stage2/build/Hoopl/Label.o
4832 HC [stage 1] compiler/stage2/build/BlockId.o-boot
4833 HC [stage 1] compiler/stage2/build/Hoopl/Graph.o
4834 HC [stage 1] compiler/stage2/build/CmmSwitch.o
4835 HC [stage 1] compiler/stage2/build/DataCon.o
4836 HC [stage 1] compiler/stage2/build/RepType.o
4837 HC [stage 1] compiler/stage2/build/Demand.o
4838 HC [stage 1] compiler/stage2/build/CoreSyn.o
4839 HC [stage 1] compiler/stage2/build/ConLike.o
4840 HC [stage 1] compiler/stage2/build/CoreMap.o
4841 HC [stage 1] compiler/stage2/build/IdInfo.o
4842 HC [stage 1] compiler/stage2/build/Id.o
4843 HC [stage 1] compiler/stage2/build/CoreStats.o
4844 HC [stage 1] compiler/stage2/build/TysWiredIn.o
4845 HC [stage 1] compiler/stage2/build/HsTypes.o
4846 HC [stage 1] compiler/stage2/build/InteractiveEvalTypes.o
4847 HC [stage 1] compiler/stage2/build/CoreSeq.o
4848 HC [stage 1] compiler/stage2/build/HotCode.o
4849compiler/ghc.mk:445: recipe for target 'compiler/stage2/build/HotCode.o' failed
4850Makefile:123: recipe for target 'all' failed
4851

Drydock: Prepare tree

When
Completed at Dec 11 2018, 6:00 AM · Built for 19 s
Status
Passed

Build Log 342165 (remote - stderr)
25 - 50 - 100 - Unlimited Lines

1+ git clean -qxfd
2+ git submodule sync
3+ git submodule update --init --recursive
4+ git submodule foreach -q git clean -qxfd
5

Build Log 342164 (remote - stdout)
25 - 50 - 100 - Unlimited Lines

1Synchronizing submodule url for '.arc-linters/arcanist-external-json-linter'
2Synchronizing submodule url for 'libffi-tarballs'
3Synchronizing submodule url for 'libraries/Cabal'
4Synchronizing submodule url for 'libraries/Win32'
5Synchronizing submodule url for 'libraries/array'
6Synchronizing submodule url for 'libraries/binary'
7Synchronizing submodule url for 'libraries/bytestring'
8Synchronizing submodule url for 'libraries/containers'
9Synchronizing submodule url for 'libraries/deepseq'
10Synchronizing submodule url for 'libraries/directory'
11Synchronizing submodule url for 'libraries/filepath'
12Synchronizing submodule url for 'libraries/haskeline'
13Synchronizing submodule url for 'libraries/hpc'
14Synchronizing submodule url for 'libraries/integer-gmp/gmp/gmp-tarballs'
15Synchronizing submodule url for 'libraries/mtl'
16Synchronizing submodule url for 'libraries/parallel'
17Synchronizing submodule url for 'libraries/parsec'
18Synchronizing submodule url for 'libraries/pretty'
19Synchronizing submodule url for 'libraries/process'
20Synchronizing submodule url for 'libraries/stm'
21Synchronizing submodule url for 'libraries/terminfo'
22Synchronizing submodule url for 'libraries/text'
23Synchronizing submodule url for 'libraries/time'
24Synchronizing submodule url for 'libraries/transformers'
25Synchronizing submodule url for 'libraries/unix'
26Synchronizing submodule url for 'libraries/xhtml'
27Synchronizing submodule url for 'nofib'
28Synchronizing submodule url for 'utils/haddock'
29Synchronizing submodule url for 'utils/hsc2hs'
30Submodule path 'libraries/Cabal': checked out '3da088e281f5cbc8a731e18ceb698cfea2e45004'
31Submodule path 'nofib': checked out 'a80baacfc29cc2e7ed50e94f3cd2648d11b1d7d5'
32

Build Working Copy

When
Completed at Dec 11 2018, 6:00 AM · Built for 17 h, 23 m
Status
Passed
Description

Lease a working copy for Linux/amd64 builds.