Build 64519

Properties

Drydock: Build

When
Completed at Dec 10 2018, 1:51 PM · Built for 17 m, 33 s
Status
Failed
Description

Run the build.

Build Log 342047 (remote - stderr)
25 - 50 - 100 - Unlimited Lines

1using THREADS=5
2configure: WARNING: unrecognized options: --with-nm
3ld: unknown option: --version
4./configure: line 11279: test: Sphinx (sphinx-build) 1: integer expression expected
5configure: WARNING: unrecognized options: --with-nm
6+ test -f mk/config.mk.old
7+ cp -p mk/config.mk mk/config.mk.old
8+ test -f mk/project.mk.old
9+ cp -p mk/project.mk mk/project.mk.old
10+ test -f compiler/ghc.cabal.old
11+ cp -p compiler/ghc.cabal compiler/ghc.cabal.old
12utils/genprimopcode/ghc.mk:19: utils/genprimopcode/dist/package-data.mk: No such file or directory
13utils/deriveConstants/ghc.mk:19: utils/deriveConstants/dist/package-data.mk: No such file or directory
14utils/genapply/ghc.mk:23: utils/genapply/dist/package-data.mk: No such file or directory
15libraries/hpc/ghc.mk:3: libraries/hpc/dist-boot/package-data.mk: No such file or directory
16libraries/binary/ghc.mk:3: libraries/binary/dist-boot/package-data.mk: No such file or directory
17libraries/text/ghc.mk:3: libraries/text/dist-boot/package-data.mk: No such file or directory
18libraries/transformers/ghc.mk:3: libraries/transformers/dist-boot/package-data.mk: No such file or directory
19libraries/mtl/ghc.mk:3: libraries/mtl/dist-boot/package-data.mk: No such file or directory
20libraries/parsec/ghc.mk:3: libraries/parsec/dist-boot/package-data.mk: No such file or directory
21libraries/Cabal/Cabal/ghc.mk:3: libraries/Cabal/Cabal/dist-boot/package-data.mk: No such file or directory
22libraries/ghc-boot-th/ghc.mk:3: libraries/ghc-boot-th/dist-boot/package-data.mk: No such file or directory
23libraries/ghc-boot/ghc.mk:3: libraries/ghc-boot/dist-boot/package-data.mk: No such file or directory
24libraries/template-haskell/ghc.mk:3: libraries/template-haskell/dist-boot/package-data.mk: No such file or directory
25libraries/ghc-heap/ghc.mk:3: libraries/ghc-heap/dist-boot/package-data.mk: No such file or directory
26libraries/terminfo/ghc.mk:3: libraries/terminfo/dist-boot/package-data.mk: No such file or directory
27libraries/ghci/ghc.mk:3: libraries/ghci/dist-boot/package-data.mk: No such file or directory
28compiler/ghc.mk:444: compiler/stage1/package-data.mk: No such file or directory
29utils/hsc2hs/ghc.mk:21: utils/hsc2hs/dist/package-data.mk: No such file or directory
30utils/ghc-pkg/ghc.mk:70: utils/ghc-pkg/dist/package-data.mk: No such file or directory
31ghc/ghc.mk:111: ghc/stage1/package-data.mk: No such file or directory
32binary-0.8.6.0: Warning: haddock-interfaces: /private/var/drydock/workingcopy-121290/repo/glasgow-haskell-compiler/libraries/binary/dist-boot/doc/html/binary/binary.haddock doesn't exist or isn't a file
33binary-0.8.6.0: Warning: haddock-html: /private/var/drydock/workingcopy-121290/repo/glasgow-haskell-compiler/libraries/binary/dist-boot/doc/html/binary doesn't exist or isn't a directory
34text-1.2.3.1: Warning: include-dirs: /private/var/drydock/workingcopy-121290/repo/glasgow-haskell-compiler/libraries/text/dist-boot/build/include doesn't exist or isn't a directory
35text-1.2.3.1: Warning: haddock-interfaces: /private/var/drydock/workingcopy-121290/repo/glasgow-haskell-compiler/libraries/text/dist-boot/doc/html/text/text.haddock doesn't exist or isn't a file
36text-1.2.3.1: Warning: haddock-html: /private/var/drydock/workingcopy-121290/repo/glasgow-haskell-compiler/libraries/text/dist-boot/doc/html/text doesn't exist or isn't a directory
37transformers-0.5.5.0: Warning: haddock-interfaces: /private/var/drydock/workingcopy-121290/repo/glasgow-haskell-compiler/libraries/transformers/dist-boot/doc/html/transformers/transformers.haddock doesn't exist or isn't a file
38transformers-0.5.5.0: Warning: haddock-html: /private/var/drydock/workingcopy-121290/repo/glasgow-haskell-compiler/libraries/transformers/dist-boot/doc/html/transformers doesn't exist or isn't a directory
39mtl-2.2.2: Warning: haddock-interfaces: /private/var/drydock/workingcopy-121290/repo/glasgow-haskell-compiler/libraries/mtl/dist-boot/doc/html/mtl/mtl.haddock doesn't exist or isn't a file
40mtl-2.2.2: Warning: haddock-html: /private/var/drydock/workingcopy-121290/repo/glasgow-haskell-compiler/libraries/mtl/dist-boot/doc/html/mtl doesn't exist or isn't a directory
41parsec-3.1.13.0: Warning: haddock-interfaces: /private/var/drydock/workingcopy-121290/repo/glasgow-haskell-compiler/libraries/parsec/dist-boot/doc/html/parsec/parsec.haddock doesn't exist or isn't a file
42parsec-3.1.13.0: Warning: haddock-html: /private/var/drydock/workingcopy-121290/repo/glasgow-haskell-compiler/libraries/parsec/dist-boot/doc/html/parsec doesn't exist or isn't a directory
43Cabal-2.5.0.0: Warning: haddock-interfaces: /private/var/drydock/workingcopy-121290/repo/glasgow-haskell-compiler/libraries/Cabal/Cabal/dist-boot/doc/html/Cabal/Cabal.haddock doesn't exist or isn't a file
44Cabal-2.5.0.0: Warning: haddock-html: /private/var/drydock/workingcopy-121290/repo/glasgow-haskell-compiler/libraries/Cabal/Cabal/dist-boot/doc/html/Cabal doesn't exist or isn't a directory
45hpc-0.6.0.3: Warning: haddock-interfaces: /private/var/drydock/workingcopy-121290/repo/glasgow-haskell-compiler/libraries/hpc/dist-boot/doc/html/hpc/hpc.haddock doesn't exist or isn't a file
46hpc-0.6.0.3: Warning: haddock-html: /private/var/drydock/workingcopy-121290/repo/glasgow-haskell-compiler/libraries/hpc/dist-boot/doc/html/hpc doesn't exist or isn't a directory
47ghc-boot-th-8.7: Warning: haddock-interfaces: /private/var/drydock/workingcopy-121290/repo/glasgow-haskell-compiler/libraries/ghc-boot-th/dist-boot/doc/html/ghc-boot-th/ghc-boot-th.haddock doesn't exist or isn't a file
48ghc-boot-th-8.7: Warning: haddock-html: /private/var/drydock/workingcopy-121290/repo/glasgow-haskell-compiler/libraries/ghc-boot-th/dist-boot/doc/html/ghc-boot-th doesn't exist or isn't a directory
49ghc-boot-8.7: Warning: haddock-interfaces: /private/var/drydock/workingcopy-121290/repo/glasgow-haskell-compiler/libraries/ghc-boot/dist-boot/doc/html/ghc-boot/ghc-boot.haddock doesn't exist or isn't a file
50ghc-boot-8.7: Warning: haddock-html: /private/var/drydock/workingcopy-121290/repo/glasgow-haskell-compiler/libraries/ghc-boot/dist-boot/doc/html/ghc-boot doesn't exist or isn't a directory
51template-haskell-2.15.0.0: Warning: haddock-interfaces: /private/var/drydock/workingcopy-121290/repo/glasgow-haskell-compiler/libraries/template-haskell/dist-boot/doc/html/template-haskell/template-haskell.haddock doesn't exist or isn't a file
52template-haskell-2.15.0.0: Warning: haddock-html: /private/var/drydock/workingcopy-121290/repo/glasgow-haskell-compiler/libraries/template-haskell/dist-boot/doc/html/template-haskell doesn't exist or isn't a directory
53ghc-heap-8.7: Warning: haddock-interfaces: /private/var/drydock/workingcopy-121290/repo/glasgow-haskell-compiler/libraries/ghc-heap/dist-boot/doc/html/ghc-heap/ghc-heap.haddock doesn't exist or isn't a file
54ghc-heap-8.7: Warning: haddock-html: /private/var/drydock/workingcopy-121290/repo/glasgow-haskell-compiler/libraries/ghc-heap/dist-boot/doc/html/ghc-heap doesn't exist or isn't a directory
55ghci-8.7: Warning: haddock-interfaces: /private/var/drydock/workingcopy-121290/repo/glasgow-haskell-compiler/libraries/ghci/dist-boot/doc/html/ghci/ghci.haddock doesn't exist or isn't a file
56ghci-8.7: Warning: haddock-html: /private/var/drydock/workingcopy-121290/repo/glasgow-haskell-compiler/libraries/ghci/dist-boot/doc/html/ghci doesn't exist or isn't a directory
57terminfo-0.4.1.2: Warning: haddock-interfaces: /private/var/drydock/workingcopy-121290/repo/glasgow-haskell-compiler/libraries/terminfo/dist-boot/doc/html/terminfo/terminfo.haddock doesn't exist or isn't a file
58terminfo-0.4.1.2: Warning: haddock-html: /private/var/drydock/workingcopy-121290/repo/glasgow-haskell-compiler/libraries/terminfo/dist-boot/doc/html/terminfo doesn't exist or isn't a directory
59ghc-8.7: Warning: include-dirs: /private/var/drydock/workingcopy-121290/repo/glasgow-haskell-compiler/compiler/stage1/build/parser doesn't exist or isn't a directory
60ghc-8.7: Warning: include-dirs: /private/var/drydock/workingcopy-121290/repo/glasgow-haskell-compiler/compiler/stage1/build/utils doesn't exist or isn't a directory
61ghc-8.7: Warning: include-dirs: /private/var/drydock/workingcopy-121290/repo/glasgow-haskell-compiler/compiler/stage1/build/stage1 doesn't exist or isn't a directory
62ghc-8.7: Warning: haddock-interfaces: /private/var/drydock/workingcopy-121290/repo/glasgow-haskell-compiler/compiler/stage1/doc/html/ghc/ghc.haddock doesn't exist or isn't a file
63ghc-8.7: Warning: haddock-html: /private/var/drydock/workingcopy-121290/repo/glasgow-haskell-compiler/compiler/stage1/doc/html/ghc doesn't exist or isn't a directory
64utils/unlit/ghc.mk:33: utils/unlit/dist/build/.depend.c_asm: No such file or directory
65utils/hp2ps/ghc.mk:43: utils/hp2ps/dist/build/.depend.c_asm: No such file or directory
66utils/genapply/ghc.mk:23: utils/genapply/dist/build/.depend.haskell: No such file or directory
67utils/genapply/ghc.mk:23: utils/genapply/dist/build/.depend.c_asm: No such file or directory
68libraries/hpc/ghc.mk:3: libraries/hpc/dist-boot/build/.depend-v.haskell: No such file or directory
69libraries/hpc/ghc.mk:3: libraries/hpc/dist-boot/build/.depend-v.c_asm: No such file or directory
70libraries/binary/ghc.mk:3: libraries/binary/dist-boot/build/.depend-v.haskell: No such file or directory
71libraries/binary/ghc.mk:3: libraries/binary/dist-boot/build/.depend-v.c_asm: No such file or directory
72libraries/text/ghc.mk:3: libraries/text/dist-boot/build/.depend-v.haskell: No such file or directory
73libraries/text/ghc.mk:3: libraries/text/dist-boot/build/.depend-v.c_asm: No such file or directory
74libraries/transformers/ghc.mk:3: libraries/transformers/dist-boot/build/.depend-v.haskell: No such file or directory
75libraries/transformers/ghc.mk:3: libraries/transformers/dist-boot/build/.depend-v.c_asm: No such file or directory
76libraries/mtl/ghc.mk:3: libraries/mtl/dist-boot/build/.depend-v.haskell: No such file or directory
77libraries/mtl/ghc.mk:3: libraries/mtl/dist-boot/build/.depend-v.c_asm: No such file or directory
78libraries/parsec/ghc.mk:3: libraries/parsec/dist-boot/build/.depend-v.haskell: No such file or directory
79libraries/parsec/ghc.mk:3: libraries/parsec/dist-boot/build/.depend-v.c_asm: No such file or directory
80libraries/Cabal/Cabal/ghc.mk:3: libraries/Cabal/Cabal/dist-boot/build/.depend-v.haskell: No such file or directory
81libraries/Cabal/Cabal/ghc.mk:3: libraries/Cabal/Cabal/dist-boot/build/.depend-v.c_asm: No such file or directory
82libraries/ghc-boot-th/ghc.mk:3: libraries/ghc-boot-th/dist-boot/build/.depend-v.haskell: No such file or directory
83libraries/ghc-boot-th/ghc.mk:3: libraries/ghc-boot-th/dist-boot/build/.depend-v.c_asm: No such file or directory
84libraries/ghc-boot/ghc.mk:3: libraries/ghc-boot/dist-boot/build/.depend-v.haskell: No such file or directory
85libraries/ghc-boot/ghc.mk:3: libraries/ghc-boot/dist-boot/build/.depend-v.c_asm: No such file or directory
86libraries/template-haskell/ghc.mk:3: libraries/template-haskell/dist-boot/build/.depend-v.haskell: No such file or directory
87libraries/template-haskell/ghc.mk:3: libraries/template-haskell/dist-boot/build/.depend-v.c_asm: No such file or directory
88libraries/ghc-heap/ghc.mk:3: libraries/ghc-heap/dist-boot/build/.depend-v.haskell: No such file or directory
89libraries/ghc-heap/ghc.mk:3: libraries/ghc-heap/dist-boot/build/.depend-v.c_asm: No such file or directory
90libraries/terminfo/ghc.mk:3: libraries/terminfo/dist-boot/build/.depend-v.haskell: No such file or directory
91libraries/terminfo/ghc.mk:3: libraries/terminfo/dist-boot/build/.depend-v.c_asm: No such file or directory
92libraries/ghci/ghc.mk:3: libraries/ghci/dist-boot/build/.depend-v.haskell: No such file or directory
93libraries/ghci/ghc.mk:3: libraries/ghci/dist-boot/build/.depend-v.c_asm: No such file or directory
94compiler/ghc.mk:444: compiler/stage1/build/.depend-v.haskell: No such file or directory
95compiler/ghc.mk:444: compiler/stage1/build/.depend-v.c_asm: No such file or directory
96utils/ghc-pkg/ghc.mk:70: utils/ghc-pkg/dist/build/.depend.haskell: No such file or directory
97utils/ghc-pkg/ghc.mk:70: utils/ghc-pkg/dist/build/.depend.c_asm: No such file or directory
98ghc/ghc.mk:111: ghc/stage1/build/.depend.haskell: No such file or directory
99ghc/ghc.mk:111: ghc/stage1/build/.depend.c_asm: No such file or directory
100. includes/HsFFI.h
101.. includes/ghcconfig.h
102... includes/ghcautoconf.h
103... includes/ghcplatform.h
104.. includes/stg/Types.h
105... /Applications/Xcode-7.2/Xcode.app/Contents/Developer/Toolchains/XcodeDefault.xctoolchain/usr/bin/../lib/clang/8.0.0/include/inttypes.h
106.... /usr/include/inttypes.h
107..... /usr/include/sys/cdefs.h
108In file included from /dev/fd/7:22:
109In file included from includes/HsFFI.h:20:
110In file included from includes/stg/Types.h:37:
111In file included from /Applications/Xcode-7.2/Xcode.app/Contents/Developer/Toolchains/XcodeDefault.xctoolchain/usr/bin/../lib/clang/8.0.0/include/inttypes.h:26:
112In file included from /usr/include/inttypes.h:223:
113/usr/include/sys/cdefs.h:81:2: warning: "Unsupported compiler detected" [-W#warnings]
114#warning "Unsupported compiler detected"
115 ^
116...... /usr/include/sys/_symbol_aliasing.h
117...... /usr/include/sys/_posix_availability.h
118..... /usr/include/Availability.h
119...... /usr/include/AvailabilityInternal.h
120..... /usr/include/_types.h
121...... /usr/include/sys/_types.h
122....... /usr/include/machine/_types.h
123........ /usr/include/i386/_types.h
124....... /usr/include/sys/_pthread/_pthread_types.h
125..... /usr/include/sys/_types/_wchar_t.h
126..... /Applications/Xcode-7.2/Xcode.app/Contents/Developer/Toolchains/XcodeDefault.xctoolchain/usr/bin/../lib/clang/8.0.0/include/stdint.h
127...... /usr/include/stdint.h
128....... /usr/include/sys/_types/_int8_t.h
129....... /usr/include/sys/_types/_int16_t.h
130....... /usr/include/sys/_types/_int32_t.h
131....... /usr/include/sys/_types/_int64_t.h
132....... /usr/include/_types/_uint8_t.h
133....... /usr/include/_types/_uint16_t.h
134....... /usr/include/_types/_uint32_t.h
135....... /usr/include/_types/_uint64_t.h
136....... /usr/include/sys/_types/_intptr_t.h
137....... /usr/include/sys/_types/_uintptr_t.h
138....... /usr/include/_types/_intmax_t.h
139....... /usr/include/_types/_uintmax_t.h
140.. /Applications/Xcode-7.2/Xcode.app/Contents/Developer/Toolchains/XcodeDefault.xctoolchain/usr/bin/../lib/clang/8.0.0/include/float.h
141. includes/rts/EventLogFormat.h
1421 warning generated.
143unused terminals: 2
144
145libraries/ghci/GHCi/InfoTable.hsc:29:1: warning: [-Wunused-top-binds]
146 Defined but not used: ‘ghciTablesNextToCode’
147 |
14829 | ghciTablesNextToCode = True
149 | ^^^^^^^^^^^^^^^^^^^^
150
151libraries/transformers/Control/Monad/Trans/Error.hs:98:1: warning: [-Worphans]
152 Orphan instance: instance [safe] Error e => Alternative (Either e)
153 To avoid this
154 move the instance declaration to the module of the class or of the type, or
155 wrap the type with a newtype and declare the instance on the new type.
156 |
15798 | instance (Error e) => Alternative (Either e) where
158 | ^^^^^^^^^^^^^^^^^^^^^^^^^^^^^^^^^^^^^^^^^^^^^^^^^^...
159
160libraries/transformers/Control/Monad/Trans/Error.hs:103:1: warning: [-Worphans]
161 Orphan instance: instance [safe] Error e => MonadPlus (Either e)
162 To avoid this
163 move the instance declaration to the module of the class or of the type, or
164 wrap the type with a newtype and declare the instance on the new type.
165 |
166103 | instance (Error e) => MonadPlus (Either e) where
167 | ^^^^^^^^^^^^^^^^^^^^^^^^^^^^^^^^^^^^^^^^^^^^^^^^...
168Warning: -rtsopts and -with-rtsopts have no effect with -no-hs-main.
169 Call hs_init_ghc() from your main() function to set these options.
170rts-1.0: Warning: .:742:1: The field "hugs-options" is deprecated. hugs isn't supported anymore
171rts-1.0: cannot find any of ["libHSrts.a","libHSrts_p.a","libHSrts-ghc8.7.20181210.so","libHSrts-ghc8.7.20181210.dylib","HSrts-ghc8.7.20181210.dll"] on library path (ignoring)
172rts-1.0: cannot find any of ["libCffi.a","libCffi_p.a","libCffi-ghc8.7.20181210.so","libCffi-ghc8.7.20181210.dylib","Cffi-ghc8.7.20181210.dll"] on library path (ignoring)
173
174compiler/simplCore/HotCode.hs:5:1: warning: [-Wunused-imports]
175 The import of ‘defFreq’ from module ‘BasicTypes’ is redundant
176 |
1775 | import BasicTypes (defFreq, multiplyWeight)
178 | ^^^^^^^^^^^^^^^^^^^^^^^^^^^^^^^^^^^^^^^^^^^
179
180compiler/iface/IfaceSyn.hs:2227:1: warning: [-Worphans]
181 Orphan instance: instance Binary BranchWeight
182 To avoid this
183 move the instance declaration to the module of the class or of the type, or
184 wrap the type with a newtype and declare the instance on the new type.
185 |
1862227 | instance Binary BranchWeight where
187 | ^^^^^^^^^^^^^^^^^^^^^^^^^^^^^^^^^^...
188
189compiler/stgSyn/StgSyn.hs:62:1: warning: [-Wunused-imports]
190 The import of ‘BasicTypes’ is redundant
191 except perhaps to import instances from ‘BasicTypes’
192 To import instances alone, use: import BasicTypes()
193 |
19462 | import BasicTypes (BranchWeight)
195 | ^^^^^^^^^^^^^^^^^^^^^^^^^^^^^^^^^
196
197compiler/stgSyn/StgLint.hs:39:1: warning: [-Wunused-imports]
198 The import of ‘BasicTypes’ is redundant
199 except perhaps to import instances from ‘BasicTypes’
200 To import instances alone, use: import BasicTypes()
201 |
20239 | import BasicTypes (BranchWeight)
203 | ^^^^^^^^^^^^^^^^^^^^^^^^^^^^^^^^
204
205compiler/simplCore/CSE.hs:31:1: warning: [-Wunused-imports]
206 The import of ‘filterOut’ from module ‘Util’ is redundant
207 |
20831 | import Util ( filterOut, fstOf3 )
209 | ^^^^^^^^^^^^^^^^^^^^^^^^^^^^^^^^^^^^^^^^^^^^^
210
211compiler/simplCore/CSE.hs:598:19: warning: [-Wunused-matches]
212 Defined but not used: ‘con1’
213 |
214598 | combineAlts env ((con1,bndrs1,rhs1) : rest_alts)
215 | ^^^^
216
217compiler/stgSyn/CoreToStg.hs:38:1: warning: [-Wunused-imports]
218 The import of ‘BranchWeight, defFreq’
219 from module ‘BasicTypes’ is redundant
220 |
22138 | import BasicTypes ( Arity, neverFreq, defFreq, BranchWeight(..) )
222 | ^^^^^^^^^^^^^^^^^^^^^^^^^^^^^^^^^^^^^^^^^^^^^^^^^^^^^^^^^^^^^^^^^^^^^^^
223
224compiler/ghci/RtClosureInspect.hs:355:4: warning: [-Wunused-local-binds]
225 Defined but not used: ‘isIntegerTy’
226 |
227355 | isIntegerTy ty = fromMaybe False $ do
228 | ^^^^^^^^^^^
229
230compiler/ghci/RtClosureInspect.hs:419:4: warning: [-Wunused-local-binds]
231 Defined but not used: ‘ppr_integer’
232 |
233419 | ppr_integer _ _ = return Nothing
234 | ^^^^^^^^^^^
235
236compiler/deSugar/Match.hs:60:1: warning: [-Wunused-imports]
237 The import of ‘join’ from module ‘Control.Monad’ is redundant
238 |
23960 | import Control.Monad( when, unless, join )
240 | ^^^^^^^^^^^^^^^^^^^^^^^^^^^^^^^^^^^^^^^^^^
241
242ghc/Main.hs:59:1: warning: [-Wunused-imports]
243 The import of ‘DynamicLoading’ is redundant
244 except perhaps to import instances from ‘DynamicLoading’
245 To import instances alone, use: import DynamicLoading()
246 |
24759 | import DynamicLoading ( initializePlugins )
248 | ^^^^^^^^^^^^^^^^^^^^^^^^^^^^^^^^^^^^^^^^^^^^^
249Warning: -rtsopts and -with-rtsopts have no effect with -no-hs-main.
250 Call hs_init_ghc() from your main() function to set these options.
251ghc-prim-0.5.3: Warning: haddock-interfaces: /private/var/drydock/workingcopy-121290/repo/glasgow-haskell-compiler/libraries/ghc-prim/dist-install/doc/html/ghc-prim/ghc-prim.haddock doesn't exist or isn't a file
252ghc-prim-0.5.3: Warning: haddock-html: /private/var/drydock/workingcopy-121290/repo/glasgow-haskell-compiler/libraries/ghc-prim/dist-install/doc/html/ghc-prim doesn't exist or isn't a directory
253integer-gmp-1.0.2.0: Warning: haddock-interfaces: /private/var/drydock/workingcopy-121290/repo/glasgow-haskell-compiler/libraries/integer-gmp/dist-install/doc/html/integer-gmp/integer-gmp.haddock doesn't exist or isn't a file
254integer-gmp-1.0.2.0: Warning: haddock-html: /private/var/drydock/workingcopy-121290/repo/glasgow-haskell-compiler/libraries/integer-gmp/dist-install/doc/html/integer-gmp doesn't exist or isn't a directory
255base-4.12.0.0: Warning: haddock-interfaces: /private/var/drydock/workingcopy-121290/repo/glasgow-haskell-compiler/libraries/base/dist-install/doc/html/base/base.haddock doesn't exist or isn't a file
256base-4.12.0.0: Warning: haddock-html: /private/var/drydock/workingcopy-121290/repo/glasgow-haskell-compiler/libraries/base/dist-install/doc/html/base doesn't exist or isn't a directory
257filepath-1.4.2.1: Warning: haddock-interfaces: /private/var/drydock/workingcopy-121290/repo/glasgow-haskell-compiler/libraries/filepath/dist-install/doc/html/filepath/filepath.haddock doesn't exist or isn't a file
258filepath-1.4.2.1: Warning: haddock-html: /private/var/drydock/workingcopy-121290/repo/glasgow-haskell-compiler/libraries/filepath/dist-install/doc/html/filepath doesn't exist or isn't a directory
259array-0.5.2.0: Warning: haddock-interfaces: /private/var/drydock/workingcopy-121290/repo/glasgow-haskell-compiler/libraries/array/dist-install/doc/html/array/array.haddock doesn't exist or isn't a file
260array-0.5.2.0: Warning: haddock-html: /private/var/drydock/workingcopy-121290/repo/glasgow-haskell-compiler/libraries/array/dist-install/doc/html/array doesn't exist or isn't a directory
261deepseq-1.4.4.0: Warning: haddock-interfaces: /private/var/drydock/workingcopy-121290/repo/glasgow-haskell-compiler/libraries/deepseq/dist-install/doc/html/deepseq/deepseq.haddock doesn't exist or isn't a file
262deepseq-1.4.4.0: Warning: haddock-html: /private/var/drydock/workingcopy-121290/repo/glasgow-haskell-compiler/libraries/deepseq/dist-install/doc/html/deepseq doesn't exist or isn't a directory
263bytestring-0.10.9.0: Warning: include-dirs: /private/var/drydock/workingcopy-121290/repo/glasgow-haskell-compiler/libraries/bytestring/dist-install/build/include doesn't exist or isn't a directory
264bytestring-0.10.9.0: Warning: haddock-interfaces: /private/var/drydock/workingcopy-121290/repo/glasgow-haskell-compiler/libraries/bytestring/dist-install/doc/html/bytestring/bytestring.haddock doesn't exist or isn't a file
265bytestring-0.10.9.0: Warning: haddock-html: /private/var/drydock/workingcopy-121290/repo/glasgow-haskell-compiler/libraries/bytestring/dist-install/doc/html/bytestring doesn't exist or isn't a directory
266containers-0.6.0.1: Warning: include-dirs: /private/var/drydock/workingcopy-121290/repo/glasgow-haskell-compiler/libraries/containers/dist-install/build/include doesn't exist or isn't a directory
267containers-0.6.0.1: Warning: haddock-interfaces: /private/var/drydock/workingcopy-121290/repo/glasgow-haskell-compiler/libraries/containers/dist-install/doc/html/containers/containers.haddock doesn't exist or isn't a file
268containers-0.6.0.1: Warning: haddock-html: /private/var/drydock/workingcopy-121290/repo/glasgow-haskell-compiler/libraries/containers/dist-install/doc/html/containers doesn't exist or isn't a directory
269time-1.9.2: Warning: haddock-interfaces: /private/var/drydock/workingcopy-121290/repo/glasgow-haskell-compiler/libraries/time/dist-install/doc/html/time/time.haddock doesn't exist or isn't a file
270time-1.9.2: Warning: haddock-html: /private/var/drydock/workingcopy-121290/repo/glasgow-haskell-compiler/libraries/time/dist-install/doc/html/time doesn't exist or isn't a directory
271unix-2.7.2.2: Warning: haddock-interfaces: /private/var/drydock/workingcopy-121290/repo/glasgow-haskell-compiler/libraries/unix/dist-install/doc/html/unix/unix.haddock doesn't exist or isn't a file
272unix-2.7.2.2: Warning: haddock-html: /private/var/drydock/workingcopy-121290/repo/glasgow-haskell-compiler/libraries/unix/dist-install/doc/html/unix doesn't exist or isn't a directory
273directory-1.3.3.1: Warning: haddock-interfaces: /private/var/drydock/workingcopy-121290/repo/glasgow-haskell-compiler/libraries/directory/dist-install/doc/html/directory/directory.haddock doesn't exist or isn't a file
274directory-1.3.3.1: Warning: haddock-html: /private/var/drydock/workingcopy-121290/repo/glasgow-haskell-compiler/libraries/directory/dist-install/doc/html/directory doesn't exist or isn't a directory
275process-1.6.3.0: Warning: haddock-interfaces: /private/var/drydock/workingcopy-121290/repo/glasgow-haskell-compiler/libraries/process/dist-install/doc/html/process/process.haddock doesn't exist or isn't a file
276process-1.6.3.0: Warning: haddock-html: /private/var/drydock/workingcopy-121290/repo/glasgow-haskell-compiler/libraries/process/dist-install/doc/html/process doesn't exist or isn't a directory
277hpc-0.6.0.3: Warning: haddock-interfaces: /private/var/drydock/workingcopy-121290/repo/glasgow-haskell-compiler/libraries/hpc/dist-install/doc/html/hpc/hpc.haddock doesn't exist or isn't a file
278hpc-0.6.0.3: Warning: haddock-html: /private/var/drydock/workingcopy-121290/repo/glasgow-haskell-compiler/libraries/hpc/dist-install/doc/html/hpc doesn't exist or isn't a directory
279pretty-1.1.3.6: Warning: haddock-interfaces: /private/var/drydock/workingcopy-121290/repo/glasgow-haskell-compiler/libraries/pretty/dist-install/doc/html/pretty/pretty.haddock doesn't exist or isn't a file
280pretty-1.1.3.6: Warning: haddock-html: /private/var/drydock/workingcopy-121290/repo/glasgow-haskell-compiler/libraries/pretty/dist-install/doc/html/pretty doesn't exist or isn't a directory
281binary-0.8.6.0: Warning: haddock-interfaces: /private/var/drydock/workingcopy-121290/repo/glasgow-haskell-compiler/libraries/binary/dist-install/doc/html/binary/binary.haddock doesn't exist or isn't a file
282binary-0.8.6.0: Warning: haddock-html: /private/var/drydock/workingcopy-121290/repo/glasgow-haskell-compiler/libraries/binary/dist-install/doc/html/binary doesn't exist or isn't a directory
283text-1.2.3.1: Warning: include-dirs: /private/var/drydock/workingcopy-121290/repo/glasgow-haskell-compiler/libraries/text/dist-install/build/include doesn't exist or isn't a directory
284text-1.2.3.1: Warning: haddock-interfaces: /private/var/drydock/workingcopy-121290/repo/glasgow-haskell-compiler/libraries/text/dist-install/doc/html/text/text.haddock doesn't exist or isn't a file
285text-1.2.3.1: Warning: haddock-html: /private/var/drydock/workingcopy-121290/repo/glasgow-haskell-compiler/libraries/text/dist-install/doc/html/text doesn't exist or isn't a directory
286transformers-0.5.5.0: Warning: haddock-interfaces: /private/var/drydock/workingcopy-121290/repo/glasgow-haskell-compiler/libraries/transformers/dist-install/doc/html/transformers/transformers.haddock doesn't exist or isn't a file
287transformers-0.5.5.0: Warning: haddock-html: /private/var/drydock/workingcopy-121290/repo/glasgow-haskell-compiler/libraries/transformers/dist-install/doc/html/transformers doesn't exist or isn't a directory
288mtl-2.2.2: Warning: haddock-interfaces: /private/var/drydock/workingcopy-121290/repo/glasgow-haskell-compiler/libraries/mtl/dist-install/doc/html/mtl/mtl.haddock doesn't exist or isn't a file
289mtl-2.2.2: Warning: haddock-html: /private/var/drydock/workingcopy-121290/repo/glasgow-haskell-compiler/libraries/mtl/dist-install/doc/html/mtl doesn't exist or isn't a directory
290parsec-3.1.13.0: Warning: haddock-interfaces: /private/var/drydock/workingcopy-121290/repo/glasgow-haskell-compiler/libraries/parsec/dist-install/doc/html/parsec/parsec.haddock doesn't exist or isn't a file
291parsec-3.1.13.0: Warning: haddock-html: /private/var/drydock/workingcopy-121290/repo/glasgow-haskell-compiler/libraries/parsec/dist-install/doc/html/parsec doesn't exist or isn't a directory
292Cabal-2.5.0.0: Warning: haddock-interfaces: /private/var/drydock/workingcopy-121290/repo/glasgow-haskell-compiler/libraries/Cabal/Cabal/dist-install/doc/html/Cabal/Cabal.haddock doesn't exist or isn't a file
293Cabal-2.5.0.0: Warning: haddock-html: /private/var/drydock/workingcopy-121290/repo/glasgow-haskell-compiler/libraries/Cabal/Cabal/dist-install/doc/html/Cabal doesn't exist or isn't a directory
294ghc-boot-th-8.7: Warning: haddock-interfaces: /private/var/drydock/workingcopy-121290/repo/glasgow-haskell-compiler/libraries/ghc-boot-th/dist-install/doc/html/ghc-boot-th/ghc-boot-th.haddock doesn't exist or isn't a file
295ghc-boot-th-8.7: Warning: haddock-html: /private/var/drydock/workingcopy-121290/repo/glasgow-haskell-compiler/libraries/ghc-boot-th/dist-install/doc/html/ghc-boot-th doesn't exist or isn't a directory
296ghc-boot-8.7: Warning: haddock-interfaces: /private/var/drydock/workingcopy-121290/repo/glasgow-haskell-compiler/libraries/ghc-boot/dist-install/doc/html/ghc-boot/ghc-boot.haddock doesn't exist or isn't a file
297ghc-boot-8.7: Warning: haddock-html: /private/var/drydock/workingcopy-121290/repo/glasgow-haskell-compiler/libraries/ghc-boot/dist-install/doc/html/ghc-boot doesn't exist or isn't a directory
298template-haskell-2.15.0.0: Warning: haddock-interfaces: /private/var/drydock/workingcopy-121290/repo/glasgow-haskell-compiler/libraries/template-haskell/dist-install/doc/html/template-haskell/template-haskell.haddock doesn't exist or isn't a file
299template-haskell-2.15.0.0: Warning: haddock-html: /private/var/drydock/workingcopy-121290/repo/glasgow-haskell-compiler/libraries/template-haskell/dist-install/doc/html/template-haskell doesn't exist or isn't a directory
300ghc-compact-0.1.0.0: Warning: haddock-interfaces: /private/var/drydock/workingcopy-121290/repo/glasgow-haskell-compiler/libraries/ghc-compact/dist-install/doc/html/ghc-compact/ghc-compact.haddock doesn't exist or isn't a file
301ghc-compact-0.1.0.0: Warning: haddock-html: /private/var/drydock/workingcopy-121290/repo/glasgow-haskell-compiler/libraries/ghc-compact/dist-install/doc/html/ghc-compact doesn't exist or isn't a directory
302ghc-heap-8.7: Warning: haddock-interfaces: /private/var/drydock/workingcopy-121290/repo/glasgow-haskell-compiler/libraries/ghc-heap/dist-install/doc/html/ghc-heap/ghc-heap.haddock doesn't exist or isn't a file
303ghc-heap-8.7: Warning: haddock-html: /private/var/drydock/workingcopy-121290/repo/glasgow-haskell-compiler/libraries/ghc-heap/dist-install/doc/html/ghc-heap doesn't exist or isn't a directory
304xhtml-3000.2.2.1: Warning: haddock-interfaces: /private/var/drydock/workingcopy-121290/repo/glasgow-haskell-compiler/libraries/xhtml/dist-install/doc/html/xhtml/xhtml.haddock doesn't exist or isn't a file
305xhtml-3000.2.2.1: Warning: haddock-html: /private/var/drydock/workingcopy-121290/repo/glasgow-haskell-compiler/libraries/xhtml/dist-install/doc/html/xhtml doesn't exist or isn't a directory
306terminfo-0.4.1.2: Warning: haddock-interfaces: /private/var/drydock/workingcopy-121290/repo/glasgow-haskell-compiler/libraries/terminfo/dist-install/doc/html/terminfo/terminfo.haddock doesn't exist or isn't a file
307terminfo-0.4.1.2: Warning: haddock-html: /private/var/drydock/workingcopy-121290/repo/glasgow-haskell-compiler/libraries/terminfo/dist-install/doc/html/terminfo doesn't exist or isn't a directory
308stm-2.5.0.0: Warning: haddock-interfaces: /private/var/drydock/workingcopy-121290/repo/glasgow-haskell-compiler/libraries/stm/dist-install/doc/html/stm/stm.haddock doesn't exist or isn't a file
309stm-2.5.0.0: Warning: haddock-html: /private/var/drydock/workingcopy-121290/repo/glasgow-haskell-compiler/libraries/stm/dist-install/doc/html/stm doesn't exist or isn't a directory
310haskeline-0.7.4.3: Warning: include-dirs: /private/var/drydock/workingcopy-121290/repo/glasgow-haskell-compiler/libraries/haskeline/dist-install/build/includes doesn't exist or isn't a directory
311haskeline-0.7.4.3: Warning: haddock-interfaces: /private/var/drydock/workingcopy-121290/repo/glasgow-haskell-compiler/libraries/haskeline/dist-install/doc/html/haskeline/haskeline.haddock doesn't exist or isn't a file
312haskeline-0.7.4.3: Warning: haddock-html: /private/var/drydock/workingcopy-121290/repo/glasgow-haskell-compiler/libraries/haskeline/dist-install/doc/html/haskeline doesn't exist or isn't a directory
313ghci-8.7: Warning: haddock-interfaces: /private/var/drydock/workingcopy-121290/repo/glasgow-haskell-compiler/libraries/ghci/dist-install/doc/html/ghci/ghci.haddock doesn't exist or isn't a file
314ghci-8.7: Warning: haddock-html: /private/var/drydock/workingcopy-121290/repo/glasgow-haskell-compiler/libraries/ghci/dist-install/doc/html/ghci doesn't exist or isn't a directory
315libiserv-8.7.1: Warning: haddock-interfaces: /private/var/drydock/workingcopy-121290/repo/glasgow-haskell-compiler/libraries/libiserv/dist-install/doc/html/libiserv/libiserv.haddock doesn't exist or isn't a file
316libiserv-8.7.1: Warning: haddock-html: /private/var/drydock/workingcopy-121290/repo/glasgow-haskell-compiler/libraries/libiserv/dist-install/doc/html/libiserv doesn't exist or isn't a directory
317Warning: hpc-bin.cabal:11:2: Tabs used as indentation at 11:2
318Warning: hpc-bin.cabal:11:2: Tabs used as indentation at 11:2
319ghc-8.7: Warning: include-dirs: /private/var/drydock/workingcopy-121290/repo/glasgow-haskell-compiler/compiler/stage2/build/parser doesn't exist or isn't a directory
320ghc-8.7: Warning: include-dirs: /private/var/drydock/workingcopy-121290/repo/glasgow-haskell-compiler/compiler/stage2/build/utils doesn't exist or isn't a directory
321ghc-8.7: Warning: include-dirs: /private/var/drydock/workingcopy-121290/repo/glasgow-haskell-compiler/compiler/stage2/build/../rts/dist/build doesn't exist or isn't a directory
322ghc-8.7: Warning: include-dirs: /private/var/drydock/workingcopy-121290/repo/glasgow-haskell-compiler/compiler/stage2/build/stage2 doesn't exist or isn't a directory
323ghc-8.7: Warning: haddock-interfaces: /private/var/drydock/workingcopy-121290/repo/glasgow-haskell-compiler/compiler/stage2/doc/html/ghc/ghc.haddock doesn't exist or isn't a file
324ghc-8.7: Warning: haddock-html: /private/var/drydock/workingcopy-121290/repo/glasgow-haskell-compiler/compiler/stage2/doc/html/ghc doesn't exist or isn't a directory
325parallel-3.2.2.0: Warning: haddock-interfaces: /private/var/drydock/workingcopy-121290/repo/glasgow-haskell-compiler/libraries/parallel/dist-install/doc/html/parallel/parallel.haddock doesn't exist or isn't a file
326parallel-3.2.2.0: Warning: haddock-html: /private/var/drydock/workingcopy-121290/repo/glasgow-haskell-compiler/libraries/parallel/dist-install/doc/html/parallel doesn't exist or isn't a directory
327utils/unlit/ghc.mk:34: utils/unlit/dist-install/build/.depend.c_asm: No such file or directory
328utils/hp2ps/ghc.mk:44: utils/hp2ps/dist-install/build/.depend.c_asm: No such file or directory
329rts/ghc.mk:570: rts/dist/build/.depend-v-dyn-l-debug-thr-thr_debug-thr_l-debug_dyn-thr_dyn-thr_debug_dyn-l_dyn-thr_l_dyn.c_asm: No such file or directory
330libraries/parallel/ghc.mk:5: libraries/parallel/dist-install/build/.depend-v-dyn.haskell: No such file or directory
331libraries/parallel/ghc.mk:5: libraries/parallel/dist-install/build/.depend-v-dyn.c_asm: No such file or directory
332libraries/ghc-prim/ghc.mk:4: libraries/ghc-prim/dist-install/build/.depend-v-dyn.haskell: No such file or directory
333libraries/ghc-prim/ghc.mk:4: libraries/ghc-prim/dist-install/build/.depend-v-dyn.c_asm: No such file or directory
334libraries/integer-gmp/ghc.mk:4: libraries/integer-gmp/dist-install/build/.depend-v-dyn.haskell: No such file or directory
335libraries/integer-gmp/ghc.mk:4: libraries/integer-gmp/dist-install/build/.depend-v-dyn.c_asm: No such file or directory
336libraries/base/ghc.mk:4: libraries/base/dist-install/build/.depend-v-dyn.haskell: No such file or directory
337libraries/base/ghc.mk:4: libraries/base/dist-install/build/.depend-v-dyn.c_asm: No such file or directory
338libraries/filepath/ghc.mk:4: libraries/filepath/dist-install/build/.depend-v-dyn.haskell: No such file or directory
339libraries/filepath/ghc.mk:4: libraries/filepath/dist-install/build/.depend-v-dyn.c_asm: No such file or directory
340libraries/array/ghc.mk:4: libraries/array/dist-install/build/.depend-v-dyn.haskell: No such file or directory
341libraries/array/ghc.mk:4: libraries/array/dist-install/build/.depend-v-dyn.c_asm: No such file or directory
342libraries/deepseq/ghc.mk:4: libraries/deepseq/dist-install/build/.depend-v-dyn.haskell: No such file or directory
343libraries/deepseq/ghc.mk:4: libraries/deepseq/dist-install/build/.depend-v-dyn.c_asm: No such file or directory
344libraries/bytestring/ghc.mk:4: libraries/bytestring/dist-install/build/.depend-v-dyn.haskell: No such file or directory
345libraries/bytestring/ghc.mk:4: libraries/bytestring/dist-install/build/.depend-v-dyn.c_asm: No such file or directory
346libraries/containers/ghc.mk:4: libraries/containers/dist-install/build/.depend-v-dyn.haskell: No such file or directory
347libraries/containers/ghc.mk:4: libraries/containers/dist-install/build/.depend-v-dyn.c_asm: No such file or directory
348libraries/time/ghc.mk:4: libraries/time/dist-install/build/.depend-v-dyn.haskell: No such file or directory
349libraries/time/ghc.mk:4: libraries/time/dist-install/build/.depend-v-dyn.c_asm: No such file or directory
350libraries/unix/ghc.mk:4: libraries/unix/dist-install/build/.depend-v-dyn.haskell: No such file or directory
351libraries/unix/ghc.mk:4: libraries/unix/dist-install/build/.depend-v-dyn.c_asm: No such file or directory
352libraries/directory/ghc.mk:4: libraries/directory/dist-install/build/.depend-v-dyn.haskell: No such file or directory
353libraries/directory/ghc.mk:4: libraries/directory/dist-install/build/.depend-v-dyn.c_asm: No such file or directory
354libraries/process/ghc.mk:4: libraries/process/dist-install/build/.depend-v-dyn.haskell: No such file or directory
355libraries/process/ghc.mk:4: libraries/process/dist-install/build/.depend-v-dyn.c_asm: No such file or directory
356libraries/hpc/ghc.mk:4: libraries/hpc/dist-install/build/.depend-v-dyn.haskell: No such file or directory
357libraries/hpc/ghc.mk:4: libraries/hpc/dist-install/build/.depend-v-dyn.c_asm: No such file or directory
358libraries/pretty/ghc.mk:4: libraries/pretty/dist-install/build/.depend-v-dyn.haskell: No such file or directory
359libraries/pretty/ghc.mk:4: libraries/pretty/dist-install/build/.depend-v-dyn.c_asm: No such file or directory
360libraries/binary/ghc.mk:4: libraries/binary/dist-install/build/.depend-v-dyn.haskell: No such file or directory
361libraries/binary/ghc.mk:4: libraries/binary/dist-install/build/.depend-v-dyn.c_asm: No such file or directory
362libraries/text/ghc.mk:4: libraries/text/dist-install/build/.depend-v-dyn.haskell: No such file or directory
363libraries/text/ghc.mk:4: libraries/text/dist-install/build/.depend-v-dyn.c_asm: No such file or directory
364libraries/transformers/ghc.mk:4: libraries/transformers/dist-install/build/.depend-v-dyn.haskell: No such file or directory
365libraries/transformers/ghc.mk:4: libraries/transformers/dist-install/build/.depend-v-dyn.c_asm: No such file or directory
366libraries/mtl/ghc.mk:4: libraries/mtl/dist-install/build/.depend-v-dyn.haskell: No such file or directory
367libraries/mtl/ghc.mk:4: libraries/mtl/dist-install/build/.depend-v-dyn.c_asm: No such file or directory
368libraries/parsec/ghc.mk:4: libraries/parsec/dist-install/build/.depend-v-dyn.haskell: No such file or directory
369libraries/parsec/ghc.mk:4: libraries/parsec/dist-install/build/.depend-v-dyn.c_asm: No such file or directory
370libraries/Cabal/Cabal/ghc.mk:4: libraries/Cabal/Cabal/dist-install/build/.depend-v-dyn.haskell: No such file or directory
371libraries/Cabal/Cabal/ghc.mk:4: libraries/Cabal/Cabal/dist-install/build/.depend-v-dyn.c_asm: No such file or directory
372libraries/ghc-boot-th/ghc.mk:4: libraries/ghc-boot-th/dist-install/build/.depend-v-dyn.haskell: No such file or directory
373libraries/ghc-boot-th/ghc.mk:4: libraries/ghc-boot-th/dist-install/build/.depend-v-dyn.c_asm: No such file or directory
374libraries/ghc-boot/ghc.mk:4: libraries/ghc-boot/dist-install/build/.depend-v-dyn.haskell: No such file or directory
375libraries/ghc-boot/ghc.mk:4: libraries/ghc-boot/dist-install/build/.depend-v-dyn.c_asm: No such file or directory
376libraries/template-haskell/ghc.mk:4: libraries/template-haskell/dist-install/build/.depend-v-dyn.haskell: No such file or directory
377libraries/template-haskell/ghc.mk:4: libraries/template-haskell/dist-install/build/.depend-v-dyn.c_asm: No such file or directory
378libraries/ghc-compact/ghc.mk:4: libraries/ghc-compact/dist-install/build/.depend-v-dyn.haskell: No such file or directory
379libraries/ghc-compact/ghc.mk:4: libraries/ghc-compact/dist-install/build/.depend-v-dyn.c_asm: No such file or directory
380libraries/ghc-heap/ghc.mk:4: libraries/ghc-heap/dist-install/build/.depend-v-dyn.haskell: No such file or directory
381libraries/ghc-heap/ghc.mk:4: libraries/ghc-heap/dist-install/build/.depend-v-dyn.c_asm: No such file or directory
382libraries/xhtml/ghc.mk:4: libraries/xhtml/dist-install/build/.depend-v-dyn.haskell: No such file or directory
383libraries/xhtml/ghc.mk:4: libraries/xhtml/dist-install/build/.depend-v-dyn.c_asm: No such file or directory
384libraries/terminfo/ghc.mk:4: libraries/terminfo/dist-install/build/.depend-v-dyn.haskell: No such file or directory
385libraries/terminfo/ghc.mk:4: libraries/terminfo/dist-install/build/.depend-v-dyn.c_asm: No such file or directory
386libraries/stm/ghc.mk:4: libraries/stm/dist-install/build/.depend-v-dyn.haskell: No such file or directory
387libraries/stm/ghc.mk:4: libraries/stm/dist-install/build/.depend-v-dyn.c_asm: No such file or directory
388libraries/haskeline/ghc.mk:4: libraries/haskeline/dist-install/build/.depend-v-dyn.haskell: No such file or directory
389libraries/haskeline/ghc.mk:4: libraries/haskeline/dist-install/build/.depend-v-dyn.c_asm: No such file or directory
390libraries/ghci/ghc.mk:4: libraries/ghci/dist-install/build/.depend-v-dyn.haskell: No such file or directory
391libraries/ghci/ghc.mk:4: libraries/ghci/dist-install/build/.depend-v-dyn.c_asm: No such file or directory
392libraries/libiserv/ghc.mk:4: libraries/libiserv/dist-install/build/.depend-v-dyn.haskell: No such file or directory
393libraries/libiserv/ghc.mk:4: libraries/libiserv/dist-install/build/.depend-v-dyn.c_asm: No such file or directory
394Configured with: --prefix=/Applications/Xcode-7.2/Xcode.app/Contents/Developer/usr --with-gxx-include-dir=/usr/include/c++/4.2.1
395utils/haddock/ghc.mk:20: utils/haddock/dist/build/.depend.haskell: No such file or directory
396utils/haddock/ghc.mk:20: utils/haddock/dist/build/.depend.c_asm: No such file or directory
397compiler/ghc.mk:445: compiler/stage2/build/.depend-v-dyn.haskell: No such file or directory
398compiler/ghc.mk:445: compiler/stage2/build/.depend-v-dyn.c_asm: No such file or directory
399utils/hsc2hs/ghc.mk:22: utils/hsc2hs/dist-install/build/.depend.haskell: No such file or directory
400utils/hsc2hs/ghc.mk:22: utils/hsc2hs/dist-install/build/.depend.c_asm: No such file or directory
401utils/ghc-pkg/ghc.mk:93: utils/ghc-pkg/dist-install/build/.depend.haskell: No such file or directory
402utils/ghc-pkg/ghc.mk:93: utils/ghc-pkg/dist-install/build/.depend.c_asm: No such file or directory
403utils/ghctags/ghc.mk:18: utils/ghctags/dist-install/build/.depend.haskell: No such file or directory
404utils/ghctags/ghc.mk:18: utils/ghctags/dist-install/build/.depend.c_asm: No such file or directory
405utils/check-api-annotations/ghc.mk:18: utils/check-api-annotations/dist-install/build/.depend.haskell: No such file or directory
406utils/check-api-annotations/ghc.mk:18: utils/check-api-annotations/dist-install/build/.depend.c_asm: No such file or directory
407utils/check-ppr/ghc.mk:18: utils/check-ppr/dist-install/build/.depend.haskell: No such file or directory
408utils/check-ppr/ghc.mk:18: utils/check-ppr/dist-install/build/.depend.c_asm: No such file or directory
409utils/ghc-cabal/ghc.mk:103: utils/ghc-cabal/dist-install/build/.depend.haskell: No such file or directory
410utils/ghc-cabal/ghc.mk:103: utils/ghc-cabal/dist-install/build/.depend.c_asm: No such file or directory
411utils/hpc/ghc.mk:21: utils/hpc/dist-install/build/.depend.haskell: No such file or directory
412utils/hpc/ghc.mk:21: utils/hpc/dist-install/build/.depend.c_asm: No such file or directory
413utils/runghc/ghc.mk:30: utils/runghc/dist-install/build/.depend.haskell: No such file or directory
414utils/runghc/ghc.mk:30: utils/runghc/dist-install/build/.depend.c_asm: No such file or directory
415ghc/ghc.mk:112: ghc/stage2/build/.depend.haskell: No such file or directory
416ghc/ghc.mk:112: ghc/stage2/build/.depend.c_asm: No such file or directory
417utils/compare_sizes/ghc.mk:8: utils/compare_sizes/dist-install/build/.depend.haskell: No such file or directory
418utils/compare_sizes/ghc.mk:8: utils/compare_sizes/dist-install/build/.depend.c_asm: No such file or directory
419utils/iserv/ghc.mk:100: utils/iserv/stage2/build/.depend.haskell: No such file or directory
420utils/iserv/ghc.mk:100: utils/iserv/stage2/build/.depend.c_asm: No such file or directory
421utils/iserv/ghc.mk:108: utils/iserv/stage2_dyn/build/.depend.haskell: No such file or directory
422utils/iserv/ghc.mk:108: utils/iserv/stage2_dyn/build/.depend.c_asm: No such file or directory
423unused terminals: 1
424unused terminals: 2
425clang: error: unsupported option '-print-multi-os-directory'
426clang: error: no input files
427Makefile:3406: warning: overriding commands for target `libffi.map'
428Makefile:731: warning: ignoring old commands for target `libffi.map'
429Makefile:1804: warning: overriding commands for target `libffi.map'
430Makefile:672: warning: ignoring old commands for target `libffi.map'
431Makefile:1804: warning: overriding commands for target `libffi.map'
432Makefile:672: warning: ignoring old commands for target `libffi.map'
433Makefile:1804: warning: overriding commands for target `libffi.map'
434Makefile:672: warning: ignoring old commands for target `libffi.map'
435ld: warning: could not create compact unwind for _ffi_call_unix64: does not use RBP or RSP based frame
436Makefile:3406: warning: overriding commands for target `libffi.map'
437Makefile:731: warning: ignoring old commands for target `libffi.map'
438Makefile:1804: warning: overriding commands for target `libffi.map'
439Makefile:672: warning: ignoring old commands for target `libffi.map'
440Makefile:1804: warning: overriding commands for target `libffi.map'
441Makefile:672: warning: ignoring old commands for target `libffi.map'
442Makefile:1804: warning: overriding commands for target `libffi.map'
443Makefile:672: warning: ignoring old commands for target `libffi.map'
444Configured with: --prefix=/Applications/Xcode-7.2/Xcode.app/Contents/Developer/usr --with-gxx-include-dir=/usr/include/c++/4.2.1
445
446rts/sm/CNF.c:215:9: error:
447 error: declaration does not declare anything [-Werror,-Wmissing-declarations]
448 FALLTHROUGH;
449 ^
450 |
451215 | FALLTHROUGH;
452 | ^
453
454includes/Stg.h:201:21: error:
455 note: expanded from macro 'FALLTHROUGH'
456 |
457201 | #define FALLTHROUGH GNU_ATTRIBUTE(fallthrough)
458 | ^
459#define FALLTHROUGH GNU_ATTRIBUTE(fallthrough)
460 ^
461
462includes/Stg.h:188:27: error:
463 note: expanded from macro 'GNU_ATTRIBUTE'
464 |
465188 | #define GNU_ATTRIBUTE(at) __attribute__((at))
466 | ^
467#define GNU_ATTRIBUTE(at) __attribute__((at))
468 ^
469
470rts/sm/CNF.c:934:13: error:
471 error: declaration does not declare anything [-Werror,-Wmissing-declarations]
472 FALLTHROUGH;
473 ^
474 |
475934 | FALLTHROUGH;
476 | ^
477
478includes/Stg.h:201:21: error:
479 note: expanded from macro 'FALLTHROUGH'
480 |
481201 | #define FALLTHROUGH GNU_ATTRIBUTE(fallthrough)
482 | ^
483#define FALLTHROUGH GNU_ATTRIBUTE(fallthrough)
484 ^
485
486includes/Stg.h:188:27: error:
487 note: expanded from macro 'GNU_ATTRIBUTE'
488 |
489188 | #define GNU_ATTRIBUTE(at) __attribute__((at))
490 | ^
491#define GNU_ATTRIBUTE(at) __attribute__((at))
492 ^
493
494rts/sm/CNF.c:943:13: error:
495 error: declaration does not declare anything [-Werror,-Wmissing-declarations]
496 FALLTHROUGH;
497 ^
498 |
499943 | FALLTHROUGH;
500 | ^
501
502includes/Stg.h:201:21: error:
503 note: expanded from macro 'FALLTHROUGH'
504 |
505201 | #define FALLTHROUGH GNU_ATTRIBUTE(fallthrough)
506 | ^
507#define FALLTHROUGH GNU_ATTRIBUTE(fallthrough)
508 ^
509
510includes/Stg.h:188:27: error:
511 note: expanded from macro 'GNU_ATTRIBUTE'
512 |
513188 | #define GNU_ATTRIBUTE(at) __attribute__((at))
514 | ^
515#define GNU_ATTRIBUTE(at) __attribute__((at))
516 ^
517
518rts/sm/CNF.c:948:13: error:
519 error: declaration does not declare anything [-Werror,-Wmissing-declarations]
520 FALLTHROUGH;
521 ^
522 |
523948 | FALLTHROUGH;
524 | ^
525
526includes/Stg.h:201:21: error:
527 note: expanded from macro 'FALLTHROUGH'
528 |
529201 | #define FALLTHROUGH GNU_ATTRIBUTE(fallthrough)
530 | ^
531#define FALLTHROUGH GNU_ATTRIBUTE(fallthrough)
532 ^
533
534includes/Stg.h:188:27: error:
535 note: expanded from macro 'GNU_ATTRIBUTE'
536 |
537188 | #define GNU_ATTRIBUTE(at) __attribute__((at))
538 | ^
539#define GNU_ATTRIBUTE(at) __attribute__((at))
540 ^
541
542rts/sm/CNF.c:1002:13: error:
543 error: declaration does not declare anything [-Werror,-Wmissing-declarations]
544 FALLTHROUGH;
545 ^
546 |
5471002 | FALLTHROUGH;
548 | ^
549
550includes/Stg.h:201:21: error:
551 note: expanded from macro 'FALLTHROUGH'
552 |
553201 | #define FALLTHROUGH GNU_ATTRIBUTE(fallthrough)
554 | ^
555#define FALLTHROUGH GNU_ATTRIBUTE(fallthrough)
556 ^
557
558includes/Stg.h:188:27: error:
559 note: expanded from macro 'GNU_ATTRIBUTE'
560 |
561188 | #define GNU_ATTRIBUTE(at) __attribute__((at))
562 | ^
563#define GNU_ATTRIBUTE(at) __attribute__((at))
564 ^
5655 errors generated.
566`gcc' failed in phase `C Compiler'. (Exit code: 1)
567make[1]: *** [rts/dist/build/sm/CNF.dyn_o] Error 1
568make[1]: *** Waiting for unfinished jobs....
569make: *** [all] Error 2
570

Build Log 342046 (remote - stdout)
25 - 50 - 100 - Unlimited Lines

1Creating libraries/array/ghc.mk
2Creating libraries/base/ghc.mk
3Creating libraries/binary/ghc.mk
4Creating libraries/bytestring/ghc.mk
5Creating libraries/Cabal/Cabal/ghc.mk
6Creating libraries/containers/ghc.mk
7Creating libraries/deepseq/ghc.mk
8Creating libraries/directory/ghc.mk
9Creating libraries/filepath/ghc.mk
10Creating libraries/ghc-boot/ghc.mk
11Creating libraries/ghc-boot-th/ghc.mk
12Creating libraries/ghc-compact/ghc.mk
13Creating libraries/ghc-heap/ghc.mk
14Creating libraries/ghc-prim/ghc.mk
15Creating libraries/ghci/ghc.mk
16Creating libraries/haskeline/ghc.mk
17Creating libraries/hpc/ghc.mk
18Creating libraries/integer-gmp/ghc.mk
19Creating libraries/integer-simple/ghc.mk
20Creating libraries/libiserv/ghc.mk
21Creating libraries/mtl/ghc.mk
22Creating libraries/parallel/ghc.mk
23Creating libraries/parsec/ghc.mk
24Creating libraries/pretty/ghc.mk
25Creating libraries/process/ghc.mk
26Creating libraries/stm/ghc.mk
27Creating libraries/template-haskell/ghc.mk
28Creating libraries/terminfo/ghc.mk
29Creating libraries/text/ghc.mk
30Creating libraries/time/ghc.mk
31Creating libraries/transformers/ghc.mk
32Creating libraries/unix/ghc.mk
33Creating libraries/Win32/ghc.mk
34Creating libraries/xhtml/ghc.mk
35Booting .
36Booting libraries/base/
37Booting libraries/directory/
38Booting libraries/integer-gmp/
39Booting libraries/process/
40Booting libraries/terminfo/
41Booting libraries/time/
42Booting libraries/unix/
43checking for gfind... no
44checking for find... /usr/bin/find
45checking for sort... /usr/bin/sort
46checking for GHC version date... inferred 8.7.20181210
47checking for GHC Git commit id... inferred 01dd9beef7a5366b17476958328493dca3a4103e
48checking for ghc... /opt/ghc-8.4.3/bin/ghc
49checking version of ghc... 8.4.3
50checking build system type... x86_64-apple-darwin16.7.0
51checking host system type... x86_64-apple-darwin16.7.0
52checking target system type... x86_64-apple-darwin16.7.0
53Build platform inferred as: x86_64-apple-darwin
54Host platform inferred as: x86_64-apple-darwin
55Target platform inferred as: x86_64-apple-darwin
56GHC build : x86_64-apple-darwin
57GHC host : x86_64-apple-darwin
58GHC target : x86_64-apple-darwin
59LLVM target: x86_64-apple-darwin
60checking for path to top of build tree... /var/drydock/workingcopy-121290/repo/glasgow-haskell-compiler
61checking for -windres... no
62checking for windres... no
63checking for -dllwrap... no
64checking for dllwrap... no
65checking for -objdump... no
66checking for objdump... objdump
67checking XCode version... 8.0
68configure: XCode version component 1: 8
69configure: XCode version component 2: 0
70checking for gcc... gcc
71checking whether the C compiler works... yes
72checking for C compiler default output file name... a.out
73checking for suffix of executables...
74checking whether we are cross compiling... no
75checking for suffix of object files... o
76checking whether we are using the GNU C compiler... yes
77checking whether gcc accepts -g... yes
78checking for gcc option to accept ISO C89... none needed
79checking how to run the C preprocessor... gcc -E
80checking for grep that handles long lines and -e... /usr/bin/grep
81checking for egrep... /usr/bin/grep -E
82checking for ANSI C header files... yes
83checking for sys/types.h... yes
84checking for sys/stat.h... yes
85checking for stdlib.h... yes
86checking for string.h... yes
87checking for memory.h... yes
88checking for strings.h... yes
89checking for inttypes.h... yes
90checking for stdint.h... yes
91checking for unistd.h... yes
92checking minix/config.h usability... no
93checking minix/config.h presence... no
94checking for minix/config.h... no
95checking whether it is safe to define __EXTENSIONS__... yes
96checking how to run the C preprocessor... gcc -E
97checking for gcc option to accept ISO C99... none needed
98checking for gcc option to accept ISO C99... none needed
99checking for gcc option to accept ISO C99... none needed
100checking for gcc option to accept ISO C99... none needed
101checking for -ld.lld... no
102checking for ld.lld... ld.lld
103checking whether C compiler supports -fuse-ld=lld... no
104configure: unable to convince 'gcc' to use linker 'ld.lld'
105checking for -ld.gold... no
106checking for ld.gold... no
107checking for -ld... no
108checking for ld... ld
109configure: unknown linker version
110configure: unable to convince 'gcc' to use linker 'ld'
111checking for -ld... no
112checking for ld... ld
113checking whether ld is GNU ld... NO
114checking whether ld understands --build-id... no
115checking whether ld understands -no_compact_unwind... yes
116checking whether ld understands -filelist... yes
117checking for -nm... no
118checking for nm... nm
119checking whether nm program is broken... no
120checking for ranlib... ranlib
121checking for -strip... no
122checking for strip... strip
123checking for -libtool... no
124checking for libtool... libtool
125checking for -clang... no
126checking for clang... clang
127checking for llc-7.0... no
128checking for llc... llc
129checking llc is version 7.0... no
130checking for opt-7.0... no
131checking for opt... opt
132checking opt is version 7.0... no
133configure: Creating links for in-tree file handling routines.
134utils/lndir//fs.c => utils/fs/fs.c
135utils/lndir//fs.h => utils/fs/fs.h
136utils/unlit//fs.c => utils/fs/fs.c
137utils/unlit//fs.h => utils/fs/fs.h
138rts//fs.c => utils/fs/fs.c
139rts//fs.h => utils/fs/fs.h
140libraries/base/include//fs.h => utils/fs/fs.h
141libraries/base/cbits//fs.c => utils/fs/fs.c
142configure: Routines in place. Packages can now be build normally.
143checking whether #! works in shell scripts... yes
144checking for perl... /usr/bin/perl
145checking version of gcc... 8.0.0
146checking whether GCC supports -no-pie... no
147checking whether GCC supports __atomic_ builtins... yes
148checking for extra options to pass gcc when compiling via C... -fwrapv -fno-builtin
149checking whether C compiler is clang... yes
150checking Setting up CFLAGS, LDFLAGS, IGNORE_LINKER_LD_FLAGS and CPPFLAGS... done
151checking Setting up CONF_CC_OPTS_STAGE0, CONF_GCC_LINKER_OPTS_STAGE0, CONF_LD_LINKER_OPTS_STAGE0 and CONF_CPP_OPTS_STAGE0... done
152checking Setting up CONF_CC_OPTS_STAGE1, CONF_GCC_LINKER_OPTS_STAGE1, CONF_LD_LINKER_OPTS_STAGE1 and CONF_CPP_OPTS_STAGE1... done
153checking Setting up CONF_CC_OPTS_STAGE2, CONF_GCC_LINKER_OPTS_STAGE2, CONF_LD_LINKER_OPTS_STAGE2 and CONF_CPP_OPTS_STAGE2... done
154checking for .subsections_via_symbols... yes
155checking whether your assembler supports .ident directive... yes
156checking for GNU non-executable stack support... no
157checking for a working context diff... diff -U 1
158checking for a BSD-compatible install... /usr/local/bin/ginstall -c
159checking for -ar... no
160checking for ar... ar
161checking whether ar is GNU ar... no
162checking for ar arguments... qcls
163checking whether ar supports @file... no
164checking for ranlib... (cached) ranlib
165checking whether ln -s works... yes
166checking for gsed... no
167checking for sed... /usr/bin/sed
168checking for time... /usr/bin/time
169checking for gnutar... no
170checking for gtar... no
171checking for tar... /usr/bin/tar
172checking for bzip2... /usr/bin/bzip2
173checking for gzip... /usr/bin/gzip
174checking for pxz... no
175checking for xz... /usr/local/bin/xz
176checking for gpatch... no
177checking for patch... /usr/bin/patch
178checking for dtrace... /usr/sbin/dtrace
179checking for HsColour... no
180checking for sphinx-build... /usr/local/opt/sphinx-doc/bin/sphinx-build
181checking for version of sphinx-build... Sphinx (sphinx-build) 1.6.3
182checking for xelatex... no
183checking for ghc-pkg matching /opt/ghc-8.4.3/bin/ghc... /opt/ghc-8.4.3/bin/ghc-pkg
184checking for happy... /Users/drydock/.cabal/bin/happy
185checking for version of happy... 1.19.5
186checking for alex... /Users/drydock/.cabal/bin/alex
187checking for version of alex... 3.1.7
188checking for ANSI C header files... (cached) yes
189checking for special C compiler options needed for large files... no
190checking for _FILE_OFFSET_BITS value needed for large files... no
191checking ctype.h usability... yes
192checking ctype.h presence... yes
193checking for ctype.h... yes
194checking dirent.h usability... yes
195checking dirent.h presence... yes
196checking for dirent.h... yes
197checking dlfcn.h usability... yes
198checking dlfcn.h presence... yes
199checking for dlfcn.h... yes
200checking errno.h usability... yes
201checking errno.h presence... yes
202checking for errno.h... yes
203checking fcntl.h usability... yes
204checking fcntl.h presence... yes
205checking for fcntl.h... yes
206checking grp.h usability... yes
207checking grp.h presence... yes
208checking for grp.h... yes
209checking limits.h usability... yes
210checking limits.h presence... yes
211checking for limits.h... yes
212checking locale.h usability... yes
213checking locale.h presence... yes
214checking for locale.h... yes
215checking nlist.h usability... yes
216checking nlist.h presence... yes
217checking for nlist.h... yes
218checking pthread.h usability... yes
219checking pthread.h presence... yes
220checking for pthread.h... yes
221checking pwd.h usability... yes
222checking pwd.h presence... yes
223checking for pwd.h... yes
224checking signal.h usability... yes
225checking signal.h presence... yes
226checking for signal.h... yes
227checking sys/param.h usability... yes
228checking sys/param.h presence... yes
229checking for sys/param.h... yes
230checking sys/mman.h usability... yes
231checking sys/mman.h presence... yes
232checking for sys/mman.h... yes
233checking sys/resource.h usability... yes
234checking sys/resource.h presence... yes
235checking for sys/resource.h... yes
236checking sys/select.h usability... yes
237checking sys/select.h presence... yes
238checking for sys/select.h... yes
239checking sys/time.h usability... yes
240checking sys/time.h presence... yes
241checking for sys/time.h... yes
242checking sys/timeb.h usability... yes
243checking sys/timeb.h presence... yes
244checking for sys/timeb.h... yes
245checking sys/timerfd.h usability... no
246checking sys/timerfd.h presence... no
247checking for sys/timerfd.h... no
248checking sys/timers.h usability... no
249checking sys/timers.h presence... no
250checking for sys/timers.h... no
251checking sys/times.h usability... yes
252checking sys/times.h presence... yes
253checking for sys/times.h... yes
254checking sys/utsname.h usability... yes
255checking sys/utsname.h presence... yes
256checking for sys/utsname.h... yes
257checking sys/wait.h usability... yes
258checking sys/wait.h presence... yes
259checking for sys/wait.h... yes
260checking termios.h usability... yes
261checking termios.h presence... yes
262checking for termios.h... yes
263checking time.h usability... yes
264checking time.h presence... yes
265checking for time.h... yes
266checking utime.h usability... yes
267checking utime.h presence... yes
268checking for utime.h... yes
269checking windows.h usability... no
270checking windows.h presence... no
271checking for windows.h... no
272checking winsock.h usability... no
273checking winsock.h presence... no
274checking for winsock.h... no
275checking sched.h usability... yes
276checking sched.h presence... yes
277checking for sched.h... yes
278checking for sys/cpuset.h... no
279checking whether time.h and sys/time.h may both be included... yes
280checking for long long... yes
281checking size of char... 1
282checking for char... yes
283checking alignment of char... 1
284checking size of double... 8
285checking for double... yes
286checking alignment of double... 8
287checking size of float... 4
288checking for float... yes
289checking alignment of float... 4
290checking size of int... 4
291checking for int... yes
292checking alignment of int... 4
293checking size of long... 8
294checking for long... yes
295checking alignment of long... 8
296checking size of long long... 8
297checking for long long... (cached) yes
298checking alignment of long long... 8
299checking size of short... 2
300checking for short... yes
301checking alignment of short... 2
302checking size of unsigned char... 1
303checking for unsigned char... yes
304checking alignment of unsigned char... 1
305checking size of unsigned int... 4
306checking for unsigned int... yes
307checking alignment of unsigned int... 4
308checking size of unsigned long... 8
309checking for unsigned long... yes
310checking alignment of unsigned long... 8
311checking size of unsigned long long... 8
312checking for unsigned long long... yes
313checking alignment of unsigned long long... 8
314checking size of unsigned short... 2
315checking for unsigned short... yes
316checking alignment of unsigned short... 2
317checking size of void *... 8
318checking for void *... yes
319checking alignment of void *... 8
320checking size of int8_t... 1
321checking for int8_t... yes
322checking alignment of int8_t... 1
323checking size of uint8_t... 1
324checking for uint8_t... yes
325checking alignment of uint8_t... 1
326checking size of int16_t... 2
327checking for int16_t... yes
328checking alignment of int16_t... 2
329checking size of uint16_t... 2
330checking for uint16_t... yes
331checking alignment of uint16_t... 2
332checking size of int32_t... 4
333checking for int32_t... yes
334checking alignment of int32_t... 4
335checking size of uint32_t... 4
336checking for uint32_t... yes
337checking alignment of uint32_t... 4
338checking size of int64_t... 8
339checking for int64_t... yes
340checking alignment of int64_t... 8
341checking size of uint64_t... 8
342checking for uint64_t... yes
343checking alignment of uint64_t... 8
344checking for WinExec... no
345checking for GetModuleFileName... no
346checking for getclock... no
347checking for getrusage... yes
348checking for gettimeofday... yes
349checking for setitimer... yes
350checking for siginterrupt... yes
351checking for sysconf... yes
352checking for times... yes
353checking for ctime_r... yes
354checking for sched_setaffinity... no
355checking for setlocale... yes
356checking whether ctime_r is declared... yes
357checking for closedir in -lmingwex... no
358checking for atan in -lm... yes
359checking for dlopen in -ldl... yes
360checking for dlopen in -ldl... (cached) yes
361checking for size_t... yes
362checking for working alloca.h... yes
363checking for alloca... yes
364checking for pid_t... yes
365checking vfork.h usability... no
366checking vfork.h presence... no
367checking for vfork.h... no
368checking for fork... yes
369checking for vfork... yes
370checking for working fork... yes
371checking for working vfork... (cached) yes
372checking for an ANSI C-conforming const... yes
373checking whether byte ordering is bigendian... no
374checking whether float word order is big endian... no
375checking for nlist in -lelf... no
376checking leading underscore in symbol names... yes
377checking whether __attribute__((visibility("hidden"))) is supported... yes
378checking for clock_gettime in -lrt... no
379checking for clock_gettime in -lrt... (cached) no
380checking for clock_gettime... yes
381checking for timer_settime... no
382checking for timer_create... no
383checking for printf$LDBLStub... no
384checking whether -lpthread is needed for pthreads... checking for pthread_create... yes
385no
386checking for pthread_setname_np in -lpthread... yes
387checking for pthread_setname_np... no
388checking sys/eventfd.h usability... no
389checking sys/eventfd.h presence... no
390checking for sys/eventfd.h... no
391checking for eventfd... no
392checking for __thread support... yes
393checking numa.h usability... no
394checking numa.h presence... no
395checking for numa.h... no
396checking numaif.h usability... no
397checking numaif.h presence... no
398checking for numaif.h... no
399configure: creating ./config.status
400config.status: creating hadrian/cfg/system.config
401config.status: creating mk/config.mk
402config.status: creating mk/install.mk
403config.status: creating mk/project.mk
404config.status: creating rts/rts.cabal
405config.status: creating compiler/ghc.cabal
406config.status: creating ghc/ghc-bin.cabal
407config.status: creating utils/runghc/runghc.cabal
408config.status: creating utils/gen-dll/gen-dll.cabal
409config.status: creating libraries/ghc-boot/ghc-boot.cabal
410config.status: creating libraries/ghc-boot-th/ghc-boot-th.cabal
411config.status: creating libraries/ghci/ghci.cabal
412config.status: creating libraries/ghc-heap/ghc-heap.cabal
413config.status: creating settings
414config.status: creating docs/users_guide/ghc_config.py
415config.status: creating docs/index.html
416config.status: creating libraries/prologue.txt
417config.status: creating distrib/configure.ac
418config.status: creating mk/config.h
419
420----------------------------------------------------------------------
421Configure completed successfully.
422
423 Building GHC version : 8.7.20181210
424 Git commit id : 01dd9beef7a5366b17476958328493dca3a4103e
425
426 Build platform : x86_64-apple-darwin
427 Host platform : x86_64-apple-darwin
428 Target platform : x86_64-apple-darwin
429
430 Bootstrapping using : /opt/ghc-8.4.3/bin/ghc
431 which is version : 8.4.3
432
433 Using (for bootstrapping) : gcc
434 Using clang : gcc
435 which is version : 8.0.0
436 Building a cross compiler : NO
437 Unregisterised : NO
438 hs-cpp : gcc
439 hs-cpp-flags : -E -undef -traditional -Wno-invalid-pp-token -Wno-unicode -Wno-trigraphs
440 ar : ar
441 ld : ld
442 nm : nm
443 libtool : libtool
444 objdump : objdump
445 ranlib : ranlib
446 windres :
447 dllwrap :
448 genlib :
449 Happy : /Users/drydock/.cabal/bin/happy (1.19.5)
450 Alex : /Users/drydock/.cabal/bin/alex (3.1.7)
451 Perl : /usr/bin/perl
452 sphinx-build : /usr/local/opt/sphinx-doc/bin/sphinx-build
453 xelatex :
454
455 Using LLVM tools
456 clang : clang
457 llc :
458 opt :
459
460 HsColour was not found; documentation will not contain source links
461
462 Tools to build Sphinx HTML documentation available: YES
463 Tools to build Sphinx PDF documentation available: NO
464----------------------------------------------------------------------
465
466For a standard build of GHC (fully optimised with profiling), type (g)make.
467
468To make changes to the default build configuration, copy the file
469mk/build.mk.sample to mk/build.mk, and edit the settings in there.
470
471For more information on how to configure your GHC build, see
472 http://ghc.haskell.org/trac/ghc/wiki/Building
473
474===--- building phase 0
475Creating compiler/stage1/build/Config.hs ...
476done.
477[ 1 of 272] Compiling Control.Monad.Cont.Class ( libraries/mtl/Control/Monad/Cont/Class.hs, bootstrapping/Control/Monad/Cont/Class.o )
478[ 2 of 272] Compiling Control.Monad.Error.Class ( libraries/mtl/Control/Monad/Error/Class.hs, bootstrapping/Control/Monad/Error/Class.o )
479[ 3 of 272] Compiling Control.Monad.Identity ( libraries/mtl/Control/Monad/Identity.hs, bootstrapping/Control/Monad/Identity.o )
480[ 4 of 272] Compiling Control.Monad.Reader.Class ( libraries/mtl/Control/Monad/Reader/Class.hs, bootstrapping/Control/Monad/Reader/Class.o )
481[ 5 of 272] Compiling Control.Monad.State.Class ( libraries/mtl/Control/Monad/State/Class.hs, bootstrapping/Control/Monad/State/Class.o )
482[ 6 of 272] Compiling Control.Monad.Trans ( libraries/mtl/Control/Monad/Trans.hs, bootstrapping/Control/Monad/Trans.o )
483[ 7 of 272] Compiling Control.Monad.State.Strict ( libraries/mtl/Control/Monad/State/Strict.hs, bootstrapping/Control/Monad/State/Strict.o )
484[ 8 of 272] Compiling Data.Binary.Builder ( libraries/binary/src/Data/Binary/Builder.hs, bootstrapping/Data/Binary/Builder.o )
485[ 9 of 272] Compiling Data.Binary.FloatCast ( libraries/binary/src/Data/Binary/FloatCast.hs, bootstrapping/Data/Binary/FloatCast.o )
486[ 10 of 272] Compiling Data.Binary.Internal ( libraries/binary/src/Data/Binary/Internal.hs, bootstrapping/Data/Binary/Internal.o )
487[ 11 of 272] Compiling Data.Binary.Get.Internal ( libraries/binary/src/Data/Binary/Get/Internal.hs, bootstrapping/Data/Binary/Get/Internal.o )
488[ 12 of 272] Compiling Data.Binary.Get ( libraries/binary/src/Data/Binary/Get.hs, bootstrapping/Data/Binary/Get.o )
489[ 13 of 272] Compiling Data.Binary.Put ( libraries/binary/src/Data/Binary/Put.hs, bootstrapping/Data/Binary/Put.o )
490[ 14 of 272] Compiling Data.Binary.Class ( libraries/binary/src/Data/Binary/Class.hs, bootstrapping/Data/Binary/Class.o )
491[ 15 of 272] Compiling Data.Binary.Generic ( libraries/binary/src/Data/Binary/Generic.hs, bootstrapping/Data/Binary/Generic.o )
492[ 16 of 272] Compiling Data.Binary ( libraries/binary/src/Data/Binary.hs, bootstrapping/Data/Binary.o )
493[ 17 of 272] Compiling Data.Text.Encoding.Error ( libraries/text/Data/Text/Encoding/Error.hs, bootstrapping/Data/Text/Encoding/Error.o )
494[ 18 of 272] Compiling Data.Text.Internal.Encoding.Utf16 ( libraries/text/Data/Text/Internal/Encoding/Utf16.hs, bootstrapping/Data/Text/Internal/Encoding/Utf16.o )
495[ 19 of 272] Compiling Data.Text.Internal.Encoding.Utf32 ( libraries/text/Data/Text/Internal/Encoding/Utf32.hs, bootstrapping/Data/Text/Internal/Encoding/Utf32.o )
496[ 20 of 272] Compiling Data.Text.Internal.Functions ( libraries/text/Data/Text/Internal/Functions.hs, bootstrapping/Data/Text/Internal/Functions.o )
497[ 21 of 272] Compiling Data.Text.Internal.Unsafe ( libraries/text/Data/Text/Internal/Unsafe.hs, bootstrapping/Data/Text/Internal/Unsafe.o )
498[ 22 of 272] Compiling Data.Text.Internal.Unsafe.Shift ( libraries/text/Data/Text/Internal/Unsafe/Shift.hs, bootstrapping/Data/Text/Internal/Unsafe/Shift.o )
499[ 23 of 272] Compiling Data.Text.Array ( libraries/text/Data/Text/Array.hs, bootstrapping/Data/Text/Array.o )
500[ 24 of 272] Compiling Data.Text.Internal.Unsafe.Char ( libraries/text/Data/Text/Internal/Unsafe/Char.hs, bootstrapping/Data/Text/Internal/Unsafe/Char.o )
501[ 25 of 272] Compiling Data.Text.Internal.Encoding.Utf8 ( libraries/text/Data/Text/Internal/Encoding/Utf8.hs, bootstrapping/Data/Text/Internal/Encoding/Utf8.o )
502[ 26 of 272] Compiling Data.Text.Internal ( libraries/text/Data/Text/Internal.hs, bootstrapping/Data/Text/Internal.o )
503[ 27 of 272] Compiling Data.Text.Internal.Search ( libraries/text/Data/Text/Internal/Search.hs, bootstrapping/Data/Text/Internal/Search.o )
504[ 28 of 272] Compiling Data.Text.Internal.Fusion.Size ( libraries/text/Data/Text/Internal/Fusion/Size.hs, bootstrapping/Data/Text/Internal/Fusion/Size.o )
505[ 29 of 272] Compiling Data.Text.Internal.Fusion.Types ( libraries/text/Data/Text/Internal/Fusion/Types.hs, bootstrapping/Data/Text/Internal/Fusion/Types.o )
506[ 30 of 272] Compiling Data.Text.Internal.Fusion.CaseMapping ( libraries/text/Data/Text/Internal/Fusion/CaseMapping.hs, bootstrapping/Data/Text/Internal/Fusion/CaseMapping.o )
507[ 31 of 272] Compiling Data.Text.Internal.Fusion.Common ( libraries/text/Data/Text/Internal/Fusion/Common.hs, bootstrapping/Data/Text/Internal/Fusion/Common.o )
508[ 32 of 272] Compiling Data.Text.Unsafe ( libraries/text/Data/Text/Unsafe.hs, bootstrapping/Data/Text/Unsafe.o )
509[ 33 of 272] Compiling Data.Text.Internal.Private ( libraries/text/Data/Text/Internal/Private.hs, bootstrapping/Data/Text/Internal/Private.o )
510[ 34 of 272] Compiling Data.Text.Internal.Fusion ( libraries/text/Data/Text/Internal/Fusion.hs, bootstrapping/Data/Text/Internal/Fusion.o )
511[ 35 of 272] Compiling Data.Text.Show ( libraries/text/Data/Text/Show.hs, bootstrapping/Data/Text/Show.o )
512[ 36 of 272] Compiling Data.Text.Internal.Encoding.Fusion.Common ( libraries/text/Data/Text/Internal/Encoding/Fusion/Common.hs, bootstrapping/Data/Text/Internal/Encoding/Fusion/Common.o )
513[ 37 of 272] Compiling Data.Text.Internal.Lazy.Encoding.Fusion ( libraries/text/Data/Text/Internal/Lazy/Encoding/Fusion.hs, bootstrapping/Data/Text/Internal/Lazy/Encoding/Fusion.o )
514[ 38 of 272] Compiling Data.Text.Internal.Encoding.Fusion ( libraries/text/Data/Text/Internal/Encoding/Fusion.hs, bootstrapping/Data/Text/Internal/Encoding/Fusion.o )
515[ 39 of 272] Compiling Data.Text.Encoding ( libraries/text/Data/Text/Encoding.hs, bootstrapping/Data/Text/Encoding.o )
516[ 40 of 272] Compiling Data.Text ( libraries/text/Data/Text.hs, bootstrapping/Data/Text.o )
517[ 41 of 272] Compiling Data.Text.Internal.Lazy ( libraries/text/Data/Text/Internal/Lazy.hs, bootstrapping/Data/Text/Internal/Lazy.o )
518[ 42 of 272] Compiling Data.Text.Internal.Lazy.Search ( libraries/text/Data/Text/Internal/Lazy/Search.hs, bootstrapping/Data/Text/Internal/Lazy/Search.o )
519[ 43 of 272] Compiling Data.Text.Internal.Lazy.Fusion ( libraries/text/Data/Text/Internal/Lazy/Fusion.hs, bootstrapping/Data/Text/Internal/Lazy/Fusion.o )
520[ 44 of 272] Compiling Data.Text.Lazy.Encoding ( libraries/text/Data/Text/Lazy/Encoding.hs, bootstrapping/Data/Text/Lazy/Encoding.o )
521[ 45 of 272] Compiling Data.Text.Lazy ( libraries/text/Data/Text/Lazy.hs, bootstrapping/Data/Text/Lazy.o )
522[ 46 of 272] Compiling Distribution.Compat.Binary ( libraries/Cabal/Cabal/Distribution/Compat/Binary.hs, bootstrapping/Distribution/Compat/Binary.o )
523[ 47 of 272] Compiling Distribution.Compat.Directory ( libraries/Cabal/Cabal/Distribution/Compat/Directory.hs, bootstrapping/Distribution/Compat/Directory.o )
524[ 48 of 272] Compiling Distribution.Compat.Exception ( libraries/Cabal/Cabal/Distribution/Compat/Exception.hs, bootstrapping/Distribution/Compat/Exception.o )
525[ 49 of 272] Compiling Distribution.Compat.MonadFail ( libraries/Cabal/Cabal/Distribution/Compat/MonadFail.hs, bootstrapping/Distribution/Compat/MonadFail.o )
526[ 50 of 272] Compiling Distribution.Compat.Newtype ( libraries/Cabal/Cabal/Distribution/Compat/Newtype.hs, bootstrapping/Distribution/Compat/Newtype.o )
527[ 51 of 272] Compiling Distribution.Compat.Semigroup ( libraries/Cabal/Cabal/Distribution/Compat/Semigroup.hs, bootstrapping/Distribution/Compat/Semigroup.o )
528[ 52 of 272] Compiling Distribution.Compat.Stack ( libraries/Cabal/Cabal/Distribution/Compat/Stack.hs, bootstrapping/Distribution/Compat/Stack.o )
529[ 53 of 272] Compiling Distribution.Compat.Prelude ( libraries/Cabal/Cabal/Distribution/Compat/Prelude.hs, bootstrapping/Distribution/Compat/Prelude.o )
530[ 54 of 272] Compiling Distribution.Compat.ReadP ( libraries/Cabal/Cabal/Distribution/Compat/ReadP.hs, bootstrapping/Distribution/Compat/ReadP.o )
531[ 55 of 272] Compiling Distribution.Compat.Graph ( libraries/Cabal/Cabal/Distribution/Compat/Graph.hs, bootstrapping/Distribution/Compat/Graph.o )
532[ 56 of 272] Compiling Distribution.Compat.GetShortPathName ( libraries/Cabal/Cabal/Distribution/Compat/GetShortPathName.hs, bootstrapping/Distribution/Compat/GetShortPathName.o )
533[ 57 of 272] Compiling Distribution.Compat.DList ( libraries/Cabal/Cabal/Distribution/Compat/DList.hs, bootstrapping/Distribution/Compat/DList.o )
534[ 58 of 272] Compiling Distribution.Compat.Lens ( libraries/Cabal/Cabal/Distribution/Compat/Lens.hs, bootstrapping/Distribution/Compat/Lens.o )
535[ 59 of 272] Compiling Distribution.CabalSpecVersion ( libraries/Cabal/Cabal/Distribution/CabalSpecVersion.hs, bootstrapping/Distribution/CabalSpecVersion.o )
536[ 60 of 272] Compiling Distribution.Compat.Environment ( libraries/Cabal/Cabal/Distribution/Compat/Environment.hs, bootstrapping/Distribution/Compat/Environment.o )
537[ 61 of 272] Compiling Distribution.Compat.CreatePipe ( libraries/Cabal/Cabal/Distribution/Compat/CreatePipe.hs, bootstrapping/Distribution/Compat/CreatePipe.o )
538[ 62 of 272] Compiling Distribution.GetOpt ( libraries/Cabal/Cabal/Distribution/GetOpt.hs, bootstrapping/Distribution/GetOpt.o )
539[ 63 of 272] Compiling Distribution.Lex ( libraries/Cabal/Cabal/Distribution/Lex.hs, bootstrapping/Distribution/Lex.o )
540[ 64 of 272] Compiling Distribution.PackageDescription.Quirks ( libraries/Cabal/Cabal/Distribution/PackageDescription/Quirks.hs, bootstrapping/Distribution/PackageDescription/Quirks.o )
541[ 65 of 272] Compiling Distribution.PackageDescription.Utils ( libraries/Cabal/Cabal/Distribution/PackageDescription/Utils.hs, bootstrapping/Distribution/PackageDescription/Utils.o )
542[ 66 of 272] Compiling Distribution.Parsec.Field ( libraries/Cabal/Cabal/Distribution/Parsec/Field.hs, bootstrapping/Distribution/Parsec/Field.o )
543[ 67 of 272] Compiling Distribution.Pretty ( libraries/Cabal/Cabal/Distribution/Pretty.hs, bootstrapping/Distribution/Pretty.o )
544[ 68 of 272] Compiling Distribution.SPDX.LicenseListVersion ( libraries/Cabal/Cabal/Distribution/SPDX/LicenseListVersion.hs, bootstrapping/Distribution/SPDX/LicenseListVersion.o )
545[ 69 of 272] Compiling Distribution.Simple.Flag ( libraries/Cabal/Cabal/Distribution/Simple/Flag.hs, bootstrapping/Distribution/Simple/Flag.o )
546[ 70 of 272] Compiling Distribution.Simple.PreProcess.Unlit ( libraries/Cabal/Cabal/Distribution/Simple/PreProcess/Unlit.hs, bootstrapping/Distribution/Simple/PreProcess/Unlit.o )
547[ 71 of 272] Compiling Distribution.Simple.Program.Internal ( libraries/Cabal/Cabal/Distribution/Simple/Program/Internal.hs, bootstrapping/Distribution/Simple/Program/Internal.o )
548[ 72 of 272] Compiling Distribution.TestSuite ( libraries/Cabal/Cabal/Distribution/TestSuite.hs, bootstrapping/Distribution/TestSuite.o )
549[ 73 of 272] Compiling Distribution.Types.Condition ( libraries/Cabal/Cabal/Distribution/Types/Condition.hs, bootstrapping/Distribution/Types/Condition.o )
550[ 74 of 272] Compiling Distribution.Types.CondTree ( libraries/Cabal/Cabal/Distribution/Types/CondTree.hs, bootstrapping/Distribution/Types/CondTree.o )
551[ 75 of 272] Compiling Distribution.Utils.Base62 ( libraries/Cabal/Cabal/Distribution/Utils/Base62.hs, bootstrapping/Distribution/Utils/Base62.o )
552[ 76 of 272] Compiling Distribution.Utils.IOData ( libraries/Cabal/Cabal/Distribution/Utils/IOData.hs, bootstrapping/Distribution/Utils/IOData.o )
553[ 77 of 272] Compiling Distribution.Utils.MapAccum ( libraries/Cabal/Cabal/Distribution/Utils/MapAccum.hs, bootstrapping/Distribution/Utils/MapAccum.o )
554[ 78 of 272] Compiling Distribution.Utils.Progress ( libraries/Cabal/Cabal/Distribution/Utils/Progress.hs, bootstrapping/Distribution/Utils/Progress.o )
555[ 79 of 272] Compiling Distribution.Utils.String ( libraries/Cabal/Cabal/Distribution/Utils/String.hs, bootstrapping/Distribution/Utils/String.o )
556[ 80 of 272] Compiling Distribution.Utils.ShortText ( libraries/Cabal/Cabal/Distribution/Utils/ShortText.hs, bootstrapping/Distribution/Utils/ShortText.o )
557[ 81 of 272] Compiling Distribution.Utils.UnionFind ( libraries/Cabal/Cabal/Distribution/Utils/UnionFind.hs, bootstrapping/Distribution/Utils/UnionFind.o )
558[ 82 of 272] Compiling System.FilePath.Posix ( libraries/filepath/System/FilePath/Posix.hs, bootstrapping/System/FilePath/Posix.o )
559[ 83 of 272] Compiling System.FilePath ( libraries/filepath/System/FilePath.hs, bootstrapping/System/FilePath.o )
560[ 84 of 272] Compiling Distribution.Utils.Generic ( libraries/Cabal/Cabal/Distribution/Utils/Generic.hs, bootstrapping/Distribution/Utils/Generic.o )
561[ 85 of 272] Compiling Distribution.Simple.CCompiler ( libraries/Cabal/Cabal/Distribution/Simple/CCompiler.hs, bootstrapping/Distribution/Simple/CCompiler.o )
562[ 86 of 272] Compiling Distribution.Parsec.Common ( libraries/Cabal/Cabal/Distribution/Parsec/Common.hs, bootstrapping/Distribution/Parsec/Common.o )
563[ 87 of 272] Compiling Distribution.Parsec.LexerMonad ( libraries/Cabal/Cabal/Distribution/Parsec/LexerMonad.hs, bootstrapping/Distribution/Parsec/LexerMonad.o )
564[ 88 of 272] Compiling Distribution.Parsec.Lexer ( libraries/Cabal/Cabal/Distribution/Parsec/Lexer.hs, bootstrapping/Distribution/Parsec/Lexer.o )
565[ 89 of 272] Compiling Distribution.Compat.Internal.TempFile ( libraries/Cabal/Cabal/Distribution/Compat/Internal/TempFile.hs, bootstrapping/Distribution/Compat/Internal/TempFile.o )
566[ 90 of 272] Compiling Distribution.Compat.CopyFile ( libraries/Cabal/Cabal/Distribution/Compat/CopyFile.hs, bootstrapping/Distribution/Compat/CopyFile.o )
567[ 91 of 272] Compiling System.FilePath.Windows ( libraries/filepath/System/FilePath/Windows.hs, bootstrapping/System/FilePath/Windows.o )
568[ 92 of 272] Compiling Text.Parsec.Pos ( libraries/parsec/src/Text/Parsec/Pos.hs, bootstrapping/Text/Parsec/Pos.o )
569[ 93 of 272] Compiling Text.Parsec.Error ( libraries/parsec/src/Text/Parsec/Error.hs, bootstrapping/Text/Parsec/Error.o )
570[ 94 of 272] Compiling Text.Parsec.Prim ( libraries/parsec/src/Text/Parsec/Prim.hs, bootstrapping/Text/Parsec/Prim.o )
571[ 95 of 272] Compiling Text.Parsec.Combinator ( libraries/parsec/src/Text/Parsec/Combinator.hs, bootstrapping/Text/Parsec/Combinator.o )
572[ 96 of 272] Compiling Text.Parsec.Char ( libraries/parsec/src/Text/Parsec/Char.hs, bootstrapping/Text/Parsec/Char.o )
573[ 97 of 272] Compiling Text.Parsec ( libraries/parsec/src/Text/Parsec.hs, bootstrapping/Text/Parsec.o )
574[ 98 of 272] Compiling Distribution.Parsec.FieldLineStream ( libraries/Cabal/Cabal/Distribution/Parsec/FieldLineStream.hs, bootstrapping/Distribution/Parsec/FieldLineStream.o )
575[ 99 of 272] Compiling Distribution.Compat.Parsing ( libraries/Cabal/Cabal/Distribution/Compat/Parsing.hs, bootstrapping/Distribution/Compat/Parsing.o )
576[100 of 272] Compiling Distribution.Compat.CharParsing ( libraries/Cabal/Cabal/Distribution/Compat/CharParsing.hs, bootstrapping/Distribution/Compat/CharParsing.o )
577[101 of 272] Compiling Distribution.Parsec.Class ( libraries/Cabal/Cabal/Distribution/Parsec/Class.hs, bootstrapping/Distribution/Parsec/Class.o )
578[102 of 272] Compiling Distribution.Text ( libraries/Cabal/Cabal/Distribution/Text.hs, bootstrapping/Distribution/Text.o )
579[103 of 272] Compiling Language.Haskell.Extension ( libraries/Cabal/Cabal/Language/Haskell/Extension.hs, bootstrapping/Language/Haskell/Extension.o )
580[104 of 272] Compiling Distribution.Types.Version ( libraries/Cabal/Cabal/Distribution/Types/Version.hs, bootstrapping/Distribution/Types/Version.o )
581[105 of 272] Compiling Distribution.Types.VersionRange ( libraries/Cabal/Cabal/Distribution/Types/VersionRange.hs, bootstrapping/Distribution/Types/VersionRange.o )
582[106 of 272] Compiling Distribution.Types.VersionInterval ( libraries/Cabal/Cabal/Distribution/Types/VersionInterval.hs, bootstrapping/Distribution/Types/VersionInterval.o )
583[107 of 272] Compiling Distribution.Version ( libraries/Cabal/Cabal/Distribution/Version.hs, bootstrapping/Distribution/Version.o )
584[108 of 272] Compiling Distribution.Types.TestType ( libraries/Cabal/Cabal/Distribution/Types/TestType.hs, bootstrapping/Distribution/Types/TestType.o )
585[109 of 272] Compiling Distribution.Types.SourceRepo ( libraries/Cabal/Cabal/Distribution/Types/SourceRepo.hs, bootstrapping/Distribution/Types/SourceRepo.o )
586[110 of 272] Compiling Distribution.Types.SourceRepo.Lens ( libraries/Cabal/Cabal/Distribution/Types/SourceRepo/Lens.hs, bootstrapping/Distribution/Types/SourceRepo/Lens.o )
587[111 of 272] Compiling Distribution.Types.PkgconfigName ( libraries/Cabal/Cabal/Distribution/Types/PkgconfigName.hs, bootstrapping/Distribution/Types/PkgconfigName.o )
588[112 of 272] Compiling Distribution.Types.PkgconfigDependency ( libraries/Cabal/Cabal/Distribution/Types/PkgconfigDependency.hs, bootstrapping/Distribution/Types/PkgconfigDependency.o )
589[113 of 272] Compiling Distribution.Types.ForeignLibType ( libraries/Cabal/Cabal/Distribution/Types/ForeignLibType.hs, bootstrapping/Distribution/Types/ForeignLibType.o )
590[114 of 272] Compiling Distribution.Types.ForeignLibOption ( libraries/Cabal/Cabal/Distribution/Types/ForeignLibOption.hs, bootstrapping/Distribution/Types/ForeignLibOption.o )
591[115 of 272] Compiling Distribution.Types.ExecutableScope ( libraries/Cabal/Cabal/Distribution/Types/ExecutableScope.hs, bootstrapping/Distribution/Types/ExecutableScope.o )
592[116 of 272] Compiling Distribution.Types.ComponentId ( libraries/Cabal/Cabal/Distribution/Types/ComponentId.hs, bootstrapping/Distribution/Types/ComponentId.o )
593[117 of 272] Compiling Distribution.Types.BuildType ( libraries/Cabal/Cabal/Distribution/Types/BuildType.hs, bootstrapping/Distribution/Types/BuildType.o )
594[118 of 272] Compiling Distribution.Types.BenchmarkType ( libraries/Cabal/Cabal/Distribution/Types/BenchmarkType.hs, bootstrapping/Distribution/Types/BenchmarkType.o )
595[119 of 272] Compiling Distribution.Types.BenchmarkInterface ( libraries/Cabal/Cabal/Distribution/Types/BenchmarkInterface.hs, bootstrapping/Distribution/Types/BenchmarkInterface.o )
596[120 of 272] Compiling Distribution.Types.AbiHash ( libraries/Cabal/Cabal/Distribution/Types/AbiHash.hs, bootstrapping/Distribution/Types/AbiHash.o )
597[121 of 272] Compiling Distribution.System ( libraries/Cabal/Cabal/Distribution/System.hs, bootstrapping/Distribution/System.o )
598[122 of 272] Compiling Distribution.SPDX.LicenseReference ( libraries/Cabal/Cabal/Distribution/SPDX/LicenseReference.hs, bootstrapping/Distribution/SPDX/LicenseReference.o )
599[123 of 272] Compiling Distribution.SPDX.LicenseId ( libraries/Cabal/Cabal/Distribution/SPDX/LicenseId.hs, bootstrapping/Distribution/SPDX/LicenseId.o )
600[124 of 272] Compiling Distribution.SPDX.LicenseExceptionId ( libraries/Cabal/Cabal/Distribution/SPDX/LicenseExceptionId.hs, bootstrapping/Distribution/SPDX/LicenseExceptionId.o )
601[125 of 272] Compiling Distribution.SPDX.LicenseExpression ( libraries/Cabal/Cabal/Distribution/SPDX/LicenseExpression.hs, bootstrapping/Distribution/SPDX/LicenseExpression.o )
602[126 of 272] Compiling Distribution.SPDX.License ( libraries/Cabal/Cabal/Distribution/SPDX/License.hs, bootstrapping/Distribution/SPDX/License.o )
603[127 of 272] Compiling Distribution.SPDX ( libraries/Cabal/Cabal/Distribution/SPDX.hs, bootstrapping/Distribution/SPDX.o )
604[128 of 272] Compiling Distribution.ReadE ( libraries/Cabal/Cabal/Distribution/ReadE.hs, bootstrapping/Distribution/ReadE.o )
605[129 of 272] Compiling Distribution.Verbosity ( libraries/Cabal/Cabal/Distribution/Verbosity.hs, bootstrapping/Distribution/Verbosity.o )
606[130 of 272] Compiling Distribution.FieldGrammar.Class ( libraries/Cabal/Cabal/Distribution/FieldGrammar/Class.hs, bootstrapping/Distribution/FieldGrammar/Class.o )
607[131 of 272] Compiling Distribution.ModuleName ( libraries/Cabal/Cabal/Distribution/ModuleName.hs, bootstrapping/Distribution/ModuleName.o )
608[132 of 272] Compiling Distribution.Types.TestSuiteInterface ( libraries/Cabal/Cabal/Distribution/Types/TestSuiteInterface.hs, bootstrapping/Distribution/Types/TestSuiteInterface.o )
609[133 of 272] Compiling Distribution.Types.ModuleRenaming ( libraries/Cabal/Cabal/Distribution/Types/ModuleRenaming.hs, bootstrapping/Distribution/Types/ModuleRenaming.o )
610[134 of 272] Compiling Distribution.Types.IncludeRenaming ( libraries/Cabal/Cabal/Distribution/Types/IncludeRenaming.hs, bootstrapping/Distribution/Types/IncludeRenaming.o )
611[135 of 272] Compiling Distribution.License ( libraries/Cabal/Cabal/Distribution/License.hs, bootstrapping/Distribution/License.o )
612[136 of 272] Compiling Distribution.Compiler ( libraries/Cabal/Cabal/Distribution/Compiler.hs, bootstrapping/Distribution/Compiler.o )
613[137 of 272] Compiling Distribution.Parsec.Newtypes ( libraries/Cabal/Cabal/Distribution/Parsec/Newtypes.hs, bootstrapping/Distribution/Parsec/Newtypes.o )
614[138 of 272] Compiling Distribution.ParseUtils ( libraries/Cabal/Cabal/Distribution/ParseUtils.hs, bootstrapping/Distribution/ParseUtils.o )
615[139 of 272] Compiling Distribution.Types.PackageName ( libraries/Cabal/Cabal/Distribution/Types/PackageName.hs, bootstrapping/Distribution/Types/PackageName.o )
616[140 of 272] Compiling Distribution.Types.UnqualComponentName ( libraries/Cabal/Cabal/Distribution/Types/UnqualComponentName.hs, bootstrapping/Distribution/Types/UnqualComponentName.o )
617[141 of 272] Compiling Distribution.Types.LibraryName ( libraries/Cabal/Cabal/Distribution/Types/LibraryName.hs, bootstrapping/Distribution/Types/LibraryName.o )
618[142 of 272] Compiling Distribution.Types.ComponentName ( libraries/Cabal/Cabal/Distribution/Types/ComponentName.hs, bootstrapping/Distribution/Types/ComponentName.o )
619[143 of 272] Compiling Distribution.Types.PackageId ( libraries/Cabal/Cabal/Distribution/Types/PackageId.hs, bootstrapping/Distribution/Types/PackageId.o )
620[144 of 272] Compiling Distribution.Types.UnitId ( libraries/Cabal/Cabal/Distribution/Types/UnitId.hs, bootstrapping/Distribution/Types/UnitId.o )
621[145 of 272] Compiling Distribution.Types.Module ( libraries/Cabal/Cabal/Distribution/Types/Module.hs, bootstrapping/Distribution/Types/Module.o )
622[146 of 272] Compiling Distribution.Types.PackageId.Lens ( libraries/Cabal/Cabal/Distribution/Types/PackageId/Lens.hs, bootstrapping/Distribution/Types/PackageId/Lens.o )
623[147 of 272] Compiling Distribution.Simple.Utils ( libraries/Cabal/Cabal/Distribution/Simple/Utils.hs, bootstrapping/Distribution/Simple/Utils.o )
624[148 of 272] Compiling Distribution.Utils.NubList ( libraries/Cabal/Cabal/Distribution/Utils/NubList.hs, bootstrapping/Distribution/Utils/NubList.o )
625[149 of 272] Compiling Distribution.Utils.LogProgress ( libraries/Cabal/Cabal/Distribution/Utils/LogProgress.hs, bootstrapping/Distribution/Utils/LogProgress.o )
626[150 of 272] Compiling Distribution.Simple.Program.ResponseFile ( libraries/Cabal/Cabal/Distribution/Simple/Program/ResponseFile.hs, bootstrapping/Distribution/Simple/Program/ResponseFile.o )
627[151 of 272] Compiling Distribution.Simple.Program.Find ( libraries/Cabal/Cabal/Distribution/Simple/Program/Find.hs, bootstrapping/Distribution/Simple/Program/Find.o )
628[152 of 272] Compiling Distribution.Simple.Glob ( libraries/Cabal/Cabal/Distribution/Simple/Glob.hs, bootstrapping/Distribution/Simple/Glob.o )
629[153 of 272] Compiling Distribution.Simple.Compiler ( libraries/Cabal/Cabal/Distribution/Simple/Compiler.hs, bootstrapping/Distribution/Simple/Compiler.o )
630[154 of 272] Compiling Distribution.Simple.GHC.ImplInfo ( libraries/Cabal/Cabal/Distribution/Simple/GHC/ImplInfo.hs, bootstrapping/Distribution/Simple/GHC/ImplInfo.o )
631[155 of 272] Compiling Distribution.Parsec.ParseResult ( libraries/Cabal/Cabal/Distribution/Parsec/ParseResult.hs, bootstrapping/Distribution/Parsec/ParseResult.o )
632[156 of 272] Compiling Distribution.FieldGrammar.Parsec ( libraries/Cabal/Cabal/Distribution/FieldGrammar/Parsec.hs, bootstrapping/Distribution/FieldGrammar/Parsec.o )
633[157 of 272] Compiling Distribution.Backpack.DescribeUnitId ( libraries/Cabal/Cabal/Distribution/Backpack/DescribeUnitId.hs, bootstrapping/Distribution/Backpack/DescribeUnitId.o )
634[158 of 272] Compiling Distribution.Types.ModuleReexport ( libraries/Cabal/Cabal/Distribution/Types/ModuleReexport.hs, bootstrapping/Distribution/Types/ModuleReexport.o )
635[159 of 272] Compiling Distribution.Types.Mixin ( libraries/Cabal/Cabal/Distribution/Types/Mixin.hs, bootstrapping/Distribution/Types/Mixin.o )
636[160 of 272] Compiling Distribution.Types.GivenComponent ( libraries/Cabal/Cabal/Distribution/Types/GivenComponent.hs, bootstrapping/Distribution/Types/GivenComponent.o )
637[161 of 272] Compiling Distribution.Types.ExeDependency ( libraries/Cabal/Cabal/Distribution/Types/ExeDependency.hs, bootstrapping/Distribution/Types/ExeDependency.o )
638[162 of 272] Compiling Distribution.Types.Dependency ( libraries/Cabal/Cabal/Distribution/Types/Dependency.hs, bootstrapping/Distribution/Types/Dependency.o )
639[163 of 272] Compiling Distribution.Types.SetupBuildInfo ( libraries/Cabal/Cabal/Distribution/Types/SetupBuildInfo.hs, bootstrapping/Distribution/Types/SetupBuildInfo.o )
640[164 of 272] Compiling Distribution.Types.SetupBuildInfo.Lens ( libraries/Cabal/Cabal/Distribution/Types/SetupBuildInfo/Lens.hs, bootstrapping/Distribution/Types/SetupBuildInfo/Lens.o )
641[165 of 272] Compiling Distribution.Types.DependencyMap ( libraries/Cabal/Cabal/Distribution/Types/DependencyMap.hs, bootstrapping/Distribution/Types/DependencyMap.o )
642[166 of 272] Compiling Distribution.Types.MungedPackageName ( libraries/Cabal/Cabal/Distribution/Types/MungedPackageName.hs, bootstrapping/Distribution/Types/MungedPackageName.o )
643[167 of 272] Compiling Distribution.Types.MungedPackageId ( libraries/Cabal/Cabal/Distribution/Types/MungedPackageId.hs, bootstrapping/Distribution/Types/MungedPackageId.o )
644[168 of 272] Compiling Distribution.Package ( libraries/Cabal/Cabal/Distribution/Package.hs, bootstrapping/Distribution/Package.o )
645[169 of 272] Compiling Distribution.Types.AnnotatedId ( libraries/Cabal/Cabal/Distribution/Types/AnnotatedId.hs, bootstrapping/Distribution/Types/AnnotatedId.o )
646[170 of 272] Compiling Distribution.Types.ComponentInclude ( libraries/Cabal/Cabal/Distribution/Types/ComponentInclude.hs, bootstrapping/Distribution/Types/ComponentInclude.o )
647[171 of 272] Compiling Distribution.Types.AbiDependency ( libraries/Cabal/Cabal/Distribution/Types/AbiDependency.hs, bootstrapping/Distribution/Types/AbiDependency.o )
648[172 of 272] Compiling Distribution.Simple.InstallDirs ( libraries/Cabal/Cabal/Distribution/Simple/InstallDirs.hs, bootstrapping/Distribution/Simple/InstallDirs.o )
649[173 of 272] Compiling Distribution.Types.LegacyExeDependency ( libraries/Cabal/Cabal/Distribution/Types/LegacyExeDependency.hs, bootstrapping/Distribution/Types/LegacyExeDependency.o )
650[174 of 272] Compiling Distribution.Types.BuildInfo ( libraries/Cabal/Cabal/Distribution/Types/BuildInfo.hs, bootstrapping/Distribution/Types/BuildInfo.o )
651[175 of 272] Compiling Distribution.Types.HookedBuildInfo ( libraries/Cabal/Cabal/Distribution/Types/HookedBuildInfo.hs, bootstrapping/Distribution/Types/HookedBuildInfo.o )
652[176 of 272] Compiling Distribution.Types.BuildInfo.Lens ( libraries/Cabal/Cabal/Distribution/Types/BuildInfo/Lens.hs, bootstrapping/Distribution/Types/BuildInfo/Lens.o )
653[177 of 272] Compiling Distribution.Types.TestSuite ( libraries/Cabal/Cabal/Distribution/Types/TestSuite.hs, bootstrapping/Distribution/Types/TestSuite.o )
654[178 of 272] Compiling Distribution.Types.TestSuite.Lens ( libraries/Cabal/Cabal/Distribution/Types/TestSuite/Lens.hs, bootstrapping/Distribution/Types/TestSuite/Lens.o )
655[179 of 272] Compiling Distribution.Types.Library ( libraries/Cabal/Cabal/Distribution/Types/Library.hs, bootstrapping/Distribution/Types/Library.o )
656[180 of 272] Compiling Distribution.Types.Library.Lens ( libraries/Cabal/Cabal/Distribution/Types/Library/Lens.hs, bootstrapping/Distribution/Types/Library/Lens.o )
657[181 of 272] Compiling Distribution.Types.ForeignLib ( libraries/Cabal/Cabal/Distribution/Types/ForeignLib.hs, bootstrapping/Distribution/Types/ForeignLib.o )
658[182 of 272] Compiling Distribution.Types.ForeignLib.Lens ( libraries/Cabal/Cabal/Distribution/Types/ForeignLib/Lens.hs, bootstrapping/Distribution/Types/ForeignLib/Lens.o )
659[183 of 272] Compiling Distribution.Types.Executable ( libraries/Cabal/Cabal/Distribution/Types/Executable.hs, bootstrapping/Distribution/Types/Executable.o )
660[184 of 272] Compiling Distribution.Types.Executable.Lens ( libraries/Cabal/Cabal/Distribution/Types/Executable/Lens.hs, bootstrapping/Distribution/Types/Executable/Lens.o )
661[185 of 272] Compiling Distribution.Types.Benchmark ( libraries/Cabal/Cabal/Distribution/Types/Benchmark.hs, bootstrapping/Distribution/Types/Benchmark.o )
662[186 of 272] Compiling Distribution.Types.Component ( libraries/Cabal/Cabal/Distribution/Types/Component.hs, bootstrapping/Distribution/Types/Component.o )
663[187 of 272] Compiling Distribution.Types.ComponentRequestedSpec ( libraries/Cabal/Cabal/Distribution/Types/ComponentRequestedSpec.hs, bootstrapping/Distribution/Types/ComponentRequestedSpec.o )
664[188 of 272] Compiling Distribution.Types.PackageDescription ( libraries/Cabal/Cabal/Distribution/Types/PackageDescription.hs, bootstrapping/Distribution/Types/PackageDescription.o )
665[189 of 272] Compiling Distribution.Types.GenericPackageDescription ( libraries/Cabal/Cabal/Distribution/Types/GenericPackageDescription.hs, bootstrapping/Distribution/Types/GenericPackageDescription.o )
666[190 of 272] Compiling Distribution.Types.GenericPackageDescription.Lens ( libraries/Cabal/Cabal/Distribution/Types/GenericPackageDescription/Lens.hs, bootstrapping/Distribution/Types/GenericPackageDescription/Lens.o )
667[191 of 272] Compiling Distribution.Parsec.ConfVar ( libraries/Cabal/Cabal/Distribution/Parsec/ConfVar.hs, bootstrapping/Distribution/Parsec/ConfVar.o )
668[192 of 272] Compiling Distribution.Types.Benchmark.Lens ( libraries/Cabal/Cabal/Distribution/Types/Benchmark/Lens.hs, bootstrapping/Distribution/Types/Benchmark/Lens.o )
669[193 of 272] Compiling Distribution.Types.PackageDescription.Lens ( libraries/Cabal/Cabal/Distribution/Types/PackageDescription/Lens.hs, bootstrapping/Distribution/Types/PackageDescription/Lens.o )
670[194 of 272] Compiling Distribution.Types.Lens ( libraries/Cabal/Cabal/Distribution/Types/Lens.hs, bootstrapping/Distribution/Types/Lens.o )
671[195 of 272] Compiling Distribution.PackageDescription ( libraries/Cabal/Cabal/Distribution/PackageDescription.hs, bootstrapping/Distribution/PackageDescription.o )
672[196 of 272] Compiling Distribution.Simple.Program.Types ( libraries/Cabal/Cabal/Distribution/Simple/Program/Types.hs, bootstrapping/Distribution/Simple/Program/Types.o )
673[197 of 272] Compiling Distribution.Simple.Program.Run ( libraries/Cabal/Cabal/Distribution/Simple/Program/Run.hs, bootstrapping/Distribution/Simple/Program/Run.o )
674[198 of 272] Compiling Distribution.Simple.Program.Script ( libraries/Cabal/Cabal/Distribution/Simple/Program/Script.hs, bootstrapping/Distribution/Simple/Program/Script.o )
675[199 of 272] Compiling Distribution.Simple.Program.Hpc ( libraries/Cabal/Cabal/Distribution/Simple/Program/Hpc.hs, bootstrapping/Distribution/Simple/Program/Hpc.o )
676[200 of 272] Compiling Distribution.Simple.BuildToolDepends ( libraries/Cabal/Cabal/Distribution/Simple/BuildToolDepends.hs, bootstrapping/Distribution/Simple/BuildToolDepends.o )
677[201 of 272] Compiling Distribution.Simple.Command ( libraries/Cabal/Cabal/Distribution/Simple/Command.hs, bootstrapping/Distribution/Simple/Command.o )
678[202 of 272] Compiling Distribution.FieldGrammar.Pretty ( libraries/Cabal/Cabal/Distribution/FieldGrammar/Pretty.hs, bootstrapping/Distribution/FieldGrammar/Pretty.o )
679[203 of 272] Compiling Distribution.FieldGrammar ( libraries/Cabal/Cabal/Distribution/FieldGrammar.hs, bootstrapping/Distribution/FieldGrammar.o )
680[204 of 272] Compiling Distribution.FieldGrammar.FieldDescrs ( libraries/Cabal/Cabal/Distribution/FieldGrammar/FieldDescrs.hs, bootstrapping/Distribution/FieldGrammar/FieldDescrs.o )
681[205 of 272] Compiling Distribution.PackageDescription.FieldGrammar ( libraries/Cabal/Cabal/Distribution/PackageDescription/FieldGrammar.hs, bootstrapping/Distribution/PackageDescription/FieldGrammar.o )
682[206 of 272] Compiling Distribution.PackageDescription.PrettyPrint ( libraries/Cabal/Cabal/Distribution/PackageDescription/PrettyPrint.hs, bootstrapping/Distribution/PackageDescription/PrettyPrint.o )
683[207 of 272] Compiling Distribution.PackageDescription.Configuration ( libraries/Cabal/Cabal/Distribution/PackageDescription/Configuration.hs, bootstrapping/Distribution/PackageDescription/Configuration.o )
684[208 of 272] Compiling Distribution.Backpack ( libraries/Cabal/Cabal/Distribution/Backpack.hs, bootstrapping/Distribution/Backpack.o )
685[209 of 272] Compiling Distribution.Types.ExposedModule ( libraries/Cabal/Cabal/Distribution/Types/ExposedModule.hs, bootstrapping/Distribution/Types/ExposedModule.o )
686[210 of 272] Compiling Distribution.Types.InstalledPackageInfo ( libraries/Cabal/Cabal/Distribution/Types/InstalledPackageInfo.hs, bootstrapping/Distribution/Types/InstalledPackageInfo.o )
687[211 of 272] Compiling Distribution.Types.InstalledPackageInfo.Lens ( libraries/Cabal/Cabal/Distribution/Types/InstalledPackageInfo/Lens.hs, bootstrapping/Distribution/Types/InstalledPackageInfo/Lens.o )
688[212 of 272] Compiling Distribution.Types.InstalledPackageInfo.FieldGrammar ( libraries/Cabal/Cabal/Distribution/Types/InstalledPackageInfo/FieldGrammar.hs, bootstrapping/Distribution/Types/InstalledPackageInfo/FieldGrammar.o )
689[213 of 272] Compiling Distribution.Simple.Program.GHC ( libraries/Cabal/Cabal/Distribution/Simple/Program/GHC.hs, bootstrapping/Distribution/Simple/Program/GHC.o )
690[214 of 272] Compiling Distribution.Simple.Program.Builtin ( libraries/Cabal/Cabal/Distribution/Simple/Program/Builtin.hs, bootstrapping/Distribution/Simple/Program/Builtin.o )
691[215 of 272] Compiling Distribution.Simple.Program.Db ( libraries/Cabal/Cabal/Distribution/Simple/Program/Db.hs, bootstrapping/Distribution/Simple/Program/Db.o )
692[216 of 272] Compiling Distribution.Simple.Program ( libraries/Cabal/Cabal/Distribution/Simple/Program.hs, bootstrapping/Distribution/Simple/Program.o )
693[217 of 272] Compiling Distribution.Simple.Setup ( libraries/Cabal/Cabal/Distribution/Simple/Setup.hs, bootstrapping/Distribution/Simple/Setup.o )
694[218 of 272] Compiling Distribution.Simple.Program.Strip ( libraries/Cabal/Cabal/Distribution/Simple/Program/Strip.hs, bootstrapping/Distribution/Simple/Program/Strip.o )
695[219 of 272] Compiling Distribution.Backpack.ModSubst ( libraries/Cabal/Cabal/Distribution/Backpack/ModSubst.hs, bootstrapping/Distribution/Backpack/ModSubst.o )
696[220 of 272] Compiling Distribution.Backpack.ModuleScope ( libraries/Cabal/Cabal/Distribution/Backpack/ModuleScope.hs, bootstrapping/Distribution/Backpack/ModuleScope.o )
697[221 of 272] Compiling Distribution.Backpack.FullUnitId ( libraries/Cabal/Cabal/Distribution/Backpack/FullUnitId.hs, bootstrapping/Distribution/Backpack/FullUnitId.o )
698[222 of 272] Compiling Distribution.Parsec.Parser ( libraries/Cabal/Cabal/Distribution/Parsec/Parser.hs, bootstrapping/Distribution/Parsec/Parser.o )
699[223 of 272] Compiling Distribution.PackageDescription.Parsec ( libraries/Cabal/Cabal/Distribution/PackageDescription/Parsec.hs, bootstrapping/Distribution/PackageDescription/Parsec.o )
700[224 of 272] Compiling Distribution.InstalledPackageInfo ( libraries/Cabal/Cabal/Distribution/InstalledPackageInfo.hs, bootstrapping/Distribution/InstalledPackageInfo.o )
701[225 of 272] Compiling Distribution.Types.ComponentLocalBuildInfo ( libraries/Cabal/Cabal/Distribution/Types/ComponentLocalBuildInfo.hs, bootstrapping/Distribution/Types/ComponentLocalBuildInfo.o )
702[226 of 272] Compiling Distribution.Types.TargetInfo ( libraries/Cabal/Cabal/Distribution/Types/TargetInfo.hs, bootstrapping/Distribution/Types/TargetInfo.o )
703[227 of 272] Compiling Distribution.Simple.Program.HcPkg ( libraries/Cabal/Cabal/Distribution/Simple/Program/HcPkg.hs, bootstrapping/Distribution/Simple/Program/HcPkg.o )
704[228 of 272] Compiling Distribution.Simple.PackageIndex ( libraries/Cabal/Cabal/Distribution/Simple/PackageIndex.hs, bootstrapping/Distribution/Simple/PackageIndex.o )
705[229 of 272] Compiling Distribution.Types.LocalBuildInfo ( libraries/Cabal/Cabal/Distribution/Types/LocalBuildInfo.hs, bootstrapping/Distribution/Types/LocalBuildInfo.o )
706[230 of 272] Compiling Distribution.Simple.LocalBuildInfo ( libraries/Cabal/Cabal/Distribution/Simple/LocalBuildInfo.hs, bootstrapping/Distribution/Simple/LocalBuildInfo.o )
707[231 of 272] Compiling Distribution.Simple.Test.Log ( libraries/Cabal/Cabal/Distribution/Simple/Test/Log.hs, bootstrapping/Distribution/Simple/Test/Log.o )
708[232 of 272] Compiling Distribution.Simple.Program.Ld ( libraries/Cabal/Cabal/Distribution/Simple/Program/Ld.hs, bootstrapping/Distribution/Simple/Program/Ld.o )
709[233 of 272] Compiling Distribution.Simple.Program.Ar ( libraries/Cabal/Cabal/Distribution/Simple/Program/Ar.hs, bootstrapping/Distribution/Simple/Program/Ar.o )
710[234 of 272] Compiling Distribution.Simple.Hpc ( libraries/Cabal/Cabal/Distribution/Simple/Hpc.hs, bootstrapping/Distribution/Simple/Hpc.o )
711[235 of 272] Compiling Distribution.Simple.BuildTarget ( libraries/Cabal/Cabal/Distribution/Simple/BuildTarget.hs, bootstrapping/Distribution/Simple/BuildTarget.o )
712[236 of 272] Compiling Distribution.Simple.BuildPaths ( libraries/Cabal/Cabal/Distribution/Simple/BuildPaths.hs, bootstrapping/Distribution/Simple/BuildPaths.o )
713[237 of 272] Compiling Distribution.Simple.UHC ( libraries/Cabal/Cabal/Distribution/Simple/UHC.hs, bootstrapping/Distribution/Simple/UHC.o )
714[238 of 272] Compiling Distribution.PackageDescription.Check ( libraries/Cabal/Cabal/Distribution/PackageDescription/Check.hs, bootstrapping/Distribution/PackageDescription/Check.o )
715[239 of 272] Compiling Distribution.Simple.Build.PathsModule ( libraries/Cabal/Cabal/Distribution/Simple/Build/PathsModule.hs, bootstrapping/Distribution/Simple/Build/PathsModule.o )
716[240 of 272] Compiling Distribution.Simple.Test.LibV09 ( libraries/Cabal/Cabal/Distribution/Simple/Test/LibV09.hs, bootstrapping/Distribution/Simple/Test/LibV09.o )
717[241 of 272] Compiling Distribution.Simple.PreProcess ( libraries/Cabal/Cabal/Distribution/Simple/PreProcess.hs, bootstrapping/Distribution/Simple/PreProcess.o )
718[242 of 272] Compiling Distribution.Simple.UserHooks ( libraries/Cabal/Cabal/Distribution/Simple/UserHooks.hs, bootstrapping/Distribution/Simple/UserHooks.o )
719[243 of 272] Compiling Distribution.Simple.SrcDist ( libraries/Cabal/Cabal/Distribution/Simple/SrcDist.hs, bootstrapping/Distribution/Simple/SrcDist.o )
720[244 of 272] Compiling Distribution.Simple.Test.ExeV10 ( libraries/Cabal/Cabal/Distribution/Simple/Test/ExeV10.hs, bootstrapping/Distribution/Simple/Test/ExeV10.o )
721[245 of 272] Compiling Distribution.Simple.Test ( libraries/Cabal/Cabal/Distribution/Simple/Test.hs, bootstrapping/Distribution/Simple/Test.o )
722[246 of 272] Compiling Distribution.Simple.Build.Macros ( libraries/Cabal/Cabal/Distribution/Simple/Build/Macros.hs, bootstrapping/Distribution/Simple/Build/Macros.o )
723[247 of 272] Compiling Distribution.Simple.Bench ( libraries/Cabal/Cabal/Distribution/Simple/Bench.hs, bootstrapping/Distribution/Simple/Bench.o )
724[248 of 272] Compiling Distribution.Backpack.Id ( libraries/Cabal/Cabal/Distribution/Backpack/Id.hs, bootstrapping/Distribution/Backpack/Id.o )
725[249 of 272] Compiling Distribution.Backpack.ConfiguredComponent ( libraries/Cabal/Cabal/Distribution/Backpack/ConfiguredComponent.hs, bootstrapping/Distribution/Backpack/ConfiguredComponent.o )
726[250 of 272] Compiling Distribution.Backpack.ComponentsGraph ( libraries/Cabal/Cabal/Distribution/Backpack/ComponentsGraph.hs, bootstrapping/Distribution/Backpack/ComponentsGraph.o )
727[251 of 272] Compiling Distribution.Simple.HaskellSuite ( libraries/Cabal/Cabal/Distribution/Simple/HaskellSuite.hs, bootstrapping/Distribution/Simple/HaskellSuite.o )
728[252 of 272] Compiling Distribution.Simple.GHC.Internal ( libraries/Cabal/Cabal/Distribution/Simple/GHC/Internal.hs, bootstrapping/Distribution/Simple/GHC/Internal.o )
729[253 of 272] Compiling Distribution.Simple.GHCJS ( libraries/Cabal/Cabal/Distribution/Simple/GHCJS.hs, bootstrapping/Distribution/Simple/GHCJS.o )
730[254 of 272] Compiling Distribution.Backpack.ModuleShape ( libraries/Cabal/Cabal/Distribution/Backpack/ModuleShape.hs, bootstrapping/Distribution/Backpack/ModuleShape.o )
731[255 of 272] Compiling Distribution.Backpack.UnifyM ( libraries/Cabal/Cabal/Distribution/Backpack/UnifyM.hs, bootstrapping/Distribution/Backpack/UnifyM.o )
732[256 of 272] Compiling Distribution.Backpack.MixLink ( libraries/Cabal/Cabal/Distribution/Backpack/MixLink.hs, bootstrapping/Distribution/Backpack/MixLink.o )
733[257 of 272] Compiling Distribution.Backpack.PreModuleShape ( libraries/Cabal/Cabal/Distribution/Backpack/PreModuleShape.hs, bootstrapping/Distribution/Backpack/PreModuleShape.o )
734[258 of 272] Compiling Distribution.Backpack.PreExistingComponent ( libraries/Cabal/Cabal/Distribution/Backpack/PreExistingComponent.hs, bootstrapping/Distribution/Backpack/PreExistingComponent.o )
735[259 of 272] Compiling Distribution.Backpack.LinkedComponent ( libraries/Cabal/Cabal/Distribution/Backpack/LinkedComponent.hs, bootstrapping/Distribution/Backpack/LinkedComponent.o )
736[260 of 272] Compiling Distribution.Backpack.ReadyComponent ( libraries/Cabal/Cabal/Distribution/Backpack/ReadyComponent.hs, bootstrapping/Distribution/Backpack/ReadyComponent.o )
737[261 of 272] Compiling Distribution.Backpack.Configure ( libraries/Cabal/Cabal/Distribution/Backpack/Configure.hs, bootstrapping/Distribution/Backpack/Configure.o )
738[262 of 272] Compiling Text.Parsec.String ( libraries/parsec/src/Text/Parsec/String.hs, bootstrapping/Text/Parsec/String.o )
739[263 of 272] Compiling Distribution.Simple.GHC.EnvironmentParser ( libraries/Cabal/Cabal/Distribution/Simple/GHC/EnvironmentParser.hs, bootstrapping/Distribution/Simple/GHC/EnvironmentParser.o )
740[264 of 272] Compiling Distribution.Simple.GHC ( libraries/Cabal/Cabal/Distribution/Simple/GHC.hs, bootstrapping/Distribution/Simple/GHC.o )
741[265 of 272] Compiling Distribution.Simple.Register ( libraries/Cabal/Cabal/Distribution/Simple/Register.hs, bootstrapping/Distribution/Simple/Register.o )
742[266 of 272] Compiling Distribution.Simple.Install ( libraries/Cabal/Cabal/Distribution/Simple/Install.hs, bootstrapping/Distribution/Simple/Install.o )
743[267 of 272] Compiling Distribution.Simple.Configure ( libraries/Cabal/Cabal/Distribution/Simple/Configure.hs, bootstrapping/Distribution/Simple/Configure.o )
744[268 of 272] Compiling Distribution.Simple.Build ( libraries/Cabal/Cabal/Distribution/Simple/Build.hs, bootstrapping/Distribution/Simple/Build.o )
745[269 of 272] Compiling Distribution.Simple.Haddock ( libraries/Cabal/Cabal/Distribution/Simple/Haddock.hs, bootstrapping/Distribution/Simple/Haddock.o )
746[270 of 272] Compiling Distribution.Simple.Doctest ( libraries/Cabal/Cabal/Distribution/Simple/Doctest.hs, bootstrapping/Distribution/Simple/Doctest.o )
747[271 of 272] Compiling Distribution.Simple ( libraries/Cabal/Cabal/Distribution/Simple.hs, bootstrapping/Distribution/Simple.o )
748[272 of 272] Compiling Main ( utils/ghc-cabal/Main.hs, bootstrapping/Main.o )
749Linking utils/ghc-cabal/dist/build/tmp/ghc-cabal ...
750 GHC PKG libraries/binary/dist-boot/package-data.mk
751 GHC PKG libraries/text/dist-boot/package-data.mk
752 GHC PKG libraries/transformers/dist-boot/package-data.mk
753 GHC PKG libraries/mtl/dist-boot/package-data.mk
754 GHC PKG libraries/parsec/dist-boot/package-data.mk
755 GHC PKG libraries/Cabal/Cabal/dist-boot/package-data.mk
756 GHC PKG libraries/hpc/dist-boot/package-data.mk
757 GHC PKG libraries/ghc-boot-th/dist-boot/package-data.mk
758 GHC PKG libraries/ghc-boot/dist-boot/package-data.mk
759 GHC PKG libraries/template-haskell/dist-boot/package-data.mk
760 GHC PKG libraries/ghc-heap/dist-boot/package-data.mk
761 GHC PKG libraries/ghci/dist-boot/package-data.mk
762 GHC PKG libraries/terminfo/dist-boot/package-data.mk
763 GHC PKG compiler/stage1/package-data.mk
764Creating includes/ghcautoconf.h...
765 ALEX utils/genprimopcode/dist/build/Lexer.hs
766 HAPPY utils/genprimopcode/dist/build/Parser.hs
767Creating includes/ghcplatform.h...
768Done.
769Done.
770===--- building phase 1
771Creating compiler/stage1/ghc_boot_platform.h...
772 ALEX compiler/stage1/build/CmmLex.hs
773 HAPPY compiler/stage1/build/CmmParse.hs
774Done.
775 ALEX compiler/stage1/build/Lexer.hs
776 HAPPY compiler/stage1/build/Parser.hs
777 HC [stage 0] utils/hsc2hs/dist/build/HSCParser.o
778 HC [stage 0] utils/hsc2hs/dist/build/Flags.o
779 HC [stage 0] utils/hsc2hs/dist/build/Common.o
780 HC [stage 0] utils/hsc2hs/dist/build/ATTParser.o
781 HC [stage 0] utils/hsc2hs/dist/build/Compat/ResponseFile.o
782 HC [stage 0] utils/hsc2hs/dist/build/Paths_hsc2hs.o
783 HC [stage 0] utils/deriveConstants/dist/build/Main.o
784Creating includes/ghcversion.h...
785Done.
786 HC [stage 0] utils/genprimopcode/dist/build/Syntax.o
787 HC [stage 0] utils/genprimopcode/dist/build/ParserM.o
788 HC [stage 0] utils/hsc2hs/dist/build/C.o
789 HC [stage 0] utils/deriveConstants/dist/build/tmp/deriveConstants
790 HC [stage 0] utils/genprimopcode/dist/build/Lexer.o
791 HC [stage 0] utils/hsc2hs/dist/build/UtilsCodegen.o
792 HC [stage 0] utils/hsc2hs/dist/build/CrossCodegen.o
793 HC [stage 0] utils/genprimopcode/dist/build/Parser.o
794 HC [stage 0] utils/hsc2hs/dist/build/DirectCodegen.o
795 HC [stage 0] utils/genprimopcode/dist/build/Main.o
796 HC [stage 0] utils/hsc2hs/dist/build/Main.o
797 HC [stage 0] utils/hsc2hs/dist/build/tmp/hsc2hs
798 HC [stage 0] utils/genprimopcode/dist/build/tmp/genprimopcode
799 HSC2HS compiler/stage1/build/Fingerprint.hs
800 HSC2HS libraries/ghci/dist-boot/build/GHCi/FFI.hs
801 HSC2HS libraries/ghci/dist-boot/build/GHCi/InfoTable.hs
802 HSC2HS libraries/ghc-heap/dist-boot/build/GHC/Exts/Heap/Constants.hs
803 HSC2HS libraries/ghc-heap/dist-boot/build/GHC/Exts/Heap/InfoTable.hs
804 HSC2HS libraries/ghc-heap/dist-boot/build/GHC/Exts/Heap/InfoTable/Types.hs
805 HSC2HS libraries/ghc-heap/dist-boot/build/GHC/Exts/Heap/InfoTableProf.hs
806 HSC2HS libraries/ghc-heap/dist-boot/build/GHC/Exts/Heap/Utils.hs
807 HSC2HS libraries/hpc/dist-boot/build/Trace/Hpc/Reflect.hs
808 HC [stage 0] libraries/terminfo/dist-boot/build/System/Console/Terminfo/Base.o
809 HC [stage 0] libraries/parsec/dist-boot/build/Text/Parsec/Pos.o
810 HC [stage 0] libraries/transformers/dist-boot/build/Control/Monad/Trans/Class.o
811 HC [stage 0] libraries/transformers/dist-boot/build/Control/Monad/Signatures.o
812 HC [stage 0] libraries/text/dist-boot/build/Data/Text/Internal/Unsafe/Shift.o
813 HC [stage 0] libraries/text/dist-boot/build/Data/Text/Internal/Unsafe.o
814 HC [stage 0] libraries/text/dist-boot/build/Data/Text/Internal/Encoding/Utf16.o
815 HC [stage 0] libraries/text/dist-boot/build/Data/Text/Internal/Functions.o
816 HC [stage 0] libraries/text/dist-boot/build/Data/Text/Internal/Encoding/Utf32.o
817 HC [stage 0] libraries/text/dist-boot/build/Data/Text/Encoding/Error.o
818 HC [stage 0] libraries/binary/dist-boot/build/Data/Binary/FloatCast.o
819 HC [stage 0] libraries/binary/dist-boot/build/Data/Binary/Builder.o
820 HC [stage 0] libraries/binary/dist-boot/build/Data/Binary/Internal.o
821 HC [stage 0] libraries/Cabal/Cabal/dist-boot/build/Distribution/Compat/MonadFail.o
822 HC [stage 0] libraries/Cabal/Cabal/dist-boot/build/Distribution/Compat/Stack.o
823 HC [stage 0] libraries/Cabal/Cabal/dist-boot/build/Distribution/Utils/String.o
824 HC [stage 0] libraries/Cabal/Cabal/dist-boot/build/Paths_Cabal.o
825 HC [stage 0] libraries/Cabal/Cabal/dist-boot/build/Distribution/Compat/Newtype.o
826 HC [stage 0] libraries/Cabal/Cabal/dist-boot/build/Distribution/Compat/Exception.o
827 HC [stage 0] libraries/Cabal/Cabal/dist-boot/build/Distribution/Utils/Base62.o
828 HC [stage 0] libraries/ghc-boot/dist-boot/build/GHC/HandleEncoding.o
829 HC [stage 0] utils/ghc-pkg/dist/build/Version.o
830 HC [stage 0] libraries/ghc-boot-th/dist-boot/build/GHC/LanguageExtensions/Type.o
831 HC [stage 0] libraries/ghc-boot/dist-boot/build/GHC/Serialized.o
832 HC [stage 0] libraries/ghc-boot-th/dist-boot/build/GHC/ForeignSrcLang/Type.o
833 HC [stage 0] libraries/ghc-boot-th/dist-boot/build/GHC/Lexeme.o
834 HC [stage 0] libraries/Cabal/Cabal/dist-boot/build/Distribution/PackageDescription/Utils.o
835 HC [stage 0] libraries/Cabal/Cabal/dist-boot/build/Distribution/Utils/UnionFind.o
836 HC [stage 0] libraries/Cabal/Cabal/dist-boot/build/Distribution/Compat/Directory.o
837 HC [stage 0] libraries/text/dist-boot/build/Data/Text/Internal/Builder/Int/Digits.o
838 HC [stage 0] libraries/text/dist-boot/build/Data/Text/Internal/Builder/RealFloat/Functions.o
839 HC [stage 0] libraries/text/dist-boot/build/Data/Text/Internal/Read.o
840 HC [stage 0] libraries/transformers/dist-boot/build/Control/Applicative/Backwards.o
841 HC [stage 0] libraries/transformers/dist-boot/build/Data/Functor/Constant.o
842 HC [stage 0] compiler/stage1/build/GhcPrelude.o
843 HC [stage 0] libraries/template-haskell/dist-boot/build/Language/Haskell/TH/Lib/Map.o
844 HC [stage 0] libraries/ghc-heap/dist-boot/build/GHC/Exts/Heap/ClosureTypes.o
845 HC [stage 0] libraries/ghc-heap/dist-boot/build/GHC/Exts/Heap/Constants.o
846 HC [stage 0] libraries/ghci/dist-boot/build/GHCi/BreakArray.o
847 HC [stage 0] libraries/hpc/dist-boot/build/Trace/Hpc/Util.o
848 HC [stage 0] ghc/stage1/build/hschooks.o
849 HC [stage 0] libraries/ghci/dist-boot/build/GHCi/InfoTable.o
850 HC [stage 0] utils/unlit/dist/build/unlit.o
851 HC [stage 0] utils/unlit/dist/build/fs.o
852 HC [stage 0] libraries/terminfo/dist-boot/build/System/Console/Terminfo/Color.o
853 HC [stage 0] libraries/terminfo/dist-boot/build/System/Console/Terminfo/Effects.o
854 HC [stage 0] libraries/terminfo/dist-boot/build/System/Console/Terminfo/Edit.o
855 HC [stage 0] libraries/terminfo/dist-boot/build/System/Console/Terminfo/Cursor.o
856 HC [stage 0] libraries/terminfo/dist-boot/build/System/Console/Terminfo/Keys.o
857 HC [stage 0] libraries/parsec/dist-boot/build/Text/Parsec/Error.o
858 HC [stage 0] libraries/transformers/dist-boot/build/Control/Monad/Trans/Writer/Strict.o
859 HC [stage 0] libraries/transformers/dist-boot/build/Control/Monad/Trans/Writer/Lazy.o
860 HC [stage 0] libraries/transformers/dist-boot/build/Control/Monad/Trans/State/Strict.o
861 HC [stage 0] libraries/transformers/dist-boot/build/Control/Monad/Trans/State/Lazy.o
862 HC [stage 0] libraries/transformers/dist-boot/build/Control/Monad/Trans/RWS/Strict.o
863 HC [stage 0] libraries/transformers/dist-boot/build/Control/Monad/Trans/RWS/Lazy.o
864 HC [stage 0] libraries/transformers/dist-boot/build/Control/Monad/Trans/Reader.o
865 HC [stage 0] libraries/transformers/dist-boot/build/Control/Monad/Trans/Except.o
866 HC [stage 0] libraries/transformers/dist-boot/build/Control/Monad/Trans/List.o
867 HC [stage 0] libraries/transformers/dist-boot/build/Control/Monad/Trans/Identity.o
868 HC [stage 0] libraries/transformers/dist-boot/build/Control/Monad/Trans/Error.o
869 HC [stage 0] libraries/transformers/dist-boot/build/Control/Monad/Trans/Cont.o
870 HC [stage 0] libraries/mtl/dist-boot/build/Control/Monad/Trans.o
871 HC [stage 0] libraries/text/dist-boot/build/Data/Text/Array.o
872 HC [stage 0] libraries/binary/dist-boot/build/Data/Binary/Put.o
873 HC [stage 0] libraries/binary/dist-boot/build/Data/Binary/Get/Internal.o
874 HC [stage 0] libraries/Cabal/Cabal/dist-boot/build/Distribution/Compat/Internal/TempFile.o
875 HC [stage 0] libraries/parsec/dist-boot/build/Text/ParserCombinators/Parsec/Pos.o
876 HC [stage 0] libraries/text/dist-boot/build/cbits/cbits.o
877 HC [stage 0] libraries/transformers/dist-boot/build/Control/Applicative/Lift.o
878 HC [stage 0] libraries/transformers/dist-boot/build/Data/Functor/Reverse.o
879 HC [stage 0] compiler/stage1/build/Outputable.o-boot
880 HC [stage 0] compiler/stage1/build/Exception.o
881 HC [stage 0] compiler/stage1/build/Config.o
882 HC [stage 0] compiler/stage1/build/OccName.o-boot
883 HC [stage 0] compiler/stage1/build/FastFunctions.o
884 HC [stage 0] compiler/stage1/build/Encoding.o
885 HC [stage 0] compiler/stage1/build/Platform.o
886 HC [stage 0] compiler/stage1/build/FastMutInt.o
887 HC [stage 0] compiler/stage1/build/FiniteMap.o
888 HC [stage 0] compiler/stage1/build/Fingerprint.o
889 HC [stage 0] compiler/stage1/build/Name.o-boot
890 HC [stage 0] compiler/stage1/build/Hooks.o-boot
891 HC [stage 0] compiler/stage1/build/Plugins.o-boot
892 HC [stage 0] compiler/stage1/build/EnumSet.o
893 HC [stage 0] compiler/stage1/build/MonadUtils.o
894 HC [stage 0] compiler/stage1/build/PlatformConstants.o
895 HC [stage 0] libraries/template-haskell/dist-boot/build/Language/Haskell/TH/LanguageExtensions.o
896 HC [stage 0] libraries/ghc-heap/dist-boot/build/GHC/Exts/Heap/InfoTable/Types.o
897 HC [stage 0] compiler/stage1/build/TyCon.o-boot
898 HC [stage 0] compiler/stage1/build/PrimOp.o-boot
899 HC [stage 0] compiler/stage1/build/Stream.o
900 HC [stage 0] compiler/stage1/build/Hoopl/Collections.o
901 HC [stage 0] compiler/stage1/build/Hoopl/Block.o
902 HC [stage 0] compiler/stage1/build/X86/Cond.o
903 HC [stage 0] compiler/stage1/build/State.o
904 HC [stage 0] compiler/stage1/build/SPARC/Cond.o
905 HC [stage 0] libraries/hpc/dist-boot/build/Trace/Hpc/Tix.o
906 HC [stage 0] compiler/stage1/build/ListT.o
907 HC [stage 0] compiler/stage1/build/TcPluginM.o
908 HC [stage 0] compiler/stage1/build/parser/cutils.o
909 HC [stage 0] compiler/stage1/build/ghci/keepCAFsForGHCi.o
910 HC [stage 0] compiler/stage1/build/cbits/genSym.o
911 HC [stage 0] libraries/ghc-heap/dist-boot/build/cbits/HeapPrim.o
912 HC [stage 0] utils/unlit/dist/build/tmp/unlit
913Creating compiler/stage2/build/Config.hs ...
914 HC [stage 0] libraries/terminfo/dist-boot/build/System/Console/Terminfo.o
915 HC [stage 0] libraries/transformers/dist-boot/build/Control/Monad/Trans/Maybe.o
916 HC [stage 0] libraries/mtl/dist-boot/build/Control/Monad/Identity.o
917done.
918 HC [stage 0] libraries/text/dist-boot/build/Data/Text/Internal/Unsafe/Char.o
919 HC [stage 0] libraries/binary/dist-boot/build/Data/Binary/Get.o
920 HC [stage 0] libraries/parsec/dist-boot/build/Text/ParserCombinators/Parsec/Error.o
921 HC [stage 0] libraries/mtl/dist-boot/build/Control/Monad/List.o
922 HC [stage 0] libraries/transformers/dist-boot/build/Control/Monad/Trans/State.o
923 HC [stage 0] libraries/transformers/dist-boot/build/Control/Monad/Trans/Writer.o
924 HC [stage 0] libraries/transformers/dist-boot/build/Control/Monad/Trans/RWS.o
925 HC [stage 0] libraries/transformers/dist-boot/build/Control/Monad/Trans/Select.o
926 HC [stage 0] compiler/stage1/build/Panic.o
927 HC [stage 0] compiler/stage1/build/DynFlags.o-boot
928 HC [stage 0] compiler/stage1/build/Constants.o
929 HC [stage 0] libraries/template-haskell/dist-boot/build/Language/Haskell/TH/Syntax.o
930 HC [stage 0] libraries/ghc-heap/dist-boot/build/GHC/Exts/Heap/InfoTable.o
931 HC [stage 0] libraries/ghc-heap/dist-boot/build/GHC/Exts/Heap/InfoTableProf.o
932 HC [stage 0] libraries/hpc/dist-boot/build/Trace/Hpc/Mix.o
933 HC [stage 0] libraries/hpc/dist-boot/build/Trace/Hpc/Reflect.o
934 HC [stage 0] libraries/mtl/dist-boot/build/Control/Monad/Error/Class.o
935 HC [stage 0] libraries/mtl/dist-boot/build/Control/Monad/Cont/Class.o
936 HC [stage 0] libraries/mtl/dist-boot/build/Control/Monad/State/Class.o
937 HC [stage 0] libraries/mtl/dist-boot/build/Control/Monad/Reader/Class.o
938 HC [stage 0] libraries/text/dist-boot/build/Data/Text/Internal.o
939 HC [stage 0] libraries/text/dist-boot/build/Data/Text/Internal/Encoding/Utf8.o
940 HC [stage 0] libraries/binary/dist-boot/build/Data/Binary/Class.o
941 HC [stage 0] libraries/mtl/dist-boot/build/Control/Monad/Writer/Class.o
942 HC [stage 0] libraries/transformers/dist-boot/build/Control/Monad/Trans/Accum.o
943 HC [stage 0] compiler/stage1/build/Util.o
944 HC [stage 0] compiler/stage1/build/SysTools/BaseDir.o
945 HC [stage 0] compiler/stage1/build/SysTools/Terminal.o
946 HC [stage 0] libraries/ghc-heap/dist-boot/build/GHC/Exts/Heap/Utils.o
947 HC [stage 0] libraries/ghc-heap/dist-boot/build/GHC/Exts/Heap/Closures.o
948 HC [stage 0] compiler/stage1/build/Ctype.o
949 HC [stage 0] compiler/stage1/build/PPC/Cond.o
950 HC [stage 0] compiler/stage1/build/Ar.o
951 HC [stage 0] libraries/text/dist-boot/build/Data/Text/Internal/Search.o
952 HC [stage 0] libraries/text/dist-boot/build/Data/Text/Unsafe.o
953 HC [stage 0] libraries/text/dist-boot/build/Data/Text/Internal/Fusion/Size.o
954 HC [stage 0] libraries/mtl/dist-boot/build/Control/Monad/State/Strict.o
955 HC [stage 0] libraries/mtl/dist-boot/build/Control/Monad/Cont.o
956 HC [stage 0] libraries/mtl/dist-boot/build/Control/Monad/Error.o
957 HC [stage 0] libraries/mtl/dist-boot/build/Control/Monad/Except.o
958 HC [stage 0] libraries/mtl/dist-boot/build/Control/Monad/RWS/Class.o
959 HC [stage 0] libraries/mtl/dist-boot/build/Control/Monad/Reader.o
960 HC [stage 0] libraries/mtl/dist-boot/build/Control/Monad/State/Lazy.o
961 HC [stage 0] libraries/mtl/dist-boot/build/Control/Monad/Writer/Lazy.o
962 HC [stage 0] libraries/mtl/dist-boot/build/Control/Monad/Writer/Strict.o
963 HC [stage 0] compiler/stage1/build/FastString.o
964 HC [stage 0] compiler/stage1/build/PprColour.o
965 HC [stage 0] compiler/stage1/build/Maybes.o
966 HC [stage 0] libraries/ghc-heap/dist-boot/build/GHC/Exts/Heap.o
967 HC [stage 0] libraries/text/dist-boot/build/Data/Text/Internal/Fusion/Types.o
968 HC [stage 0] libraries/text/dist-boot/build/Data/Text/Internal/Private.o
969 HC [stage 0] libraries/mtl/dist-boot/build/Control/Monad/RWS/Lazy.o
970 HC [stage 0] libraries/mtl/dist-boot/build/Control/Monad/RWS/Strict.o
971 HC [stage 0] libraries/mtl/dist-boot/build/Control/Monad/State.o
972 HC [stage 0] libraries/mtl/dist-boot/build/Control/Monad/Writer.o
973 HC [stage 0] compiler/stage1/build/Module.o-boot
974 HC [stage 0] compiler/stage1/build/BufWrite.o
975 HC [stage 0] compiler/stage1/build/Lexeme.o
976 HC [stage 0] libraries/template-haskell/dist-boot/build/Language/Haskell/TH/PprLib.o
977 HC [stage 0] libraries/template-haskell/dist-boot/build/Language/Haskell/TH/Lib/Internal.o
978 HC [stage 0] libraries/template-haskell/dist-boot/build/Language/Haskell/TH/Quote.o
979 HC [stage 0] libraries/text/dist-boot/build/Data/Text/Internal/Fusion/CaseMapping.o
980 HC [stage 0] libraries/mtl/dist-boot/build/Control/Monad/RWS.o
981 HC [stage 0] compiler/stage1/build/Pretty.o
982 HC [stage 0] compiler/stage1/build/Packages.o-boot
983 HC [stage 0] libraries/template-haskell/dist-boot/build/Language/Haskell/TH/Ppr.o
984 HC [stage 0] libraries/template-haskell/dist-boot/build/Language/Haskell/TH/Lib.o
985 HC [stage 0] libraries/text/dist-boot/build/Data/Text/Internal/Fusion/Common.o
986 HC [stage 0] libraries/template-haskell/dist-boot/build/Language/Haskell/TH.o
987 HC [stage 0] libraries/binary/dist-boot/build/Data/Binary/Generic.o
988 HC [stage 0] libraries/binary/dist-boot/build/Data/Binary.o
989 HC [stage 0] libraries/Cabal/Cabal/dist-boot/build/Distribution/Compat/Binary.o
990 HC [stage 0] libraries/ghc-boot/dist-boot/build/GHC/PackageDb.o
991 HC [stage 0] libraries/ghc-boot/dist-boot/build/GHC/LanguageExtensions.o
992 HC [stage 0] libraries/ghc-boot/dist-boot/build/GHC/ForeignSrcLang.o
993 HC [stage 0] libraries/ghci/dist-boot/build/GHCi/RemoteTypes.o
994 HC [stage 0] libraries/ghci/dist-boot/build/GHCi/TH/Binary.o
995 HC [stage 0] libraries/ghci/dist-boot/build/GHCi/FFI.o
996 HC [stage 0] libraries/ghci/dist-boot/build/SizedSeq.o
997 HC [stage 0] libraries/ghci/dist-boot/build/GHCi/BinaryArray.o
998 HC [stage 0] libraries/text/dist-boot/build/Data/Text/Internal/Fusion.o
999 HC [stage 0] libraries/Cabal/Cabal/dist-boot/build/Distribution/Compat/Semigroup.o
1000 HC [stage 0] compiler/stage1/build/Outputable.o
1001 HC [stage 0] libraries/ghci/dist-boot/build/GHCi/StaticPtrTable.o
1002 HC [stage 0] libraries/ghci/dist-boot/build/GHCi/ResolvedBCO.o
1003 HC [stage 0] libraries/Cabal/Cabal/dist-boot/build/Distribution/Compat/Prelude.o
1004 HC [stage 0] libraries/text/dist-boot/build/Data/Text/Show.o
1005 HC [stage 0] libraries/text/dist-boot/build/Data/Text/Internal/Encoding/Fusion/Common.o
1006 HC [stage 0] libraries/Cabal/Cabal/dist-boot/build/Distribution/Compat/ReadP.o
1007 HC [stage 0] libraries/Cabal/Cabal/dist-boot/build/Distribution/Parsec/Common.o
1008 HC [stage 0] libraries/Cabal/Cabal/dist-boot/build/Distribution/Utils/Generic.o
1009 HC [stage 0] libraries/Cabal/Cabal/dist-boot/build/Distribution/Parsec/Field.o
1010 HC [stage 0] libraries/Cabal/Cabal/dist-boot/build/Distribution/CabalSpecVersion.o
1011 HC [stage 0] libraries/Cabal/Cabal/dist-boot/build/Distribution/Pretty.o
1012 HC [stage 0] libraries/Cabal/Cabal/dist-boot/build/Distribution/Compat/DList.o
1013 HC [stage 0] libraries/Cabal/Cabal/dist-boot/build/Distribution/Utils/ShortText.o
1014 HC [stage 0] libraries/Cabal/Cabal/dist-boot/build/Distribution/Compat/CopyFile.o
1015 HC [stage 0] libraries/Cabal/Cabal/dist-boot/build/Distribution/Utils/IOData.o
1016 HC [stage 0] libraries/Cabal/Cabal/dist-boot/build/Distribution/Compat/Graph.o
1017 HC [stage 0] libraries/Cabal/Cabal/dist-boot/build/Distribution/Utils/Progress.o
1018 HC [stage 0] libraries/Cabal/Cabal/dist-boot/build/Distribution/Types/Condition.o
1019 HC [stage 0] libraries/Cabal/Cabal/dist-boot/build/Distribution/Compat/Environment.o
1020 HC [stage 0] libraries/Cabal/Cabal/dist-boot/build/Distribution/Simple/Program/Internal.o
1021 HC [stage 0] libraries/Cabal/Cabal/dist-boot/build/Distribution/Simple/Flag.o
1022 HC [stage 0] libraries/Cabal/Cabal/dist-boot/build/Distribution/GetOpt.o
1023 HC [stage 0] libraries/Cabal/Cabal/dist-boot/build/Distribution/Utils/MapAccum.o
1024 HC [stage 0] libraries/Cabal/Cabal/dist-boot/build/Distribution/Compat/CreatePipe.o
1025 HC [stage 0] libraries/Cabal/Cabal/dist-boot/build/Distribution/Compat/Prelude/Internal.o
1026 HC [stage 0] libraries/Cabal/Cabal/dist-boot/build/Distribution/Simple/CCompiler.o
1027 HC [stage 0] libraries/Cabal/Cabal/dist-boot/build/Distribution/PackageDescription/Quirks.o
1028 HC [stage 0] libraries/Cabal/Cabal/dist-boot/build/Distribution/Compat/GetShortPathName.o
1029 HC [stage 0] libraries/Cabal/Cabal/dist-boot/build/Distribution/TestSuite.o
1030 HC [stage 0] libraries/Cabal/Cabal/dist-boot/build/Distribution/Simple/PreProcess/Unlit.o
1031 HC [stage 0] libraries/Cabal/Cabal/dist-boot/build/Distribution/Compat/SnocList.o
1032 HC [stage 0] compiler/stage1/build/TyCoRep.o-boot
1033 HC [stage 0] compiler/stage1/build/Json.o
1034 HC [stage 0] compiler/stage1/build/Bag.o
1035 HC [stage 0] compiler/stage1/build/IdInfo.o-boot
1036 HC [stage 0] compiler/stage1/build/TcType.o-boot
1037 HC [stage 0] libraries/ghci/dist-boot/build/GHCi/Message.o
1038 HC [stage 0] compiler/stage1/build/ListSetOps.o
1039 HC [stage 0] compiler/stage1/build/StringBuffer.o
1040 HC [stage 0] compiler/stage1/build/Pair.o
1041 HC [stage 0] compiler/stage1/build/OrdList.o
1042 HC [stage 0] compiler/stage1/build/AsmUtils.o
1043 HC [stage 0] libraries/text/dist-boot/build/Data/Text/Internal/Encoding/Fusion.o
1044 HC [stage 0] libraries/text/dist-boot/build/Data/Text/Internal/Lazy/Encoding/Fusion.o
1045 HC [stage 0] libraries/Cabal/Cabal/dist-boot/build/Distribution/SPDX/LicenseListVersion.o
1046 HC [stage 0] libraries/Cabal/Cabal/dist-boot/build/Distribution/Compat/Lens.o
1047 HC [stage 0] libraries/Cabal/Cabal/dist-boot/build/Distribution/Parsec/LexerMonad.o
1048 HC [stage 0] libraries/Cabal/Cabal/dist-boot/build/Distribution/Lex.o
1049 HC [stage 0] compiler/stage1/build/SrcLoc.o
1050 HC [stage 0] libraries/Cabal/Cabal/dist-boot/build/Distribution/Parsec/Lexer.o
1051 HC [stage 0] libraries/Cabal/Cabal/dist-boot/build/Distribution/Types/CondTree.o
1052 HC [stage 0] libraries/text/dist-boot/build/Data/Text/Encoding.o
1053 HC [stage 0] compiler/stage1/build/ErrUtils.o-boot
1054 HC [stage 0] compiler/stage1/build/BasicTypes.o
1055 HC [stage 0] compiler/stage1/build/CmdLineParser.o
1056 HC [stage 0] libraries/text/dist-boot/build/Data/Text.o
1057 HC [stage 0] libraries/text/dist-boot/build/Data/Text/Foreign.o
1058 HC [stage 0] compiler/stage1/build/Unique.o
1059 HC [stage 0] compiler/stage1/build/UniqFM.o
1060 HC [stage 0] compiler/stage1/build/UniqSupply.o
1061 HC [stage 0] compiler/stage1/build/RegClass.o
1062 HC [stage 0] compiler/stage1/build/Reg.o
1063 HC [stage 0] compiler/stage1/build/Binary.o
1064 HC [stage 0] compiler/stage1/build/UniqSet.o
1065 HC [stage 0] compiler/stage1/build/UniqDFM.o
1066 HC [stage 0] compiler/stage1/build/Digraph.o
1067 HC [stage 0] compiler/stage1/build/UniqMap.o
1068 HC [stage 0] compiler/stage1/build/UniqDSet.o
1069 HC [stage 0] compiler/stage1/build/FastStringEnv.o
1070 HC [stage 0] compiler/stage1/build/GraphBase.o
1071 HC [stage 0] compiler/stage1/build/RegAlloc/Graph/ArchBase.o
1072 HC [stage 0] compiler/stage1/build/RegAlloc/Graph/TrivColorable.o
1073 HC [stage 0] compiler/stage1/build/GraphPpr.o
1074 HC [stage 0] compiler/stage1/build/GraphOps.o
1075 HC [stage 0] compiler/stage1/build/RegAlloc/Graph/ArchX86.o
1076 HC [stage 0] compiler/stage1/build/GraphColor.o
1077 HC [stage 0] libraries/text/dist-boot/build/Data/Text/Internal/Lazy.o
1078 HC [stage 0] libraries/text/dist-boot/build/Data/Text/Internal/IO.o
1079 HC [stage 0] libraries/text/dist-boot/build/Data/Text/Read.o
1080 HC [stage 0] libraries/text/dist-boot/build/Data/Text/Internal/Lazy/Search.o
1081 HC [stage 0] libraries/text/dist-boot/build/Data/Text/Internal/Lazy/Fusion.o
1082 HC [stage 0] libraries/text/dist-boot/build/Data/Text/IO.o
1083 HC [stage 0] libraries/text/dist-boot/build/Data/Text/Lazy/Internal.o
1084 HC [stage 0] libraries/text/dist-boot/build/Data/Text/Lazy/Encoding.o
1085 HC [stage 0] libraries/text/dist-boot/build/Data/Text/Lazy.o
1086 HC [stage 0] compiler/stage1/build/Module.o
1087 HC [stage 0] compiler/stage1/build/DriverPhases.o
1088 HC [stage 0] compiler/stage1/build/CostCentreState.o
1089 HC [stage 0] compiler/stage1/build/BooleanFormula.o
1090 HC [stage 0] compiler/stage1/build/PrelNames.o-boot
1091 HC [stage 0] compiler/stage1/build/PackageConfig.o
1092 HC [stage 0] compiler/stage1/build/ForeignCall.o
1093 HC [stage 0] compiler/stage1/build/DynFlags.o
1094 HC [stage 0] libraries/parsec/dist-boot/build/Text/Parsec/Prim.o
1095 HC [stage 0] libraries/text/dist-boot/build/Data/Text/Internal/Builder.o
1096 HC [stage 0] libraries/text/dist-boot/build/Data/Text/Lazy/IO.o
1097 HC [stage 0] libraries/text/dist-boot/build/Data/Text/Lazy/Read.o
1098 HC [stage 0] libraries/text/dist-boot/build/Data/Text/Lazy/Builder.o
1099 HC [stage 0] libraries/parsec/dist-boot/build/Text/Parsec/Combinator.o
1100 HC [stage 0] libraries/parsec/dist-boot/build/Text/Parsec/Char.o
1101 HC [stage 0] libraries/parsec/dist-boot/build/Text/Parsec/String.o
1102 HC [stage 0] libraries/parsec/dist-boot/build/Text/Parsec/ByteString.o
1103 HC [stage 0] libraries/parsec/dist-boot/build/Text/Parsec/ByteString/Lazy.o
1104 HC [stage 0] libraries/parsec/dist-boot/build/Text/Parsec/Text.o
1105 HC [stage 0] libraries/parsec/dist-boot/build/Text/Parsec/Text/Lazy.o
1106 HC [stage 0] libraries/text/dist-boot/build/Data/Text/Internal/Builder/Functions.o
1107 HC [stage 0] libraries/parsec/dist-boot/build/Text/Parsec.o
1108 HC [stage 0] libraries/Cabal/Cabal/dist-boot/build/Distribution/Parsec/Parser.o
1109 HC [stage 0] libraries/parsec/dist-boot/build/Text/Parsec/Token.o
1110 HC [stage 0] libraries/parsec/dist-boot/build/Text/Parsec/Expr.o
1111 HC [stage 0] libraries/parsec/dist-boot/build/Text/ParserCombinators/Parsec/Char.o
1112 HC [stage 0] libraries/parsec/dist-boot/build/Text/ParserCombinators/Parsec/Combinator.o
1113 HC [stage 0] libraries/parsec/dist-boot/build/Text/ParserCombinators/Parsec/Prim.o
1114 HC [stage 0] libraries/text/dist-boot/build/Data/Text/Lazy/Builder/Int.o
1115 HC [stage 0] libraries/Cabal/Cabal/dist-boot/build/Distribution/Compat/Parsing.o
1116 HC [stage 0] libraries/Cabal/Cabal/dist-boot/build/Distribution/Parsec/FieldLineStream.o
1117 HC [stage 0] libraries/parsec/dist-boot/build/Text/Parsec/Perm.o
1118 HC [stage 0] libraries/parsec/dist-boot/build/Text/ParserCombinators/Parsec.o
1119 HC [stage 0] libraries/parsec/dist-boot/build/Text/Parsec/Language.o
1120 HC [stage 0] libraries/parsec/dist-boot/build/Text/ParserCombinators/Parsec/Expr.o
1121 HC [stage 0] libraries/parsec/dist-boot/build/Text/ParserCombinators/Parsec/Perm.o
1122 HC [stage 0] libraries/parsec/dist-boot/build/Text/ParserCombinators/Parsec/Token.o
1123 HC [stage 0] libraries/parsec/dist-boot/build/Text/ParserCombinators/Parsec/Language.o
1124 HC [stage 0] libraries/Cabal/Cabal/dist-boot/build/Distribution/Compat/CharParsing.o
1125 HC [stage 0] libraries/Cabal/Cabal/dist-boot/build/Distribution/Parsec/Class.o
1126 HC [stage 0] libraries/Cabal/Cabal/dist-boot/build/Distribution/Text.o
1127 HC [stage 0] libraries/Cabal/Cabal/dist-boot/build/Distribution/SPDX/LicenseReference.o
1128 HC [stage 0] libraries/Cabal/Cabal/dist-boot/build/Distribution/SPDX/LicenseId.o
1129 HC [stage 0] libraries/Cabal/Cabal/dist-boot/build/Distribution/SPDX/LicenseExceptionId.o
1130 HC [stage 0] libraries/Cabal/Cabal/dist-boot/build/Distribution/ReadE.o
1131 HC [stage 0] libraries/Cabal/Cabal/dist-boot/build/Distribution/FieldGrammar/Class.o
1132 HC [stage 0] libraries/Cabal/Cabal/dist-boot/build/Distribution/Types/Version.o
1133 HC [stage 0] libraries/Cabal/Cabal/dist-boot/build/Language/Haskell/Extension.o
1134 HC [stage 0] libraries/Cabal/Cabal/dist-boot/build/Distribution/ModuleName.o
1135 HC [stage 0] libraries/Cabal/Cabal/dist-boot/build/Distribution/Verbosity.o
1136 HC [stage 0] libraries/Cabal/Cabal/dist-boot/build/Distribution/System.o
1137 HC [stage 0] libraries/Cabal/Cabal/dist-boot/build/Distribution/Types/ComponentId.o
1138 HC [stage 0] libraries/Cabal/Cabal/dist-boot/build/Distribution/Types/PkgconfigName.o
1139 HC [stage 0] libraries/Cabal/Cabal/dist-boot/build/Distribution/Types/AbiHash.o
1140 HC [stage 0] libraries/Cabal/Cabal/dist-boot/build/Distribution/Types/ExecutableScope.o
1141 HC [stage 0] libraries/Cabal/Cabal/dist-boot/build/Distribution/Types/ForeignLibType.o
1142 HC [stage 0] libraries/Cabal/Cabal/dist-boot/build/Distribution/Types/ForeignLibOption.o
1143 HC [stage 0] libraries/Cabal/Cabal/dist-boot/build/Distribution/Types/SourceRepo.o
1144 HC [stage 0] libraries/Cabal/Cabal/dist-boot/build/Distribution/Types/BuildType.o
1145 HC [stage 0] libraries/text/dist-boot/build/Data/Text/Lazy/Builder/RealFloat.o
1146 HC [stage 0] libraries/Cabal/Cabal/dist-boot/build/Distribution/Types/VersionRange.o
1147 HC [stage 0] libraries/Cabal/Cabal/dist-boot/build/Distribution/Types/ModuleRenaming.o
1148 HC [stage 0] libraries/Cabal/Cabal/dist-boot/build/Distribution/Types/SourceRepo/Lens.o
1149 HC [stage 0] libraries/Cabal/Cabal/dist-boot/build/Distribution/Types/IncludeRenaming.o
1150 HC [stage 0] libraries/Cabal/Cabal/dist-boot/build/Distribution/Types/VersionInterval.o
1151 HC [stage 0] libraries/Cabal/Cabal/dist-boot/build/Distribution/Version.o
1152 HC [stage 0] libraries/Cabal/Cabal/dist-boot/build/Distribution/Compiler.o
1153 HC [stage 0] libraries/Cabal/Cabal/dist-boot/build/Distribution/Types/PkgconfigDependency.o
1154 HC [stage 0] libraries/Cabal/Cabal/dist-boot/build/Distribution/Types/BenchmarkType.o
1155 HC [stage 0] libraries/Cabal/Cabal/dist-boot/build/Distribution/Types/TestType.o
1156 HC [stage 0] libraries/Cabal/Cabal/dist-boot/build/Distribution/Types/BenchmarkInterface.o
1157 HC [stage 0] libraries/Cabal/Cabal/dist-boot/build/Distribution/Types/TestSuiteInterface.o
1158 HC [stage 0] libraries/Cabal/Cabal/dist-boot/build/Distribution/SPDX/LicenseExpression.o
1159 HC [stage 0] libraries/Cabal/Cabal/dist-boot/build/Distribution/SPDX/License.o
1160 HC [stage 0] libraries/Cabal/Cabal/dist-boot/build/Distribution/SPDX.o
1161 HC [stage 0] libraries/Cabal/Cabal/dist-boot/build/Distribution/License.o
1162 HC [stage 0] libraries/Cabal/Cabal/dist-boot/build/Distribution/Parsec/Newtypes.o
1163 HC [stage 0] libraries/Cabal/Cabal/dist-boot/build/Distribution/ParseUtils.o
1164 HC [stage 0] libraries/Cabal/Cabal/dist-boot/build/Distribution/Types/PackageName.o
1165 HC [stage 0] libraries/Cabal/Cabal/dist-boot/build/Distribution/Types/LegacyExeDependency.o
1166 HC [stage 0] libraries/Cabal/Cabal/dist-boot/build/Distribution/PrettyUtils.o
1167 HC [stage 0] libraries/Cabal/Cabal/dist-boot/build/Distribution/Types/PackageId.o
1168 HC [stage 0] libraries/Cabal/Cabal/dist-boot/build/Distribution/Types/UnqualComponentName.o
1169 HC [stage 0] libraries/Cabal/Cabal/dist-boot/build/Distribution/Types/Mixin.o
1170 HC [stage 0] libraries/Cabal/Cabal/dist-boot/build/Distribution/Types/ModuleReexport.o
1171 HC [stage 0] libraries/Cabal/Cabal/dist-boot/build/Distribution/Types/PackageVersionConstraint.o
1172 HC [stage 0] libraries/Cabal/Cabal/dist-boot/build/Distribution/Types/MungedPackageName.o
1173 HC [stage 0] libraries/Cabal/Cabal/dist-boot/build/Distribution/Types/LibraryName.o
1174 HC [stage 0] libraries/Cabal/Cabal/dist-boot/build/Distribution/Simple/Utils.o
1175 HC [stage 0] libraries/Cabal/Cabal/dist-boot/build/Distribution/Types/UnitId.o
1176 HC [stage 0] libraries/Cabal/Cabal/dist-boot/build/Distribution/Types/PackageId/Lens.o
1177 HC [stage 0] libraries/Cabal/Cabal/dist-boot/build/Distribution/Types/MungedPackageId.o
1178 HC [stage 0] libraries/Cabal/Cabal/dist-boot/build/Distribution/Types/Dependency.o
1179 HC [stage 0] libraries/Cabal/Cabal/dist-boot/build/Distribution/Types/ComponentName.o
1180 HC [stage 0] libraries/Cabal/Cabal/dist-boot/build/Distribution/Types/GivenComponent.o
1181 HC [stage 0] libraries/Cabal/Cabal/dist-boot/build/Distribution/Types/Module.o
1182 HC [stage 0] libraries/Cabal/Cabal/dist-boot/build/Distribution/Types/SetupBuildInfo.o
1183 HC [stage 0] libraries/Cabal/Cabal/dist-boot/build/Distribution/Types/DependencyMap.o
1184 HC [stage 0] libraries/Cabal/Cabal/dist-boot/build/Distribution/FieldGrammar/Pretty.o
1185 HC [stage 0] libraries/Cabal/Cabal/dist-boot/build/Distribution/Parsec/ParseResult.o
1186 HC [stage 0] libraries/Cabal/Cabal/dist-boot/build/Distribution/Utils/LogProgress.o
1187 HC [stage 0] libraries/Cabal/Cabal/dist-boot/build/Distribution/Types/ExeDependency.o
1188 HC [stage 0] libraries/Cabal/Cabal/dist-boot/build/Distribution/Simple/Compiler.o
1189 HC [stage 0] libraries/Cabal/Cabal/dist-boot/build/Distribution/Utils/NubList.o
1190 HC [stage 0] libraries/Cabal/Cabal/dist-boot/build/Distribution/Simple/Program/Find.o
1191 HC [stage 0] libraries/Cabal/Cabal/dist-boot/build/Distribution/Simple/Command.o
1192 HC [stage 0] libraries/Cabal/Cabal/dist-boot/build/Distribution/Backpack/DescribeUnitId.o
1193 HC [stage 0] libraries/Cabal/Cabal/dist-boot/build/Distribution/Compat/Time.o
1194 HC [stage 0] libraries/Cabal/Cabal/dist-boot/build/Distribution/Simple/Glob.o
1195 HC [stage 0] libraries/Cabal/Cabal/dist-boot/build/Distribution/Types/SetupBuildInfo/Lens.o
1196 HC [stage 0] libraries/Cabal/Cabal/dist-boot/build/Distribution/Simple/Program/ResponseFile.o
1197 HC [stage 0] libraries/Cabal/Cabal/dist-boot/build/Distribution/Backpack.o
1198 HC [stage 0] libraries/Cabal/Cabal/dist-boot/build/Distribution/Package.o
1199 HC [stage 0] libraries/Cabal/Cabal/dist-boot/build/Distribution/FieldGrammar/Parsec.o
1200 HC [stage 0] libraries/Cabal/Cabal/dist-boot/build/Distribution/Types/BuildInfo.o
1201 HC [stage 0] libraries/Cabal/Cabal/dist-boot/build/Distribution/Simple/GHC/ImplInfo.o
1202 HC [stage 0] libraries/Cabal/Cabal/dist-boot/build/Distribution/Types/AbiDependency.o
1203 HC [stage 0] libraries/Cabal/Cabal/dist-boot/build/Distribution/Types/AnnotatedId.o
1204 HC [stage 0] libraries/Cabal/Cabal/dist-boot/build/Distribution/Simple/InstallDirs.o
1205 HC [stage 0] libraries/Cabal/Cabal/dist-boot/build/Distribution/Types/ExposedModule.o
1206 HC [stage 0] libraries/Cabal/Cabal/dist-boot/build/Distribution/FieldGrammar.o
1207 HC [stage 0] libraries/Cabal/Cabal/dist-boot/build/Distribution/Types/ComponentInclude.o
1208 HC [stage 0] libraries/Cabal/Cabal/dist-boot/build/Distribution/Backpack/ModSubst.o
1209 HC [stage 0] libraries/Cabal/Cabal/dist-boot/build/Distribution/Backpack/FullUnitId.o
1210 HC [stage 0] libraries/Cabal/Cabal/dist-boot/build/Distribution/Types/InstalledPackageInfo.o
1211 HC [stage 0] libraries/Cabal/Cabal/dist-boot/build/Distribution/FieldGrammar/FieldDescrs.o
1212 HC [stage 0] libraries/Cabal/Cabal/dist-boot/build/Distribution/Types/BuildInfo/Lens.o
1213 HC [stage 0] libraries/Cabal/Cabal/dist-boot/build/Distribution/Types/HookedBuildInfo.o
1214 HC [stage 0] libraries/Cabal/Cabal/dist-boot/build/Distribution/Backpack/ModuleScope.o
1215 HC [stage 0] libraries/Cabal/Cabal/dist-boot/build/Distribution/Types/Benchmark.o
1216 HC [stage 0] libraries/Cabal/Cabal/dist-boot/build/Distribution/Types/TestSuite.o
1217 HC [stage 0] libraries/Cabal/Cabal/dist-boot/build/Distribution/Types/Executable.o
1218 HC [stage 0] libraries/Cabal/Cabal/dist-boot/build/Distribution/Types/ForeignLib.o
1219 HC [stage 0] libraries/Cabal/Cabal/dist-boot/build/Distribution/Types/Library.o
1220 HC [stage 0] libraries/Cabal/Cabal/dist-boot/build/Distribution/Types/InstalledPackageInfo/Lens.o
1221 HC [stage 0] libraries/Cabal/Cabal/dist-boot/build/Distribution/Types/Executable/Lens.o
1222 HC [stage 0] libraries/Cabal/Cabal/dist-boot/build/Distribution/Types/Benchmark/Lens.o
1223 HC [stage 0] libraries/Cabal/Cabal/dist-boot/build/Distribution/Types/TestSuite/Lens.o
1224 HC [stage 0] libraries/Cabal/Cabal/dist-boot/build/Distribution/Types/ForeignLib/Lens.o
1225 HC [stage 0] libraries/Cabal/Cabal/dist-boot/build/Distribution/Types/InstalledPackageInfo/FieldGrammar.o
1226 HC [stage 0] libraries/Cabal/Cabal/dist-boot/build/Distribution/Types/Component.o
1227 HC [stage 0] libraries/Cabal/Cabal/dist-boot/build/Distribution/Types/Library/Lens.o
1228 HC [stage 0] libraries/Cabal/Cabal/dist-boot/build/Distribution/Types/ComponentRequestedSpec.o
1229 HC [stage 0] libraries/Cabal/Cabal/dist-boot/build/Distribution/InstalledPackageInfo.o
1230 HC [stage 0] libraries/Cabal/Cabal/dist-boot/build/Distribution/Simple/PackageIndex.o
1231 HC [stage 0] libraries/Cabal/Cabal/dist-boot/build/Distribution/Backpack/ModuleShape.o
1232 HC [stage 0] libraries/Cabal/Cabal/dist-boot/build/Distribution/Types/PackageDescription.o
1233 HC [stage 0] libraries/Cabal/Cabal/dist-boot/build/Distribution/Backpack/PreModuleShape.o
1234 HC [stage 0] libraries/Cabal/Cabal/dist-boot/build/Distribution/Backpack/PreExistingComponent.o
1235 HC [stage 0] utils/ghc-pkg/dist/build/Main.o
1236 HC [stage 0] libraries/Cabal/Cabal/dist-boot/build/Distribution/Types/GenericPackageDescription.o
1237 HC [stage 0] libraries/Cabal/Cabal/dist-boot/build/Distribution/Types/PackageDescription/Lens.o
1238 HC [stage 0] libraries/Cabal/Cabal/dist-boot/build/Distribution/PackageDescription.o
1239 HC [stage 0] libraries/Cabal/Cabal/dist-boot/build/Distribution/Types/GenericPackageDescription/Lens.o
1240 HC [stage 0] libraries/Cabal/Cabal/dist-boot/build/Distribution/Parsec/ConfVar.o
1241 HC [stage 0] libraries/Cabal/Cabal/dist-boot/build/Distribution/Types/ComponentLocalBuildInfo.o
1242 HC [stage 0] libraries/Cabal/Cabal/dist-boot/build/Distribution/Simple/Program/Types.o
1243 HC [stage 0] libraries/Cabal/Cabal/dist-boot/build/Distribution/Simple/BuildToolDepends.o
1244 HC [stage 0] libraries/Cabal/Cabal/dist-boot/build/Distribution/Backpack/UnifyM.o
1245 HC [stage 0] libraries/Cabal/Cabal/dist-boot/build/Distribution/PackageDescription/Configuration.o
1246 HC [stage 0] libraries/Cabal/Cabal/dist-boot/build/Distribution/Types/Lens.o
1247 HC [stage 0] libraries/Cabal/Cabal/dist-boot/build/Distribution/Simple/Program/Run.o
1248 HC [stage 0] libraries/Cabal/Cabal/dist-boot/build/Distribution/Backpack/MixLink.o
1249 HC [stage 0] libraries/Cabal/Cabal/dist-boot/build/Distribution/PackageDescription/FieldGrammar.o
1250 HC [stage 0] libraries/Cabal/Cabal/dist-boot/build/Distribution/Types/TargetInfo.o
1251 HC [stage 0] libraries/Cabal/Cabal/dist-boot/build/Distribution/Simple/Program/GHC.o
1252 HC [stage 0] libraries/Cabal/Cabal/dist-boot/build/Distribution/Simple/Program/HcPkg.o
1253 HC [stage 0] libraries/Cabal/Cabal/dist-boot/build/Distribution/Simple/Program/Script.o
1254 HC [stage 0] libraries/Cabal/Cabal/dist-boot/build/Distribution/Simple/Program/Hpc.o
1255 HC [stage 0] libraries/Cabal/Cabal/dist-boot/build/Distribution/PackageDescription/PrettyPrint.o
1256 HC [stage 0] libraries/Cabal/Cabal/dist-boot/build/Distribution/PackageDescription/Parsec.o
1257 HC [stage 0] libraries/Cabal/Cabal/dist-boot/build/Distribution/Simple/Program/Builtin.o
1258 HC [stage 0] libraries/Cabal/Cabal/dist-boot/build/Distribution/Simple/Program/Db.o
1259 HC [stage 0] libraries/Cabal/Cabal/dist-boot/build/Distribution/Simple/Program.o
1260 HC [stage 0] libraries/Cabal/Cabal/dist-boot/build/Distribution/Simple/Setup.o
1261 HC [stage 0] libraries/Cabal/Cabal/dist-boot/build/Distribution/Simple/Program/Strip.o
1262 HC [stage 0] libraries/Cabal/Cabal/dist-boot/build/Distribution/Types/LocalBuildInfo.o
1263 HC [stage 0] libraries/Cabal/Cabal/dist-boot/build/Distribution/Make.o
1264 HC [stage 0] libraries/Cabal/Cabal/dist-boot/build/Distribution/Simple/LocalBuildInfo.o
1265 HC [stage 0] libraries/Cabal/Cabal/dist-boot/build/Distribution/Backpack/Id.o
1266 HC [stage 0] libraries/Cabal/Cabal/dist-boot/build/Distribution/Backpack/ComponentsGraph.o
1267 HC [stage 0] libraries/Cabal/Cabal/dist-boot/build/Distribution/Simple/BuildPaths.o
1268 HC [stage 0] libraries/Cabal/Cabal/dist-boot/build/Distribution/Simple/Program/Ld.o
1269 HC [stage 0] libraries/Cabal/Cabal/dist-boot/build/Distribution/Simple/Program/Ar.o
1270 HC [stage 0] libraries/Cabal/Cabal/dist-boot/build/Distribution/Simple/Hpc.o
1271 HC [stage 0] libraries/Cabal/Cabal/dist-boot/build/Distribution/Simple/BuildTarget.o
1272 HC [stage 0] libraries/Cabal/Cabal/dist-boot/build/Distribution/Simple/Test/Log.o
1273 HC [stage 0] libraries/Cabal/Cabal/dist-boot/build/Distribution/Simple/Build/Macros.o
1274 HC [stage 0] libraries/Cabal/Cabal/dist-boot/build/Distribution/Backpack/ConfiguredComponent.o
1275 HC [stage 0] libraries/Cabal/Cabal/dist-boot/build/Distribution/PackageDescription/Check.o
1276 HC [stage 0] libraries/Cabal/Cabal/dist-boot/build/Distribution/Simple/HaskellSuite.o
1277 HC [stage 0] libraries/Cabal/Cabal/dist-boot/build/Distribution/Simple/UHC.o
1278 HC [stage 0] libraries/Cabal/Cabal/dist-boot/build/Distribution/Simple/GHC/Internal.o
1279 HC [stage 0] libraries/Cabal/Cabal/dist-boot/build/Distribution/Simple/Build/PathsModule.o
1280 HC [stage 0] libraries/Cabal/Cabal/dist-boot/build/Distribution/Backpack/LinkedComponent.o
1281 HC [stage 0] libraries/Cabal/Cabal/dist-boot/build/Distribution/Simple/Test/LibV09.o
1282 HC [stage 0] libraries/Cabal/Cabal/dist-boot/build/Distribution/Simple/Test/ExeV10.o
1283 HC [stage 0] libraries/Cabal/Cabal/dist-boot/build/Distribution/Backpack/ReadyComponent.o
1284 HC [stage 0] libraries/Cabal/Cabal/dist-boot/build/Distribution/Simple/GHCJS.o
1285 HC [stage 0] libraries/Cabal/Cabal/dist-boot/build/Distribution/Simple/GHC/EnvironmentParser.o
1286 HC [stage 0] libraries/Cabal/Cabal/dist-boot/build/Distribution/Simple/PreProcess.o
1287 HC [stage 0] libraries/Cabal/Cabal/dist-boot/build/Distribution/Backpack/Configure.o
1288 HC [stage 0] libraries/Cabal/Cabal/dist-boot/build/Distribution/Simple/GHC.o
1289 HC [stage 0] libraries/Cabal/Cabal/dist-boot/build/Distribution/Simple/UserHooks.o
1290 HC [stage 0] libraries/Cabal/Cabal/dist-boot/build/Distribution/Simple/SrcDist.o
1291 HC [stage 0] libraries/Cabal/Cabal/dist-boot/build/Distribution/Simple/Test.o
1292 HC [stage 0] libraries/Cabal/Cabal/dist-boot/build/Distribution/Simple/Bench.o
1293 HC [stage 0] libraries/Cabal/Cabal/dist-boot/build/Distribution/Simple/Register.o
1294 HC [stage 0] libraries/Cabal/Cabal/dist-boot/build/Distribution/Simple/Configure.o
1295 HC [stage 0] libraries/Cabal/Cabal/dist-boot/build/Distribution/Simple/Install.o
1296 HC [stage 0] libraries/Cabal/Cabal/dist-boot/build/Distribution/Simple/Build.o
1297 HC [stage 0] libraries/Cabal/Cabal/dist-boot/build/Distribution/Simple/Doctest.o
1298 HC [stage 0] libraries/Cabal/Cabal/dist-boot/build/Distribution/Simple/Haddock.o
1299 HC [stage 0] libraries/Cabal/Cabal/dist-boot/build/Distribution/Simple.o
1300 HC [stage 0] compiler/stage1/build/OccName.o
1301 HC [stage 0] compiler/stage1/build/ErrUtils.o
1302 HC [stage 0] compiler/stage1/build/IOEnv.o
1303 HC [stage 0] compiler/stage1/build/CmmType.o
1304 HC [stage 0] compiler/stage1/build/SMRep.o
1305 HC [stage 0] compiler/stage1/build/SPARC/Base.o
1306 HC [stage 0] compiler/stage1/build/RegAlloc/Linear/StackMap.o
1307 HC [stage 0] compiler/stage1/build/CoreMonad.o-boot
1308 HC [stage 0] compiler/stage1/build/CmmMachOp.o
1309 HC [stage 0] utils/ghc-pkg/dist/build/tmp/ghc-pkg
1310 HC [stage 0] compiler/stage1/build/Name.o
1311Reading package info from "rts/dist/package.conf.inplace" ... done.
1312 HC [stage 0] compiler/stage1/build/Bitmap.o
1313 HC [stage 0] compiler/stage1/build/CPrim.o
1314 HC [stage 0] compiler/stage1/build/FileCleanup.o
1315 HC [stage 0] compiler/stage1/build/Elf.o
1316 HC [stage 0] compiler/stage1/build/LlvmMangler.o
1317 HC [stage 0] compiler/stage1/build/BinFingerprint.o
1318 HC [stage 0] compiler/stage1/build/Var.o
1319 HC [stage 0] compiler/stage1/build/NameEnv.o
1320 HC [stage 0] compiler/stage1/build/FieldLabel.o
1321 HC [stage 0] compiler/stage1/build/NameSet.o
1322 HC [stage 0] compiler/stage1/build/KnownUniques.o-boot
1323 HC [stage 0] compiler/stage1/build/HsDoc.o
1324 HC [stage 0] compiler/stage1/build/Annotations.o
1325 HC [stage 0] compiler/stage1/build/Packages.o
1326 HC [stage 0] compiler/stage1/build/SysTools/Process.o
1327 HC [stage 0] compiler/stage1/build/VarSet.o
1328 HC [stage 0] compiler/stage1/build/Avail.o
1329 HC [stage 0] compiler/stage1/build/PatSyn.o-boot
1330 HC [stage 0] compiler/stage1/build/DataCon.o-boot
1331 HC [stage 0] compiler/stage1/build/Class.o
1332 HC [stage 0] compiler/stage1/build/TysWiredIn.o-boot
1333 HC [stage 0] compiler/stage1/build/CoAxiom.o
1334 HC [stage 0] compiler/stage1/build/IfaceType.o-boot
1335 HC [stage 0] compiler/stage1/build/CostCentre.o
1336 HC [stage 0] compiler/stage1/build/SysTools/Info.o
1337 HC [stage 0] compiler/stage1/build/VarEnv.o
1338 HC [stage 0] compiler/stage1/build/RdrName.o
1339 HC [stage 0] compiler/stage1/build/FV.o
1340 HC [stage 0] compiler/stage1/build/ConLike.o-boot
1341 HC [stage 0] compiler/stage1/build/MkId.o-boot
1342 HC [stage 0] compiler/stage1/build/Coercion.o-boot
1343 HC [stage 0] compiler/stage1/build/PlaceHolder.o
1344 HC [stage 0] compiler/stage1/build/PrelNames.o
1345 HC [stage 0] compiler/stage1/build/ApiAnnotation.o
1346 HC [stage 0] compiler/stage1/build/HsExtension.o
1347 HC [stage 0] compiler/stage1/build/HsImpExp.o
1348 HC [stage 0] compiler/stage1/build/HsPat.o-boot
1349 HC [stage 0] compiler/stage1/build/HsExpr.o-boot
1350 HC [stage 0] compiler/stage1/build/Lexer.o
1351 HC [stage 0] compiler/stage1/build/TyCon.o
1352 HC [stage 0] compiler/stage1/build/THNames.o
1353 HC [stage 0] compiler/stage1/build/ToIface.o-boot
1354 HC [stage 0] compiler/stage1/build/Type.o-boot
1355 HC [stage 0] compiler/stage1/build/IfaceType.o
1356 HC [stage 0] compiler/stage1/build/TyCoRep.o
1357 HC [stage 0] compiler/stage1/build/CmmMonad.o
1358 HC [stage 0] compiler/stage1/build/TysPrim.o
1359 HC [stage 0] compiler/stage1/build/Kind.o
1360 HC [stage 0] compiler/stage1/build/Type.o
1361 HC [stage 0] compiler/stage1/build/Coercion.o
1362 HC [stage 0] compiler/stage1/build/PatSyn.o
1363 HC [stage 0] compiler/stage1/build/Literal.o
1364 HC [stage 0] compiler/stage1/build/HsLit.o
1365 HC [stage 0] compiler/stage1/build/TrieMap.o
1366 HC [stage 0] compiler/stage1/build/Hoopl/Label.o
1367 HC [stage 0] compiler/stage1/build/Hoopl/Graph.o
1368 HC [stage 0] compiler/stage1/build/BlockId.o-boot
1369 HC [stage 0] compiler/stage1/build/CmmSwitch.o
1370 HC [stage 0] compiler/stage1/build/Unify.o
1371 HC [stage 0] compiler/stage1/build/DataCon.o
1372 HC [stage 0] compiler/stage1/build/RepType.o
1373 HC [stage 0] compiler/stage1/build/Demand.o
1374 HC [stage 0] compiler/stage1/build/CoreSyn.o
1375 HC [stage 0] compiler/stage1/build/ConLike.o
1376 HC [stage 0] compiler/stage1/build/CoreMap.o
1377 HC [stage 0] compiler/stage1/build/IdInfo.o
1378 HC [stage 0] compiler/stage1/build/Id.o
1379 HC [stage 0] compiler/stage1/build/TysWiredIn.o
1380 HC [stage 0] compiler/stage1/build/CoreStats.o
1381 HC [stage 0] compiler/stage1/build/HsTypes.o
1382 HC [stage 0] compiler/stage1/build/InteractiveEvalTypes.o
1383 HC [stage 0] compiler/stage1/build/CoreSeq.o
1384 HC [stage 0] compiler/stage1/build/StgSubst.o
1385 HC [stage 0] compiler/stage1/build/HotCode.o
1386 HC [stage 0] compiler/stage1/build/UnVarGraph.o
1387 HC [stage 0] compiler/stage1/build/FamInstEnv.o
1388 HC [stage 0] compiler/stage1/build/PprCore.o
1389 HC [stage 0] compiler/stage1/build/CoreFVs.o
1390 HC [stage 0] compiler/stage1/build/NameCache.o
1391 HC [stage 0] compiler/stage1/build/PrimOp.o
1392 HC [stage 0] compiler/stage1/build/KnownUniques.o
1393 HC [stage 0] compiler/stage1/build/IfaceSyn.o
1394 HC [stage 0] compiler/stage1/build/TcType.o
1395 HC [stage 0] compiler/stage1/build/TcEvidence.o
1396 HC [stage 0] compiler/stage1/build/InstEnv.o
1397 HC [stage 0] compiler/stage1/build/OptCoercion.o
1398 HC [stage 0] compiler/stage1/build/HsBinds.o
1399 HC [stage 0] compiler/stage1/build/HsPat.o
1400 HC [stage 0] compiler/stage1/build/HsDecls.o
1401 HC [stage 0] compiler/stage1/build/ByteCodeTypes.o
1402 HC [stage 0] compiler/stage1/build/CoreUtils.o
1403 HC [stage 0] compiler/stage1/build/CLabel.o
1404 HC [stage 0] compiler/stage1/build/StgSyn.o
1405 HC [stage 0] compiler/stage1/build/StgLiftLams/LiftM.o
1406 HC [stage 0] compiler/stage1/build/StgFVs.o
1407 HC [stage 0] compiler/stage1/build/StgCse.o
1408 HC [stage 0] compiler/stage1/build/StgStats.o
1409 HC [stage 0] compiler/stage1/build/StgLint.o
1410 HC [stage 0] compiler/stage1/build/HsExpr.o
1411 HC [stage 0] compiler/stage1/build/BlockId.o
1412 HC [stage 0] compiler/stage1/build/ProfInit.o
1413 HC [stage 0] compiler/stage1/build/CmmExpr.o
1414 HC [stage 0] compiler/stage1/build/CoreSubst.o
1415 HC [stage 0] compiler/stage1/build/Exitify.o
1416 HC [stage 0] compiler/stage1/build/SAT.o
1417 HC [stage 0] compiler/stage1/build/CodeGen/Platform/NoRegs.o
1418 HC [stage 0] compiler/stage1/build/CodeGen/Platform/X86_64.o
1419 HC [stage 0] compiler/stage1/build/CodeGen/Platform/X86.o
1420 HC [stage 0] compiler/stage1/build/CodeGen/Platform/SPARC.o
1421 HC [stage 0] compiler/stage1/build/CodeGen/Platform/PPC_Darwin.o
1422 HC [stage 0] compiler/stage1/build/CodeGen/Platform/PPC.o
1423 HC [stage 0] compiler/stage1/build/CodeGen/Platform/ARM64.o
1424 HC [stage 0] compiler/stage1/build/CodeGen/Platform/ARM.o
1425 HC [stage 0] compiler/stage1/build/PprCmmExpr.o
1426 HC [stage 0] compiler/stage1/build/CmmLex.o
1427 HC [stage 0] compiler/stage1/build/CoreArity.o
1428 HC [stage 0] compiler/stage1/build/CSE.o
1429 HC [stage 0] compiler/stage1/build/CodeGen/Platform.o
1430 HC [stage 0] compiler/stage1/build/CmmNode.o
1431 HC [stage 0] compiler/stage1/build/OccurAnal.o
1432 HC [stage 0] compiler/stage1/build/CoreTidy.o
1433 HC [stage 0] compiler/stage1/build/CallArity.o
1434 HC [stage 0] compiler/stage1/build/Cmm.o
1435 HC [stage 0] compiler/stage1/build/PprCmmDecl.o
1436 HC [stage 0] compiler/stage1/build/CmmUtils.o
1437 HC [stage 0] compiler/stage1/build/Hoopl/Dataflow.o
1438 HC [stage 0] compiler/stage1/build/PprBase.o
1439 HC [stage 0] compiler/stage1/build/X86/Regs.o
1440 HC [stage 0] compiler/stage1/build/Instruction.o
1441 HC [stage 0] compiler/stage1/build/Format.o
1442 HC [stage 0] compiler/stage1/build/SPARC/Imm.o
1443 HC [stage 0] compiler/stage1/build/StgCmmClosure.o
1444 HC [stage 0] compiler/stage1/build/CoreOpt.o
1445 HC [stage 0] compiler/stage1/build/CmmLive.o
1446 HC [stage 0] compiler/stage1/build/Llvm/Types.o
1447 HC [stage 0] compiler/stage1/build/Dwarf/Constants.o
1448 HC [stage 0] compiler/stage1/build/SPARC/Regs.o
1449 HC [stage 0] compiler/stage1/build/PPC/Regs.o
1450 HC [stage 0] compiler/stage1/build/X86/RegInfo.o
1451 HC [stage 0] compiler/stage1/build/RegAlloc/Linear/X86_64/FreeRegs.o
1452 HC [stage 0] compiler/stage1/build/RegAlloc/Linear/X86/FreeRegs.o
1453 HC [stage 0] compiler/stage1/build/SPARC/AddrMode.o
1454 HC [stage 0] compiler/stage1/build/StgCmmArgRep.o
1455 HC [stage 0] compiler/stage1/build/HsInstances.o
1456 HC [stage 0] compiler/stage1/build/HsUtils.o
1457 HC [stage 0] compiler/stage1/build/CoreUnfold.o
1458 HC [stage 0] compiler/stage1/build/Rules.o
1459 HC [stage 0] compiler/stage1/build/PprCmm.o
1460 HC [stage 0] compiler/stage1/build/Llvm/MetaData.o
1461 HC [stage 0] compiler/stage1/build/CgUtils.o
1462 HC [stage 0] compiler/stage1/build/CmmOpt.o
1463 HC [stage 0] compiler/stage1/build/Debug.o
1464 HC [stage 0] compiler/stage1/build/TargetReg.o
1465 HC [stage 0] compiler/stage1/build/CmmInfo.o
1466 HC [stage 0] compiler/stage1/build/RegAlloc/Linear/SPARC/FreeRegs.o
1467 HC [stage 0] compiler/stage1/build/RegAlloc/Linear/PPC/FreeRegs.o
1468 HC [stage 0] compiler/stage1/build/SPARC/Stack.o
1469 HC [stage 0] compiler/stage1/build/CmmContFlowOpt.o
1470 HC [stage 0] compiler/stage1/build/CmmImplementSwitchPlans.o
1471 HC [stage 0] compiler/stage1/build/CmmLint.o
1472 HC [stage 0] compiler/stage1/build/PprC.o
1473 HC [stage 0] compiler/stage1/build/Llvm/AbsSyn.o
1474 HC [stage 0] compiler/stage1/build/Dwarf/Types.o
1475 HC [stage 0] compiler/stage1/build/CFG.o
1476 HC [stage 0] compiler/stage1/build/X86/Instr.o
1477 HC [stage 0] compiler/stage1/build/PPC/Instr.o
1478 HC [stage 0] compiler/stage1/build/SPARC/Instr.o
1479 HC [stage 0] compiler/stage1/build/CmmSink.o
1480 HC [stage 0] compiler/stage1/build/CmmCallConv.o
1481 HC [stage 0] compiler/stage1/build/CmmProcPoint.o
1482 HC [stage 0] compiler/stage1/build/CmmCommonBlockElim.o
1483 HC [stage 0] compiler/stage1/build/LiberateCase.o
1484 HC [stage 0] compiler/stage1/build/Llvm/PpLlvm.o
1485 HC [stage 0] compiler/stage1/build/Dwarf.o
1486 HC [stage 0] compiler/stage1/build/NCGMonad.o
1487 HC [stage 0] compiler/stage1/build/RegAlloc/Liveness.o
1488 HC [stage 0] compiler/stage1/build/RegAlloc/Linear/FreeRegs.o
1489 HC [stage 0] compiler/stage1/build/PPC/Ppr.o
1490 HC [stage 0] compiler/stage1/build/PPC/RegInfo.o
1491 HC [stage 0] compiler/stage1/build/SPARC/Ppr.o
1492 HC [stage 0] compiler/stage1/build/SPARC/ShortcutJump.o
1493 HC [stage 0] compiler/stage1/build/SPARC/CodeGen/Base.o
1494 HC [stage 0] compiler/stage1/build/X86/Ppr.o
1495 HC [stage 0] compiler/stage1/build/MkGraph.o
1496 HC [stage 0] compiler/stage1/build/Llvm.o
1497 HC [stage 0] compiler/stage1/build/PIC.o
1498 HC [stage 0] compiler/stage1/build/BlockLayout.o
1499 HC [stage 0] compiler/stage1/build/RegAlloc/Graph/SpillCost.o
1500 HC [stage 0] compiler/stage1/build/RegAlloc/Graph/Spill.o
1501 HC [stage 0] compiler/stage1/build/RegAlloc/Graph/SpillClean.o
1502 HC [stage 0] compiler/stage1/build/RegAlloc/Linear/Base.o
1503 HC [stage 0] compiler/stage1/build/SPARC/CodeGen/Expand.o
1504 HC [stage 0] compiler/stage1/build/SPARC/CodeGen/Gen32.o-boot
1505 HC [stage 0] compiler/stage1/build/SPARC/CodeGen/Sanity.o
1506 HC [stage 0] compiler/stage1/build/StgCmmMonad.o
1507 HC [stage 0] compiler/stage1/build/RegAlloc/Graph/Coalesce.o
1508 HC [stage 0] compiler/stage1/build/LlvmCodeGen/Regs.o
1509 HC [stage 0] compiler/stage1/build/RegAlloc/Graph/Stats.o
1510 HC [stage 0] compiler/stage1/build/RegAlloc/Linear/Stats.o
1511 HC [stage 0] compiler/stage1/build/PPC/CodeGen.o
1512 HC [stage 0] compiler/stage1/build/SPARC/CodeGen/Amode.o
1513 HC [stage 0] compiler/stage1/build/SPARC/CodeGen/CondCode.o
1514 HC [stage 0] compiler/stage1/build/X86/CodeGen.o
1515 HC [stage 0] compiler/stage1/build/StgCmmUtils.o
1516 HC [stage 0] compiler/stage1/build/StgCmmBind.o-boot
1517 HC [stage 0] compiler/stage1/build/StgCmmExtCode.o
1518 HC [stage 0] compiler/stage1/build/LlvmCodeGen/Base.o
1519 HC [stage 0] compiler/stage1/build/RegAlloc/Graph/Main.o
1520 HC [stage 0] compiler/stage1/build/RegAlloc/Linear/State.o
1521 HC [stage 0] compiler/stage1/build/SPARC/CodeGen/Gen64.o
1522 HC [stage 0] compiler/stage1/build/StgCmmTicky.o
1523 HC [stage 0] compiler/stage1/build/StgCmmEnv.o
1524 HC [stage 0] compiler/stage1/build/StgCmmProf.o
1525 HC [stage 0] compiler/stage1/build/SysTools/Tasks.o
1526 HC [stage 0] compiler/stage1/build/LlvmCodeGen/Data.o
1527 HC [stage 0] compiler/stage1/build/LlvmCodeGen/CodeGen.o
1528 HC [stage 0] compiler/stage1/build/RegAlloc/Linear/JoinToTargets.o
1529 HC [stage 0] compiler/stage1/build/SPARC/CodeGen/Gen32.o
1530 HC [stage 0] compiler/stage1/build/StgCmmLayout.o
1531 HC [stage 0] compiler/stage1/build/SysTools/ExtraObj.o
1532 HC [stage 0] compiler/stage1/build/LlvmCodeGen/Ppr.o
1533 HC [stage 0] compiler/stage1/build/RegAlloc/Linear/Main.o
1534 HC [stage 0] compiler/stage1/build/SPARC/CodeGen.o
1535 HC [stage 0] compiler/stage1/build/StgCmmForeign.o
1536 HC [stage 0] compiler/stage1/build/StgCmmHeap.o
1537 HC [stage 0] compiler/stage1/build/StgLiftLams/Analysis.o
1538 HC [stage 0] compiler/stage1/build/ByteCodeInstr.o
1539 HC [stage 0] compiler/stage1/build/SysTools.o
1540 HC [stage 0] compiler/stage1/build/CmmBuildInfoTables.o
1541 HC [stage 0] compiler/stage1/build/StgLiftLams/Transformation.o
1542 HC [stage 0] compiler/stage1/build/LlvmCodeGen.o
1543 HC [stage 0] compiler/stage1/build/CmmLayoutStack.o
1544 HC [stage 0] compiler/stage1/build/StgCmmPrim.o
1545 HC [stage 0] compiler/stage1/build/StgLiftLams.o
1546 HC [stage 0] compiler/stage1/build/AsmCodeGen.o
1547 HC [stage 0] compiler/stage1/build/HsSyn.o
1548 HC [stage 0] compiler/stage1/build/PmExpr.o
1549 HC [stage 0] compiler/stage1/build/HscTypes.o
1550 HC [stage 0] compiler/stage1/build/RdrHsSyn.o
1551 HC [stage 0] compiler/stage1/build/HscStats.o
1552 HC [stage 0] compiler/stage1/build/HsDumpAst.o
1553 HC [stage 0] compiler/stage1/build/HaddockUtils.o
1554 HC [stage 0] compiler/stage1/build/BkpSyn.o
1555 HC [stage 0] compiler/stage1/build/Convert.o
1556 HC [stage 0] compiler/stage1/build/TcRnTypes.o
1557 HC [stage 0] compiler/stage1/build/Finder.o
1558 HC [stage 0] compiler/stage1/build/GhcMonad.o
1559 HC [stage 0] compiler/stage1/build/PipelineMonad.o
1560 HC [stage 0] compiler/stage1/build/MkCore.o
1561 HC [stage 0] compiler/stage1/build/DynamicLoading.o
1562 HC [stage 0] compiler/stage1/build/CoreMonad.o
1563 HC [stage 0] compiler/stage1/build/CmmPipeline.o
1564 HC [stage 0] compiler/stage1/build/StgCmmHpc.o
1565 HC [stage 0] compiler/stage1/build/Parser.o
1566 HC [stage 0] compiler/stage1/build/PrelRules.o
1567 HC [stage 0] compiler/stage1/build/TcEvTerm.o
1568 HC [stage 0] compiler/stage1/build/CodeOutput.o
1569 HC [stage 0] compiler/stage1/build/CoreLint.o
1570 HC [stage 0] compiler/stage1/build/SetLevels.o
1571 HC [stage 0] compiler/stage1/build/FloatIn.o
1572 HC [stage 0] compiler/stage1/build/SimplMonad.o
1573 HC [stage 0] compiler/stage1/build/TcEnv.o-boot
1574 HC [stage 0] compiler/stage1/build/TcIface.o-boot
1575 HC [stage 0] compiler/stage1/build/Plugins.o
1576 HC [stage 0] compiler/stage1/build/Hooks.o
1577 HC [stage 0] compiler/stage1/build/TcTypeNats.o
1578 HC [stage 0] compiler/stage1/build/MkId.o
1579 HC [stage 0] compiler/stage1/build/TcRnDriver.o-boot
1580 HC [stage 0] compiler/stage1/build/TcUnify.o-boot
1581 HC [stage 0] compiler/stage1/build/TcExpr.o-boot
1582 HC [stage 0] compiler/stage1/build/TcHoleErrors.o-boot
1583 HC [stage 0] compiler/stage1/build/TcMatches.o-boot
1584 HC [stage 0] compiler/stage1/build/RnHsDoc.o
1585 HC [stage 0] compiler/stage1/build/FloatOut.o
1586 HC [stage 0] compiler/stage1/build/SimplEnv.o
1587 HC [stage 0] compiler/stage1/build/ExtractDocs.o
1588 HC [stage 0] compiler/stage1/build/TcSplice.o-boot
1589 HC [stage 0] compiler/stage1/build/RnExpr.o-boot
1590 HC [stage 0] compiler/stage1/build/HeaderInfo.o
1591 HC [stage 0] compiler/stage1/build/DsUsage.o
1592 HC [stage 0] compiler/stage1/build/TcRnMonad.o
1593 HC [stage 0] compiler/stage1/build/PrelInfo.o
1594 HC [stage 0] compiler/stage1/build/UnariseStg.o
1595 HC [stage 0] compiler/stage1/build/CoreToStg.o
1596 HC [stage 0] compiler/stage1/build/WwLib.o
1597 HC [stage 0] compiler/stage1/build/Specialise.o
1598 HC [stage 0] compiler/stage1/build/SimplUtils.o
1599 HC [stage 0] compiler/stage1/build/GHCi.o
1600 HC [stage 0] compiler/stage1/build/ToIface.o
1601 HC [stage 0] compiler/stage1/build/StgCmmCon.o
1602 HC [stage 0] compiler/stage1/build/SimplStg.o
1603 HC [stage 0] compiler/stage1/build/WorkWrap.o
1604 HC [stage 0] compiler/stage1/build/DmdAnal.o
1605 HC [stage 0] compiler/stage1/build/SpecConstr.o
1606 HC [stage 0] compiler/stage1/build/Coverage.o
1607 HC [stage 0] compiler/stage1/build/ByteCodeItbls.o
1608 HC [stage 0] compiler/stage1/build/ByteCodeLink.o
1609 HC [stage 0] compiler/stage1/build/LoadIface.o-boot
1610 HC [stage 0] compiler/stage1/build/IfaceEnv.o
1611 HC [stage 0] compiler/stage1/build/TcMType.o
1612 HC [stage 0] compiler/stage1/build/RnUnbound.o
1613 HC [stage 0] compiler/stage1/build/TcPatSyn.o-boot
1614 HC [stage 0] compiler/stage1/build/StgCmmExpr.o
1615 HC [stage 0] compiler/stage1/build/Simplify.o
1616 HC [stage 0] compiler/stage1/build/RnSplice.o-boot
1617 HC [stage 0] compiler/stage1/build/TcAnnotations.o
1618 HC [stage 0] compiler/stage1/build/ByteCodeAsm.o
1619 HC [stage 0] compiler/stage1/build/NameShape.o
1620 HC [stage 0] compiler/stage1/build/BinIface.o
1621 HC [stage 0] compiler/stage1/build/BuildTyCl.o
1622 HC [stage 0] compiler/stage1/build/StgCmmBind.o
1623 HC [stage 0] compiler/stage1/build/RnModIface.o
1624 HC [stage 0] compiler/stage1/build/ByteCodeGen.o
1625 HC [stage 0] compiler/stage1/build/FlagChecker.o
1626 HC [stage 0] compiler/stage1/build/CmmParse.o
1627 HC [stage 0] compiler/stage1/build/StgCmm.o
1628 HC [stage 0] compiler/stage1/build/SimplCore.o
1629 HC [stage 0] compiler/stage1/build/LoadIface.o
1630 HC [stage 0] compiler/stage1/build/FamInst.o
1631 HC [stage 0] compiler/stage1/build/TcEnv.o
1632 HC [stage 0] compiler/stage1/build/RnFixity.o
1633 HC [stage 0] compiler/stage1/build/TcIface.o
1634 HC [stage 0] compiler/stage1/build/MkIface.o
1635 HC [stage 0] compiler/stage1/build/Linker.o
1636 HC [stage 0] compiler/stage1/build/FunDeps.o
1637 HC [stage 0] compiler/stage1/build/TcHsSyn.o
1638 HC [stage 0] compiler/stage1/build/RnUtils.o
1639 HC [stage 0] compiler/stage1/build/CorePrep.o
1640 HC [stage 0] compiler/stage1/build/StaticPtrTable.o
1641 HC [stage 0] compiler/stage1/build/GhcPlugins.o
1642 HC [stage 0] compiler/stage1/build/RnEnv.o
1643 HC [stage 0] compiler/stage1/build/DsMonad.o
1644 HC [stage 0] compiler/stage1/build/PprTyThing.o
1645 HC [stage 0] compiler/stage1/build/TidyPgm.o
1646 HC [stage 0] compiler/stage1/build/Inst.o
1647 HC [stage 0] compiler/stage1/build/TmOracle.o
1648 HC [stage 0] compiler/stage1/build/DsExpr.o-boot
1649 HC [stage 0] compiler/stage1/build/Match.o-boot
1650 HC [stage 0] compiler/stage1/build/DsUtils.o
1651 HC [stage 0] compiler/stage1/build/RnNames.o
1652 HC [stage 0] compiler/stage1/build/RnTypes.o
1653 HC [stage 0] compiler/stage1/build/TcUnify.o
1654 HC [stage 0] compiler/stage1/build/ClsInst.o
1655 HC [stage 0] compiler/stage1/build/DsCCall.o
1656 HC [stage 0] compiler/stage1/build/MatchLit.o
1657 HC [stage 0] compiler/stage1/build/DsForeign.o
1658 HC [stage 0] compiler/stage1/build/TcErrors.o
1659 HC [stage 0] compiler/stage1/build/RtClosureInspect.o
1660 HC [stage 0] compiler/stage1/build/DsMeta.o
1661 HC [stage 0] compiler/stage1/build/RnPat.o
1662 HC [stage 0] compiler/stage1/build/TcRnExports.o
1663 HC [stage 0] compiler/stage1/build/RnBinds.o
1664 HC [stage 0] compiler/stage1/build/RnSource.o
1665 HC [stage 0] compiler/stage1/build/TcSMonad.o
1666 HC [stage 0] compiler/stage1/build/TcFlatten.o
1667 HC [stage 0] compiler/stage1/build/RnSplice.o
1668 HC [stage 0] compiler/stage1/build/RnExpr.o
1669 HC [stage 0] compiler/stage1/build/TcCanonical.o
1670 HC [stage 0] compiler/stage1/build/TcInteract.o
1671 HC [stage 0] compiler/stage1/build/TcSimplify.o
1672 HC [stage 0] compiler/stage1/build/TcValidity.o
1673 HC [stage 0] compiler/stage1/build/Check.o
1674 HC [stage 0] compiler/stage1/build/TcHoleErrors.o
1675 HC [stage 0] compiler/stage1/build/TcHsType.o
1676 HC [stage 0] compiler/stage1/build/TcGenDeriv.o
1677 HC [stage 0] compiler/stage1/build/DsGRHSs.o
1678 HC [stage 0] compiler/stage1/build/DsBinds.o
1679 HC [stage 0] compiler/stage1/build/MatchCon.o
1680 HC [stage 0] compiler/stage1/build/TcSigs.o
1681 HC [stage 0] compiler/stage1/build/TcDefaults.o
1682 HC [stage 0] compiler/stage1/build/TcGenFunctor.o
1683 HC [stage 0] compiler/stage1/build/Match.o
1684 HC [stage 0] compiler/stage1/build/TcGenGenerics.o
1685 HC [stage 0] compiler/stage1/build/TcPat.o
1686 HC [stage 0] compiler/stage1/build/DsArrows.o
1687 HC [stage 0] compiler/stage1/build/DsListComp.o
1688 HC [stage 0] compiler/stage1/build/TcDerivUtils.o
1689 HC [stage 0] compiler/stage1/build/TcBinds.o
1690 HC [stage 0] compiler/stage1/build/DsExpr.o
1691 HC [stage 0] compiler/stage1/build/TcDerivInfer.o
1692 HC [stage 0] compiler/stage1/build/TcTyDecls.o
1693 HC [stage 0] compiler/stage1/build/TcTypeable.o
1694 HC [stage 0] compiler/stage1/build/TcClassDcl.o
1695 HC [stage 0] compiler/stage1/build/TcMatches.o
1696 HC [stage 0] compiler/stage1/build/TcDeriv.o
1697 HC [stage 0] compiler/stage1/build/TcBackpack.o
1698 HC [stage 0] compiler/stage1/build/TcPatSyn.o
1699 HC [stage 0] compiler/stage1/build/TcArrows.o
1700 HC [stage 0] compiler/stage1/build/TcExpr.o
1701 HC [stage 0] compiler/stage1/build/TcInstDcls.o-boot
1702 HC [stage 0] compiler/stage1/build/TcTyClsDecls.o
1703 HC [stage 0] compiler/stage1/build/TcForeign.o
1704 HC [stage 0] compiler/stage1/build/TcRules.o
1705 HC [stage 0] compiler/stage1/build/TcInstDcls.o
1706 HC [stage 0] compiler/stage1/build/TcRnDriver.o
1707 HC [stage 0] compiler/stage1/build/Desugar.o
1708 HC [stage 0] compiler/stage1/build/HscMain.o
1709 HC [stage 0] compiler/stage1/build/DriverPipeline.o
1710 HC [stage 0] compiler/stage1/build/InteractiveEval.o
1711 HC [stage 0] compiler/stage1/build/TcSplice.o
1712 HC [stage 0] compiler/stage1/build/GhcMake.o
1713 HC [stage 0] compiler/stage1/build/GHC.o
1714 HC [stage 0] compiler/stage1/build/DriverBkp.o
1715 HC [stage 0] compiler/stage1/build/DriverMkDepend.o
1716 HC [stage 0] compiler/stage1/build/Debugger.o
1717 HC [stage 0] ghc/stage1/build/Main.o
1718 HC [stage 0] ghc/stage1/build/tmp/ghc-stage1
1719 GHC PKG libraries/ghc-prim/dist-install/package-data.mk
1720 GHC PKG libraries/integer-gmp/dist-install/package-data.mk
1721 GHC PKG libraries/base/dist-install/package-data.mk
1722 GHC PKG libraries/filepath/dist-install/package-data.mk
1723 GHC PKG libraries/array/dist-install/package-data.mk
1724 GHC PKG libraries/deepseq/dist-install/package-data.mk
1725 GHC PKG libraries/bytestring/dist-install/package-data.mk
1726 GHC PKG libraries/containers/dist-install/package-data.mk
1727 GHC PKG libraries/time/dist-install/package-data.mk
1728 GHC PKG libraries/unix/dist-install/package-data.mk
1729 GHC PKG libraries/directory/dist-install/package-data.mk
1730 GHC PKG libraries/process/dist-install/package-data.mk
1731 GHC PKG libraries/hpc/dist-install/package-data.mk
1732 GHC PKG libraries/pretty/dist-install/package-data.mk
1733 GHC PKG libraries/binary/dist-install/package-data.mk
1734 GHC PKG libraries/text/dist-install/package-data.mk
1735 GHC PKG libraries/transformers/dist-install/package-data.mk
1736 GHC PKG libraries/mtl/dist-install/package-data.mk
1737 GHC PKG libraries/parsec/dist-install/package-data.mk
1738 GHC PKG libraries/Cabal/Cabal/dist-install/package-data.mk
1739 GHC PKG libraries/ghc-boot-th/dist-install/package-data.mk
1740 GHC PKG libraries/ghc-boot/dist-install/package-data.mk
1741 GHC PKG libraries/template-haskell/dist-install/package-data.mk
1742 GHC PKG libraries/ghc-compact/dist-install/package-data.mk
1743 GHC PKG libraries/ghc-heap/dist-install/package-data.mk
1744 GHC PKG libraries/xhtml/dist-install/package-data.mk
1745 GHC PKG libraries/terminfo/dist-install/package-data.mk
1746 GHC PKG libraries/stm/dist-install/package-data.mk
1747 GHC PKG libraries/haskeline/dist-install/package-data.mk
1748 GHC PKG libraries/ghci/dist-install/package-data.mk
1749 GHC PKG libraries/libiserv/dist-install/package-data.mk
1750 GHC PKG compiler/stage2/package-data.mk
1751 GHC PKG libraries/parallel/dist-install/package-data.mk
1752===--- building final phase
1753Creating compiler/stage2/ghc_boot_platform.h...
1754 HAPPY utils/hpc/dist-install/build/HpcParser.hs
1755Done.
1756 ALEX compiler/stage2/build/CmmLex.hs
1757 HAPPY compiler/stage2/build/CmmParse.hs
1758 ALEX compiler/stage2/build/Lexer.hs
1759 HAPPY compiler/stage2/build/Parser.hs
1760 HSC2HS compiler/stage2/build/Fingerprint.hs
1761 HSC2HS libraries/ghc-heap/dist-install/build/GHC/Exts/Heap/InfoTableProf.hs
1762checking build system type... HSC2HS libraries/ghc-heap/dist-install/build/GHC/Exts/Heap/Utils.hs
1763x86_64-apple-darwin16.7.0
1764checking host system type... x86_64-apple-darwin
1765checking target system type... x86_64-apple-darwin
1766continue configure in default builddir "./x86_64-apple-darwin"
1767....exec /bin/sh .././configure "--srcdir=.." "--enable-builddir=x86_64-apple-darwin" "darwin"
1768checking build system type... x86_64-apple-darwin16.7.0
1769checking host system type... x86_64-apple-darwin
1770checking target system type... x86_64-apple-darwin
1771checking for gsed... sed
1772checking for a BSD-compatible install... /usr/local/bin/ginstall -c
1773checking whether build environment is sane... yes
1774checking for x86_64-apple-darwin-strip... no
1775checking for strip... strip
1776checking for a thread-safe mkdir -p... /usr/local/bin/gmkdir -p
1777checking for gawk... no
1778checking for mawk... no
1779checking for nawk... no
1780checking for awk... awk
1781checking whether make sets $(MAKE)... yes
1782checking whether make supports nested variables... yes
1783checking for x86_64-apple-darwin-gcc... gcc
1784checking whether the C compiler works... yes
1785checking for C compiler default output file name... a.out
1786checking for suffix of executables...
1787checking whether we are cross compiling... no
1788checking for suffix of object files... o
1789checking whether we are using the GNU C compiler... yes
1790checking whether gcc accepts -g... yes
1791checking for gcc option to accept ISO C89... none needed
1792checking whether gcc understands -c and -o together... yes
1793checking for style of include used by make... GNU
1794checking dependency style of gcc... gcc3
1795checking whether we are using the GNU C++ compiler... yes
1796checking whether gcc accepts -g... yes
1797checking dependency style of gcc... gcc3
1798checking dependency style of gcc... gcc3
1799checking how to print strings... printf
1800checking for a sed that does not truncate output... HSC2HS libraries/unix/dist-install/build/System/Posix/Semaphore.hs
1801 HSC2HS libraries/unix/dist-install/build/System/Posix/SharedMem.hs
1802 HSC2HS libraries/unix/dist-install/build/System/Posix/Directory.hs
1803/usr/bin/sed
1804checking for grep that handles long lines and -e... HSC2HS libraries/unix/dist-install/build/System/Posix/DynamicLinker/Prim.hs
1805 HSC2HS libraries/unix/dist-install/build/System/Posix/DynamicLinker/ByteString.hs
1806 HSC2HS libraries/unix/dist-install/build/System/Posix/DynamicLinker.hs
1807 HSC2HS libraries/unix/dist-install/build/System/Posix/Files.hs
1808 HSC2HS libraries/unix/dist-install/build/System/Posix/IO.hs
1809/usr/bin/grep
1810checking for egrep... /usr/bin/grep -E
1811checking for fgrep... /usr/bin/grep -F
1812checking for ld used by gcc... ld
1813checking if the linker (ld) is GNU ld... no
1814checking for BSD- or MS-compatible name lister (nm)... nm
1815checking the name lister (nm) interface... HSC2HS libraries/unix/dist-install/build/System/Posix/Env.hs
1816 HSC2HS libraries/unix/dist-install/build/System/Posix/Fcntl.hs
1817 HSC2HS libraries/unix/dist-install/build/System/Posix/Process.hs
1818BSD nm
1819checking whether ln -s works... yes
1820checking the maximum length of command line arguments... 196608
1821checking how to convert x86_64-apple-darwin16.7.0 file names to x86_64-apple-darwin format... func_convert_file_noop
1822checking how to convert x86_64-apple-darwin16.7.0 file names to toolchain format... func_convert_file_noop
1823checking for ld option to reload object files... -r
1824checking for x86_64-apple-darwin-objdump... no
1825checking for objdump... objdump
1826checking how to recognize dependent libraries... pass_all
1827checking for x86_64-apple-darwin-dlltool... no
1828checking for dlltool... no
1829checking how to associate runtime and link libraries... printf %s\n
1830checking for x86_64-apple-darwin-ar... ar
1831checking for archiver @FILE support... no
1832checking for x86_64-apple-darwin-strip... strip
1833checking for x86_64-apple-darwin-ranlib... ranlib
1834checking command to parse nm output from gcc object... HSC2HS libraries/unix/dist-install/build/System/Posix/Temp.hs
1835 HSC2HS libraries/unix/dist-install/build/System/Posix/Terminal.hs
1836 HSC2HS libraries/unix/dist-install/build/System/Posix/Directory/Common.hs
1837 HSC2HS libraries/unix/dist-install/build/System/Posix/DynamicLinker/Common.hs
1838ok
1839checking for sysroot... no
1840checking for a working dd... HSC2HS libraries/unix/dist-install/build/System/Posix/Files/Common.hs
1841 HSC2HS libraries/unix/dist-install/build/System/Posix/IO/Common.hs
1842/bin/dd
1843checking how to truncate binary pipes... /bin/dd bs=4096 count=1
1844checking for x86_64-apple-darwin-mt... no
1845checking for mt... no
1846checking if : is a manifest tool... no
1847checking for x86_64-apple-darwin-dsymutil... no
1848checking for dsymutil... dsymutil
1849checking for x86_64-apple-darwin-nmedit... no
1850checking for nmedit... nmedit
1851checking for x86_64-apple-darwin-lipo... no
1852checking for lipo... lipo
1853checking for x86_64-apple-darwin-otool... no
1854checking for otool... otool
1855checking for x86_64-apple-darwin-otool64... no
1856checking for otool64... no
1857checking for -single_module linker flag... HSC2HS libraries/unix/dist-install/build/System/Posix/Process/Common.hs
1858 HSC2HS libraries/unix/dist-install/build/System/Posix/Terminal/Common.hs
1859yes
1860checking for -exported_symbols_list linker flag... yes
1861checking for -force_load linker flag... yes
1862checking how to run the C preprocessor... gcc -E
1863checking for ANSI C header files... yes
1864checking for sys/types.h... yes
1865checking for sys/stat.h... yes
1866checking for stdlib.h... yes
1867checking for string.h... yes
1868checking for memory.h... yes
1869checking for strings.h... yes
1870 HSC2HS libraries/base/dist-install/build/GHC/Stats.hs
1871checking for inttypes.h... yes
1872checking for stdint.h... yes
1873checking for unistd.h... yes
1874checking for dlfcn.h... yes
1875checking for objdir... .libs
1876checking if gcc supports -fno-rtti -fno-exceptions... yes
1877checking for gcc option to produce PIC... -fno-common -DPIC
1878checking if gcc PIC flag -fno-common -DPIC works... yes
1879checking if gcc static flag -static works... no
1880checking if gcc supports -c -o file.o... yes
1881checking if gcc supports -c -o file.o... (cached) yes
1882checking whether the gcc linker (ld) supports shared libraries... yes
1883checking dynamic linker characteristics... darwin dyld
1884checking how to hardcode library paths into programs... immediate
1885checking whether stripping libraries is possible... yes
1886checking if libtool supports shared libraries... yes
1887checking whether to build shared libraries... yes
1888checking whether to build static libraries... yes
1889checking how to run the C++ preprocessor... gcc -E
1890checking for ld used by gcc... ld
1891checking if the linker (ld) is GNU ld... no
1892checking whether the gcc linker (ld) supports shared libraries... yes
1893checking for gcc option to produce PIC... -fno-common -DPIC
1894checking if gcc PIC flag -fno-common -DPIC works... yes
1895checking if gcc static flag -static works... no
1896checking if gcc supports -c -o file.o... yes
1897checking if gcc supports -c -o file.o... (cached) yes
1898checking whether the gcc linker (ld) supports shared libraries... yes
1899checking dynamic linker characteristics... darwin dyld
1900checking how to hardcode library paths into programs... immediate
1901checking size of size_t... 8
1902checking for C compiler vendor... HSC2HS libraries/libiserv/dist-install/build/GHCi/Utils.hs
1903 HSC2HS libraries/ghci/dist-install/build/GHCi/InfoTable.hs
1904 HSC2HS libraries/haskeline/dist-install/build/System/Console/Haskeline/Directory.hs
1905clang
1906checking CFLAGS for maximum warnings... HSC2HS libraries/haskeline/dist-install/build/System/Console/Haskeline/Backend/Posix.hs
1907-Wall
1908checking whether to enable maintainer-specific portions of Makefiles... no
1909checking sys/mman.h usability... HSC2HS libraries/ghc-heap/dist-install/build/GHC/Exts/Heap/Constants.hs
1910yes
1911checking sys/mman.h presence... yes
1912checking for sys/mman.h... yes
1913checking for mmap... HSC2HS libraries/ghc-heap/dist-install/build/GHC/Exts/Heap/InfoTable.hs
1914 HSC2HS libraries/ghc-heap/dist-install/build/GHC/Exts/Heap/InfoTable/Types.hs
1915 HSC2HS libraries/hpc/dist-install/build/Trace/Hpc/Reflect.hs
1916yes
1917checking for mkostemp... yes
1918checking for sys/mman.h... (cached) yes
1919checking for mmap... (cached) yes
1920checking whether read-only mmap of a plain file works... yes
1921checking whether mmap from /dev/zero works... no
1922checking for MAP_ANON(YMOUS)... HSC2HS libraries/directory/dist-install/build/System/Directory/Internal/C_utimensat.hs
1923 HSC2HS libraries/directory/dist-install/build/System/Directory/Internal/Posix.hs
1924yes
1925checking whether mmap with MAP_ANON(YMOUS) works... yes
1926checking for ANSI C header files... (cached) yes
1927checking for memcpy... yes
1928checking for size_t... HSC2HS libraries/directory/dist-install/build/System/Directory/Internal/Windows.hs
1929 HSC2HS libraries/unix/dist-install/build/System/Posix/Resource.hs
1930 HSC2HS libraries/unix/dist-install/build/System/Posix/Unistd.hs
1931yes
1932checking for working alloca.h... HSC2HS libraries/unix/dist-install/build/System/Posix/User.hs
1933yes
1934checking for alloca... HSC2HS libraries/unix/dist-install/build/System/Posix/Signals.hs
1935yes
1936checking size of double... HSC2HS libraries/unix/dist-install/build/System/Posix/Signals/Exts.hs
19378
1938checking size of long double... HSC2HS libraries/unix/dist-install/build/System/Posix/ByteString/FilePath.hs
1939 HSC2HS libraries/unix/dist-install/build/System/Posix/Directory/ByteString.hs
1940 HSC2HS libraries/unix/dist-install/build/System/Posix/DynamicLinker/Module.hs
194116
1942checking whether byte ordering is bigendian... HSC2HS libraries/unix/dist-install/build/System/Posix/DynamicLinker/Module/ByteString.hs
1943 HSC2HS libraries/unix/dist-install/build/System/Posix/Files/ByteString.hs
1944 HSC2HS libraries/unix/dist-install/build/System/Posix/IO/ByteString.hs
1945 HSC2HS libraries/unix/dist-install/build/System/Posix/Env/ByteString.hs
1946no
1947checking assembler .cfi pseudo-op support... HSC2HS libraries/unix/dist-install/build/System/Posix/Process/ByteString.hs
1948yes
1949checking assembler supports pc related relocs... yes
1950checking for _ prefix in compiled symbols... yes
1951checking toolchain supports unwind section type... HSC2HS libraries/unix/dist-install/build/System/Posix/Temp/ByteString.hs
1952 HSC2HS libraries/unix/dist-install/build/System/Posix/Terminal/ByteString.hs
1953no
1954checking whether .eh_frame section should be read-only... HSC2HS libraries/time/dist-install/build/Data/Time/Clock/Internal/CTimespec.hs
1955no
1956checking for __attribute__((visibility("hidden")))... no
1957checking for ld used by gcc... HSC2HS libraries/base/dist-install/build/GHC/Clock.hs
1958 HSC2HS libraries/base/dist-install/build/GHC/ExecutionStack/Internal.hs
1959(cached) ld
1960checking if the linker (ld) is GNU ld... (cached) no
1961 HSC2HS libraries/base/dist-install/build/GHC/IO/Handle/Lock.hs
1962configure: versioning on shared library symbols is no
1963checking that generated files are newer than configure... done
1964configure: creating ./config.status
1965 HSC2HS libraries/base/dist-install/build/GHC/RTS/Flags.hs
1966 HSC2HS libraries/base/dist-install/build/GHC/Stack/CCS.hs
1967 HSC2HS libraries/base/dist-install/build/System/CPUTime.hs
1968 HSC2HS libraries/base/dist-install/build/System/Environment/Blank.hs
1969 HSC2HS libraries/base/dist-install/build/System/Environment/ExecutablePath.hs
1970 HSC2HS libraries/base/dist-install/build/GHC/Event/EPoll.hs
1971 HSC2HS libraries/base/dist-install/build/GHC/Event/KQueue.hs
1972 HSC2HS libraries/base/dist-install/build/GHC/Event/Poll.hs
1973 HSC2HS libraries/base/dist-install/build/System/CPUTime/Posix/ClockGetTime.hs
1974 HSC2HS libraries/base/dist-install/build/System/CPUTime/Posix/Times.hs
1975 HSC2HS libraries/base/dist-install/build/System/CPUTime/Posix/RUsage.hs
1976config.status: creating include/Makefile
1977config.status: creating include/ffi.h
1978config.status: creating Makefile
1979config.status: creating testsuite/Makefile
1980config.status: creating man/Makefile
1981config.status: creating doc/Makefile
1982config.status: creating libffi.pc
1983config.status: creating libffi.map
1984config.status: creating fficonfig.h
1985config.status: linking ../src/x86/ffitarget.h to include/ffitarget.h
1986config.status: executing buildir commands
1987config.status: create top_srcdir/Makefile guessed from local Makefile
1988config.status: buggy sed found - it deletes tab in "a" text parts
1989config.status: build in x86_64-apple-darwin (HOST=)
1990config.status: executing depfiles commands
1991config.status: executing libtool commands
1992config.status: executing include commands
1993config.status: executing src commands
1994MAKE x86_64-apple-darwin16.7.0 : 0 * all-all
1995/Applications/Xcode-7.2/Xcode.app/Contents/Developer/usr/bin/make 'AR_FLAGS=' 'CC_FOR_BUILD=' 'CFLAGS=-Wall -Werror -fno-stack-protector -w -fexceptions' 'CXXFLAGS=-g -O2' 'CFLAGS_FOR_BUILD=' 'CFLAGS_FOR_TARGET=' 'INSTALL=/usr/local/bin/ginstall -c' 'INSTALL_DATA=/usr/local/bin/ginstall -c -m 644' 'INSTALL_PROGRAM=/usr/local/bin/ginstall -c' 'INSTALL_SCRIPT=/usr/local/bin/ginstall -c' 'JC1FLAGS=' 'LDFLAGS=-w' 'LIBCFLAGS=' 'LIBCFLAGS_FOR_TARGET=' 'MAKE=/Applications/Xcode-7.2/Xcode.app/Contents/Developer/usr/bin/make' 'MAKEINFO=/bin/sh /var/drydock/workingcopy-121290/repo/glasgow-haskell-compiler/libffi/build/missing makeinfo ' 'PICFLAG=' 'PICFLAG_FOR_TARGET=' 'RUNTESTFLAGS=' 'SHELL=/bin/sh' 'exec_prefix=/var/drydock/workingcopy-121290/repo/glasgow-haskell-compiler/libffi/build/inst' 'infodir=/var/drydock/workingcopy-121290/repo/glasgow-haskell-compiler/libffi/build/inst/share/info' 'libdir=/var/drydock/workingcopy-121290/repo/glasgow-haskell-compiler/libffi/build/inst/lib' 'mandir=/var/drydock/workingcopy-121290/repo/glasgow-haskell-compiler/libffi/build/inst/share/man' 'prefix=/var/drydock/workingcopy-121290/repo/glasgow-haskell-compiler/libffi/build/inst' 'AR=ar' 'AS=as' 'CC=gcc' 'CXX=gcc' 'LD=ld' 'NM=nm' 'RANLIB=ranlib' 'DESTDIR=' all-recursive
1996Making all in include
1997make[5]: Nothing to be done for `all'.
1998Making all in testsuite
1999make[5]: Nothing to be done for `all'.
2000Making all in man
2001make[5]: Nothing to be done for `all'.
2002depbase=`echo src/prep_cif.lo | sed 's|[^/]*$|.deps/&|;s|\.lo$||'`;\
2003 /bin/sh ./libtool --tag=CC --mode=compile gcc -DHAVE_CONFIG_H -I. -I.. -I. -I../include -Iinclude -I../src -Wall -Werror -fno-stack-protector -w -fexceptions -MT src/prep_cif.lo -MMD -MP -MF $depbase.Tpo -c -o src/prep_cif.lo ../src/prep_cif.c &&\
2004 mv -f $depbase.Tpo $depbase.Plo
2005libtool: compile: gcc -DHAVE_CONFIG_H -I. -I.. -I. -I../include -Iinclude -I../src -Wall -Werror -fno-stack-protector -w -fexceptions -MT src/prep_cif.lo -MMD -MP -MF src/.deps/prep_cif.Tpo -c ../src/prep_cif.c -fno-common -DPIC -o src/.libs/prep_cif.o
2006libtool: compile: gcc -DHAVE_CONFIG_H -I. -I.. -I. -I../include -Iinclude -I../src -Wall -Werror -fno-stack-protector -w -fexceptions -MT src/prep_cif.lo -MMD -MP -MF src/.deps/prep_cif.Tpo -c ../src/prep_cif.c -o src/prep_cif.o >/dev/null 2>&1
2007depbase=`echo src/types.lo | sed 's|[^/]*$|.deps/&|;s|\.lo$||'`;\
2008 /bin/sh ./libtool --tag=CC --mode=compile gcc -DHAVE_CONFIG_H -I. -I.. -I. -I../include -Iinclude -I../src -Wall -Werror -fno-stack-protector -w -fexceptions -MT src/types.lo -MMD -MP -MF $depbase.Tpo -c -o src/types.lo ../src/types.c &&\
2009 mv -f $depbase.Tpo $depbase.Plo
2010libtool: compile: gcc -DHAVE_CONFIG_H -I. -I.. -I. -I../include -Iinclude -I../src -Wall -Werror -fno-stack-protector -w -fexceptions -MT src/types.lo -MMD -MP -MF src/.deps/types.Tpo -c ../src/types.c -fno-common -DPIC -o src/.libs/types.o
2011libtool: compile: gcc -DHAVE_CONFIG_H -I. -I.. -I. -I../include -Iinclude -I../src -Wall -Werror -fno-stack-protector -w -fexceptions -MT src/types.lo -MMD -MP -MF src/.deps/types.Tpo -c ../src/types.c -o src/types.o >/dev/null 2>&1
2012depbase=`echo src/raw_api.lo | sed 's|[^/]*$|.deps/&|;s|\.lo$||'`;\
2013 /bin/sh ./libtool --tag=CC --mode=compile gcc -DHAVE_CONFIG_H -I. -I.. -I. -I../include -Iinclude -I../src -Wall -Werror -fno-stack-protector -w -fexceptions -MT src/raw_api.lo -MMD -MP -MF $depbase.Tpo -c -o src/raw_api.lo ../src/raw_api.c &&\
2014 mv -f $depbase.Tpo $depbase.Plo
2015libtool: compile: gcc -DHAVE_CONFIG_H -I. -I.. -I. -I../include -Iinclude -I../src -Wall -Werror -fno-stack-protector -w -fexceptions -MT src/raw_api.lo -MMD -MP -MF src/.deps/raw_api.Tpo -c ../src/raw_api.c -fno-common -DPIC -o src/.libs/raw_api.o
2016libtool: compile: gcc -DHAVE_CONFIG_H -I. -I.. -I. -I../include -Iinclude -I../src -Wall -Werror -fno-stack-protector -w -fexceptions -MT src/raw_api.lo -MMD -MP -MF src/.deps/raw_api.Tpo -c ../src/raw_api.c -o src/raw_api.o >/dev/null 2>&1
2017depbase=`echo src/java_raw_api.lo | sed 's|[^/]*$|.deps/&|;s|\.lo$||'`;\
2018 /bin/sh ./libtool --tag=CC --mode=compile gcc -DHAVE_CONFIG_H -I. -I.. -I. -I../include -Iinclude -I../src -Wall -Werror -fno-stack-protector -w -fexceptions -MT src/java_raw_api.lo -MMD -MP -MF $depbase.Tpo -c -o src/java_raw_api.lo ../src/java_raw_api.c &&\
2019 mv -f $depbase.Tpo $depbase.Plo
2020libtool: compile: gcc -DHAVE_CONFIG_H -I. -I.. -I. -I../include -Iinclude -I../src -Wall -Werror -fno-stack-protector -w -fexceptions -MT src/java_raw_api.lo -MMD -MP -MF src/.deps/java_raw_api.Tpo -c ../src/java_raw_api.c -fno-common -DPIC -o src/.libs/java_raw_api.o
2021libtool: compile: gcc -DHAVE_CONFIG_H -I. -I.. -I. -I../include -Iinclude -I../src -Wall -Werror -fno-stack-protector -w -fexceptions -MT src/java_raw_api.lo -MMD -MP -MF src/.deps/java_raw_api.Tpo -c ../src/java_raw_api.c -o src/java_raw_api.o >/dev/null 2>&1
2022depbase=`echo src/closures.lo | sed 's|[^/]*$|.deps/&|;s|\.lo$||'`;\
2023 /bin/sh ./libtool --tag=CC --mode=compile gcc -DHAVE_CONFIG_H -I. -I.. -I. -I../include -Iinclude -I../src -Wall -Werror -fno-stack-protector -w -fexceptions -MT src/closures.lo -MMD -MP -MF $depbase.Tpo -c -o src/closures.lo ../src/closures.c &&\
2024 mv -f $depbase.Tpo $depbase.Plo
2025libtool: compile: gcc -DHAVE_CONFIG_H -I. -I.. -I. -I../include -Iinclude -I../src -Wall -Werror -fno-stack-protector -w -fexceptions -MT src/closures.lo -MMD -MP -MF src/.deps/closures.Tpo -c ../src/closures.c -fno-common -DPIC -o src/.libs/closures.o
2026libtool: compile: gcc -DHAVE_CONFIG_H -I. -I.. -I. -I../include -Iinclude -I../src -Wall -Werror -fno-stack-protector -w -fexceptions -MT src/closures.lo -MMD -MP -MF src/.deps/closures.Tpo -c ../src/closures.c -o src/closures.o >/dev/null 2>&1
2027depbase=`echo src/x86/ffi64.lo | sed 's|[^/]*$|.deps/&|;s|\.lo$||'`;\
2028 /bin/sh ./libtool --tag=CC --mode=compile gcc -DHAVE_CONFIG_H -I. -I.. -I. -I../include -Iinclude -I../src -Wall -Werror -fno-stack-protector -w -fexceptions -MT src/x86/ffi64.lo -MMD -MP -MF $depbase.Tpo -c -o src/x86/ffi64.lo ../src/x86/ffi64.c &&\
2029 mv -f $depbase.Tpo $depbase.Plo
2030libtool: compile: gcc -DHAVE_CONFIG_H -I. -I.. -I. -I../include -Iinclude -I../src -Wall -Werror -fno-stack-protector -w -fexceptions -MT src/x86/ffi64.lo -MMD -MP -MF src/x86/.deps/ffi64.Tpo -c ../src/x86/ffi64.c -fno-common -DPIC -o src/x86/.libs/ffi64.o
2031libtool: compile: gcc -DHAVE_CONFIG_H -I. -I.. -I. -I../include -Iinclude -I../src -Wall -Werror -fno-stack-protector -w -fexceptions -MT src/x86/ffi64.lo -MMD -MP -MF src/x86/.deps/ffi64.Tpo -c ../src/x86/ffi64.c -o src/x86/ffi64.o >/dev/null 2>&1
2032depbase=`echo src/x86/unix64.lo | sed 's|[^/]*$|.deps/&|;s|\.lo$||'`;\
2033 /bin/sh ./libtool --mode=compile gcc -DHAVE_CONFIG_H -I. -I.. -I. -I../include -Iinclude -I../src -I. -I../include -Iinclude -I../src -Wall -Werror -fno-stack-protector -w -MT src/x86/unix64.lo -MMD -MP -MF $depbase.Tpo -c -o src/x86/unix64.lo ../src/x86/unix64.S &&\
2034 mv -f $depbase.Tpo $depbase.Plo
2035libtool: compile: gcc -DHAVE_CONFIG_H -I. -I.. -I. -I../include -Iinclude -I../src -I. -I../include -Iinclude -I../src -Wall -Werror -fno-stack-protector -w -MT src/x86/unix64.lo -MMD -MP -MF src/x86/.deps/unix64.Tpo -c ../src/x86/unix64.S -fno-common -DPIC -o src/x86/.libs/unix64.o
2036libtool: compile: gcc -DHAVE_CONFIG_H -I. -I.. -I. -I../include -Iinclude -I../src -I. -I../include -Iinclude -I../src -Wall -Werror -fno-stack-protector -w -MT src/x86/unix64.lo -MMD -MP -MF src/x86/.deps/unix64.Tpo -c ../src/x86/unix64.S -o src/x86/unix64.o >/dev/null 2>&1
2037depbase=`echo src/x86/ffiw64.lo | sed 's|[^/]*$|.deps/&|;s|\.lo$||'`;\
2038 /bin/sh ./libtool --tag=CC --mode=compile gcc -DHAVE_CONFIG_H -I. -I.. -I. -I../include -Iinclude -I../src -Wall -Werror -fno-stack-protector -w -fexceptions -MT src/x86/ffiw64.lo -MMD -MP -MF $depbase.Tpo -c -o src/x86/ffiw64.lo ../src/x86/ffiw64.c &&\
2039 mv -f $depbase.Tpo $depbase.Plo
2040libtool: compile: gcc -DHAVE_CONFIG_H -I. -I.. -I. -I../include -Iinclude -I../src -Wall -Werror -fno-stack-protector -w -fexceptions -MT src/x86/ffiw64.lo -MMD -MP -MF src/x86/.deps/ffiw64.Tpo -c ../src/x86/ffiw64.c -fno-common -DPIC -o src/x86/.libs/ffiw64.o
2041libtool: compile: gcc -DHAVE_CONFIG_H -I. -I.. -I. -I../include -Iinclude -I../src -Wall -Werror -fno-stack-protector -w -fexceptions -MT src/x86/ffiw64.lo -MMD -MP -MF src/x86/.deps/ffiw64.Tpo -c ../src/x86/ffiw64.c -o src/x86/ffiw64.o >/dev/null 2>&1
2042depbase=`echo src/x86/win64.lo | sed 's|[^/]*$|.deps/&|;s|\.lo$||'`;\
2043 /bin/sh ./libtool --mode=compile gcc -DHAVE_CONFIG_H -I. -I.. -I. -I../include -Iinclude -I../src -I. -I../include -Iinclude -I../src -Wall -Werror -fno-stack-protector -w -MT src/x86/win64.lo -MMD -MP -MF $depbase.Tpo -c -o src/x86/win64.lo ../src/x86/win64.S &&\
2044 mv -f $depbase.Tpo $depbase.Plo
2045libtool: compile: gcc -DHAVE_CONFIG_H -I. -I.. -I. -I../include -Iinclude -I../src -I. -I../include -Iinclude -I../src -Wall -Werror -fno-stack-protector -w -MT src/x86/win64.lo -MMD -MP -MF src/x86/.deps/win64.Tpo -c ../src/x86/win64.S -fno-common -DPIC -o src/x86/.libs/win64.o
2046libtool: compile: gcc -DHAVE_CONFIG_H -I. -I.. -I. -I../include -Iinclude -I../src -I. -I../include -Iinclude -I../src -Wall -Werror -fno-stack-protector -w -MT src/x86/win64.lo -MMD -MP -MF src/x86/.deps/win64.Tpo -c ../src/x86/win64.S -o src/x86/win64.o >/dev/null 2>&1
2047/bin/sh ./libtool --tag=CC --mode=link gcc -Wall -Werror -fno-stack-protector -w -fexceptions -w -o libffi_convenience.la src/prep_cif.lo src/types.lo src/raw_api.lo src/java_raw_api.lo src/closures.lo src/x86/ffi64.lo src/x86/unix64.lo src/x86/ffiw64.lo src/x86/win64.lo
2048libtool: link: ar cru .libs/libffi_convenience.a src/.libs/prep_cif.o src/.libs/types.o src/.libs/raw_api.o src/.libs/java_raw_api.o src/.libs/closures.o src/x86/.libs/ffi64.o src/x86/.libs/unix64.o src/x86/.libs/ffiw64.o src/x86/.libs/win64.o
2049libtool: link: ranlib .libs/libffi_convenience.a
2050libtool: link: ( cd ".libs" && rm -f "libffi_convenience.la" && ln -s "../libffi_convenience.la" "libffi_convenience.la" )
2051/bin/sh ./libtool --tag=CC --mode=link gcc -Wall -Werror -fno-stack-protector -w -fexceptions -no-undefined -version-info `grep -v '^#' ../libtool-version` '-w' -w -o libffi.la -rpath /var/drydock/workingcopy-121290/repo/glasgow-haskell-compiler/libffi/build/inst/lib src/prep_cif.lo src/types.lo src/raw_api.lo src/java_raw_api.lo src/closures.lo src/x86/ffi64.lo src/x86/unix64.lo src/x86/ffiw64.lo src/x86/win64.lo
2052libtool: link: gcc -dynamiclib -o .libs/libffi.7.dylib src/.libs/prep_cif.o src/.libs/types.o src/.libs/raw_api.o src/.libs/java_raw_api.o src/.libs/closures.o src/x86/.libs/ffi64.o src/x86/.libs/unix64.o src/x86/.libs/ffiw64.o src/x86/.libs/win64.o -install_name /var/drydock/workingcopy-121290/repo/glasgow-haskell-compiler/libffi/build/inst/lib/libffi.7.dylib -compatibility_version 9 -current_version 9.0 -Wl,-single_module
2053libtool: link: (cd ".libs" && rm -f "libffi.dylib" && ln -s "libffi.7.dylib" "libffi.dylib")
2054libtool: link: ar cru .libs/libffi.a src/prep_cif.o src/types.o src/raw_api.o src/java_raw_api.o src/closures.o src/x86/ffi64.o src/x86/unix64.o src/x86/ffiw64.o src/x86/win64.o
2055libtool: link: ranlib .libs/libffi.a
2056libtool: link: ( cd ".libs" && rm -f "libffi.la" && ln -s "../libffi.la" "libffi.la" )
2057MAKE x86_64-apple-darwin16.7.0 : 0 * install
2058Making install in include
2059make[5]: Nothing to be done for `install-exec-am'.
2060 /usr/local/bin/gmkdir -p '/var/drydock/workingcopy-121290/repo/glasgow-haskell-compiler/libffi/build/inst/include'
2061 /usr/local/bin/ginstall -c -m 644 ffi.h ffitarget.h '/var/drydock/workingcopy-121290/repo/glasgow-haskell-compiler/libffi/build/inst/include'
2062Making install in testsuite
2063make[5]: Nothing to be done for `install-exec-am'.
2064make[5]: Nothing to be done for `install-data-am'.
2065Making install in man
2066make[5]: Nothing to be done for `install-exec-am'.
2067 /usr/local/bin/gmkdir -p '/var/drydock/workingcopy-121290/repo/glasgow-haskell-compiler/libffi/build/inst/share/man/man3'
2068 /usr/local/bin/ginstall -c -m 644 ../../man/ffi.3 ../../man/ffi_call.3 ../../man/ffi_prep_cif.3 ../../man/ffi_prep_cif_var.3 '/var/drydock/workingcopy-121290/repo/glasgow-haskell-compiler/libffi/build/inst/share/man/man3'
2069 /usr/local/bin/gmkdir -p '/var/drydock/workingcopy-121290/repo/glasgow-haskell-compiler/libffi/build/inst/lib'
2070 /bin/sh ./libtool --mode=install /usr/local/bin/ginstall -c libffi.la '/var/drydock/workingcopy-121290/repo/glasgow-haskell-compiler/libffi/build/inst/lib'
2071libtool: install: /usr/local/bin/ginstall -c .libs/libffi.7.dylib /var/drydock/workingcopy-121290/repo/glasgow-haskell-compiler/libffi/build/inst/lib/libffi.7.dylib
2072libtool: install: (cd /var/drydock/workingcopy-121290/repo/glasgow-haskell-compiler/libffi/build/inst/lib && { ln -s -f libffi.7.dylib libffi.dylib || { rm -f libffi.dylib && ln -s libffi.7.dylib libffi.dylib; }; })
2073libtool: install: /usr/local/bin/ginstall -c .libs/libffi.lai /var/drydock/workingcopy-121290/repo/glasgow-haskell-compiler/libffi/build/inst/lib/libffi.la
2074libtool: install: /usr/local/bin/ginstall -c .libs/libffi.a /var/drydock/workingcopy-121290/repo/glasgow-haskell-compiler/libffi/build/inst/lib/libffi.a
2075libtool: install: chmod 644 /var/drydock/workingcopy-121290/repo/glasgow-haskell-compiler/libffi/build/inst/lib/libffi.a
2076libtool: install: ranlib /var/drydock/workingcopy-121290/repo/glasgow-haskell-compiler/libffi/build/inst/lib/libffi.a
2077 /usr/local/bin/gmkdir -p '/var/drydock/workingcopy-121290/repo/glasgow-haskell-compiler/libffi/build/inst/lib/pkgconfig'
2078 /usr/local/bin/ginstall -c -m 644 libffi.pc '/var/drydock/workingcopy-121290/repo/glasgow-haskell-compiler/libffi/build/inst/lib/pkgconfig'
2079 HSC2HS libraries/ghci/dist-install/build/GHCi/FFI.hs
2080 CC utils/unlit/dist-install/build/unlit.dyn_o
2081 CC utils/unlit/dist-install/build/fs.dyn_o
2082 HC [stage 0] utils/hp2ps/dist/build/AreaBelow.o
2083 HC [stage 0] utils/hp2ps/dist/build/Curves.o
2084 HC [stage 0] utils/hp2ps/dist/build/Error.o
2085 HC [stage 0] utils/hp2ps/dist/build/Main.o
2086 HC [stage 0] utils/hp2ps/dist/build/Reorder.o
2087 HC [stage 0] utils/hp2ps/dist/build/TopTwenty.o
2088 HC [stage 0] utils/hp2ps/dist/build/AuxFile.o
2089 HC [stage 0] utils/hp2ps/dist/build/Deviation.o
2090 HC [stage 0] utils/hp2ps/dist/build/HpFile.o
2091 HC [stage 0] utils/hp2ps/dist/build/Marks.o
2092 HC [stage 0] utils/hp2ps/dist/build/Scale.o
2093 HC [stage 0] utils/hp2ps/dist/build/TraceElement.o
2094 HC [stage 0] utils/hp2ps/dist/build/Axes.o
2095 HC [stage 0] utils/hp2ps/dist/build/Dimensions.o
2096 HC [stage 0] utils/hp2ps/dist/build/Key.o
2097 HC [stage 0] utils/hp2ps/dist/build/PsFile.o
2098 HC [stage 0] utils/hp2ps/dist/build/Shade.o
2099 HC [stage 0] utils/hp2ps/dist/build/Utilities.o
2100 CC utils/hp2ps/dist-install/build/AreaBelow.dyn_o
2101 CC utils/hp2ps/dist-install/build/Curves.dyn_o
2102 CC utils/hp2ps/dist-install/build/Error.dyn_o
2103 CC utils/hp2ps/dist-install/build/Main.dyn_o
2104 CC utils/hp2ps/dist-install/build/Reorder.dyn_o
2105 CC utils/hp2ps/dist-install/build/TopTwenty.dyn_o
2106 CC utils/hp2ps/dist-install/build/AuxFile.dyn_o
2107 CC utils/hp2ps/dist-install/build/Deviation.dyn_o
2108 CC utils/hp2ps/dist-install/build/HpFile.dyn_o
2109 CC utils/hp2ps/dist-install/build/Marks.dyn_o
2110 CC utils/hp2ps/dist-install/build/Scale.dyn_o
2111 CC utils/hp2ps/dist-install/build/TraceElement.dyn_o
2112 CC utils/hp2ps/dist-install/build/Axes.dyn_o
2113 CC utils/hp2ps/dist-install/build/Dimensions.dyn_o
2114 CC utils/hp2ps/dist-install/build/Key.dyn_o
2115 CC utils/hp2ps/dist-install/build/PsFile.dyn_o
2116 CC utils/hp2ps/dist-install/build/Shade.dyn_o
2117 CC utils/hp2ps/dist-install/build/Utilities.dyn_o
2118 rts_dist_HC rts/dist/build/Adjustor.o
2119 rts_dist_HC rts/dist/build/Arena.o
2120 rts_dist_HC rts/dist/build/Capability.o
2121 rts_dist_HC rts/dist/build/CheckUnload.o
2122 rts_dist_HC rts/dist/build/ClosureFlags.o
2123 rts_dist_HC rts/dist/build/Disassembler.o
2124 rts_dist_HC rts/dist/build/FileLock.o
2125 rts_dist_HC rts/dist/build/Globals.o
2126 rts_dist_HC rts/dist/build/Hash.o
2127 rts_dist_HC rts/dist/build/Heap.o
2128 rts_dist_HC rts/dist/build/Hpc.o
2129 rts_dist_HC rts/dist/build/HsFFI.o
2130 rts_dist_HC rts/dist/build/Inlines.o
2131 rts_dist_HC rts/dist/build/Interpreter.o
2132 rts_dist_HC rts/dist/build/LdvProfile.o
2133 rts_dist_HC rts/dist/build/Libdw.o
2134 rts_dist_HC rts/dist/build/LibdwPool.o
2135 rts_dist_HC rts/dist/build/Linker.o
2136 rts_dist_HC rts/dist/build/Messages.o
2137 rts_dist_HC rts/dist/build/OldARMAtomic.o
2138 rts_dist_HC rts/dist/build/PathUtils.o
2139 rts_dist_HC rts/dist/build/Pool.o
2140 rts_dist_HC rts/dist/build/Printer.o
2141 rts_dist_HC rts/dist/build/ProfHeap.o
2142 rts_dist_HC rts/dist/build/ProfilerReport.o
2143 rts_dist_HC rts/dist/build/ProfilerReportJson.o
2144 rts_dist_HC rts/dist/build/Profiling.o
2145 rts_dist_HC rts/dist/build/Proftimer.o
2146 rts_dist_HC rts/dist/build/RaiseAsync.o
2147 rts_dist_HC rts/dist/build/RetainerProfile.o
2148 rts_dist_HC rts/dist/build/RetainerSet.o
2149 rts_dist_HC rts/dist/build/RtsAPI.o
2150 rts_dist_HC rts/dist/build/RtsDllMain.o
2151 rts_dist_HC rts/dist/build/RtsFlags.o
2152 rts_dist_HC rts/dist/build/RtsMain.o
2153 rts_dist_HC rts/dist/build/RtsMessages.o
2154 rts_dist_HC rts/dist/build/RtsStartup.o
2155 rts_dist_HC rts/dist/build/RtsSymbolInfo.o
2156 rts_dist_HC rts/dist/build/RtsSymbols.o
2157 rts_dist_HC rts/dist/build/RtsUtils.o
2158 rts_dist_HC rts/dist/build/STM.o
2159 rts_dist_HC rts/dist/build/Schedule.o
2160 rts_dist_HC rts/dist/build/Sparks.o
2161 rts_dist_HC rts/dist/build/StableName.o
2162 rts_dist_HC rts/dist/build/StablePtr.o
2163 rts_dist_HC rts/dist/build/StaticPtrTable.o
2164 rts_dist_HC rts/dist/build/Stats.o
2165 rts_dist_HC rts/dist/build/StgCRun.o
2166 rts_dist_HC rts/dist/build/StgPrimFloat.o
2167 rts_dist_HC rts/dist/build/Task.o
2168 rts_dist_HC rts/dist/build/ThreadLabels.o
2169 rts_dist_HC rts/dist/build/ThreadPaused.o
2170 rts_dist_HC rts/dist/build/Threads.o
2171 rts_dist_HC rts/dist/build/Ticky.o
2172 rts_dist_HC rts/dist/build/Timer.o
2173 rts_dist_HC rts/dist/build/TopHandler.o
2174 rts_dist_HC rts/dist/build/Trace.o
2175 rts_dist_HC rts/dist/build/WSDeque.o
2176 rts_dist_HC rts/dist/build/Weak.o
2177 rts_dist_HC rts/dist/build/fs.o
2178 rts_dist_HC rts/dist/build/xxhash.o
2179 rts_dist_HC rts/dist/build/Apply.o
2180 rts_dist_HC rts/dist/build/Compact.o
2181 rts_dist_HC rts/dist/build/Exception.o
2182 rts_dist_HC rts/dist/build/HeapStackCheck.o
2183 rts_dist_HC rts/dist/build/PrimOps.o
2184 rts_dist_HC rts/dist/build/StgMiscClosures.o
2185 rts_dist_HC rts/dist/build/StgStartup.o
2186 rts_dist_HC rts/dist/build/StgStdThunks.o
2187 rts_dist_HC rts/dist/build/Updates.o
2188 HC [stage 0] utils/genapply/dist/build/Main.o
2189 rts_dist_HC rts/dist/build/Adjustor.dyn_o
2190 rts_dist_HC rts/dist/build/Arena.dyn_o
2191 rts_dist_HC rts/dist/build/Capability.dyn_o
2192 rts_dist_HC rts/dist/build/CheckUnload.dyn_o
2193 rts_dist_HC rts/dist/build/ClosureFlags.dyn_o
2194 rts_dist_HC rts/dist/build/Disassembler.dyn_o
2195 rts_dist_HC rts/dist/build/FileLock.dyn_o
2196 rts_dist_HC rts/dist/build/Globals.dyn_o
2197 rts_dist_HC rts/dist/build/Hash.dyn_o
2198 rts_dist_HC rts/dist/build/Heap.dyn_o
2199 rts_dist_HC rts/dist/build/Hpc.dyn_o
2200 rts_dist_HC rts/dist/build/HsFFI.dyn_o
2201 rts_dist_HC rts/dist/build/Inlines.dyn_o
2202 rts_dist_HC rts/dist/build/Interpreter.dyn_o
2203 rts_dist_HC rts/dist/build/LdvProfile.dyn_o
2204 rts_dist_HC rts/dist/build/Libdw.dyn_o
2205 rts_dist_HC rts/dist/build/LibdwPool.dyn_o
2206 rts_dist_HC rts/dist/build/Linker.dyn_o
2207 rts_dist_HC rts/dist/build/Messages.dyn_o
2208 rts_dist_HC rts/dist/build/OldARMAtomic.dyn_o
2209 rts_dist_HC rts/dist/build/PathUtils.dyn_o
2210 rts_dist_HC rts/dist/build/Pool.dyn_o
2211 rts_dist_HC rts/dist/build/Printer.dyn_o
2212 rts_dist_HC rts/dist/build/ProfHeap.dyn_o
2213 rts_dist_HC rts/dist/build/ProfilerReport.dyn_o
2214 rts_dist_HC rts/dist/build/ProfilerReportJson.dyn_o
2215 rts_dist_HC rts/dist/build/Profiling.dyn_o
2216 rts_dist_HC rts/dist/build/Proftimer.dyn_o
2217 rts_dist_HC rts/dist/build/RaiseAsync.dyn_o
2218 rts_dist_HC rts/dist/build/RetainerProfile.dyn_o
2219 rts_dist_HC rts/dist/build/RetainerSet.dyn_o
2220 rts_dist_HC rts/dist/build/RtsAPI.dyn_o
2221 rts_dist_HC rts/dist/build/RtsDllMain.dyn_o
2222 rts_dist_HC rts/dist/build/RtsFlags.dyn_o
2223 rts_dist_HC rts/dist/build/RtsMain.dyn_o
2224 rts_dist_HC rts/dist/build/RtsMessages.dyn_o
2225 rts_dist_HC rts/dist/build/RtsStartup.dyn_o
2226 rts_dist_HC rts/dist/build/RtsSymbolInfo.dyn_o
2227 rts_dist_HC rts/dist/build/RtsSymbols.dyn_o
2228 rts_dist_HC rts/dist/build/RtsUtils.dyn_o
2229 rts_dist_HC rts/dist/build/STM.dyn_o
2230 rts_dist_HC rts/dist/build/Schedule.dyn_o
2231 rts_dist_HC rts/dist/build/Sparks.dyn_o
2232 rts_dist_HC rts/dist/build/StableName.dyn_o
2233 rts_dist_HC rts/dist/build/StablePtr.dyn_o
2234 rts_dist_HC rts/dist/build/StaticPtrTable.dyn_o
2235 rts_dist_HC rts/dist/build/Stats.dyn_o
2236 rts_dist_HC rts/dist/build/StgCRun.dyn_o
2237 rts_dist_HC rts/dist/build/StgPrimFloat.dyn_o
2238 rts_dist_HC rts/dist/build/Task.dyn_o
2239 rts_dist_HC rts/dist/build/ThreadLabels.dyn_o
2240 rts_dist_HC rts/dist/build/ThreadPaused.dyn_o
2241 rts_dist_HC rts/dist/build/Threads.dyn_o
2242 rts_dist_HC rts/dist/build/Ticky.dyn_o
2243 rts_dist_HC rts/dist/build/Timer.dyn_o
2244 rts_dist_HC rts/dist/build/TopHandler.dyn_o
2245 rts_dist_HC rts/dist/build/Trace.dyn_o
2246 rts_dist_HC rts/dist/build/WSDeque.dyn_o
2247 rts_dist_HC rts/dist/build/Weak.dyn_o
2248 rts_dist_HC rts/dist/build/fs.dyn_o
2249 rts_dist_HC rts/dist/build/xxhash.dyn_o
2250 rts_dist_HC rts/dist/build/hooks/FlagDefaults.dyn_o
2251 rts_dist_HC rts/dist/build/hooks/LongGCSync.dyn_o
2252 rts_dist_HC rts/dist/build/hooks/MallocFail.dyn_o
2253 rts_dist_HC rts/dist/build/hooks/OnExit.dyn_o
2254 rts_dist_HC rts/dist/build/hooks/OutOfHeap.dyn_o
2255 rts_dist_HC rts/dist/build/hooks/StackOverflow.dyn_o
2256 rts_dist_HC rts/dist/build/sm/BlockAlloc.dyn_o
2257 rts_dist_HC rts/dist/build/sm/CNF.dyn_o
2258 rts_dist_HC rts/dist/build/sm/Compact.dyn_o
2259 rts_dist_HC rts/dist/build/sm/Evac.dyn_o
2260 rts_dist_HC rts/dist/build/sm/Evac_thr.dyn_o
2261

Drydock: Prepare tree

When
Completed at Dec 10 2018, 1:34 PM · Built for 8 s
Status
Passed

Build Log 342045 (remote - stderr)
25 - 50 - 100 - Unlimited Lines

1+ git clean -qxfd
2+ git submodule sync
3+ git submodule update --init --recursive
4+ git submodule foreach -q git clean -qxfd
5

Build Log 342044 (remote - stdout)
25 - 50 - 100 - Unlimited Lines

1Synchronizing submodule url for '.arc-linters/arcanist-external-json-linter'
2Synchronizing submodule url for 'libffi-tarballs'
3Synchronizing submodule url for 'libraries/Cabal'
4Synchronizing submodule url for 'libraries/Win32'
5Synchronizing submodule url for 'libraries/array'
6Synchronizing submodule url for 'libraries/binary'
7Synchronizing submodule url for 'libraries/bytestring'
8Synchronizing submodule url for 'libraries/containers'
9Synchronizing submodule url for 'libraries/deepseq'
10Synchronizing submodule url for 'libraries/directory'
11Synchronizing submodule url for 'libraries/filepath'
12Synchronizing submodule url for 'libraries/haskeline'
13Synchronizing submodule url for 'libraries/hpc'
14Synchronizing submodule url for 'libraries/integer-gmp/gmp/gmp-tarballs'
15Synchronizing submodule url for 'libraries/mtl'
16Synchronizing submodule url for 'libraries/parallel'
17Synchronizing submodule url for 'libraries/parsec'
18Synchronizing submodule url for 'libraries/pretty'
19Synchronizing submodule url for 'libraries/process'
20Synchronizing submodule url for 'libraries/stm'
21Synchronizing submodule url for 'libraries/terminfo'
22Synchronizing submodule url for 'libraries/text'
23Synchronizing submodule url for 'libraries/time'
24Synchronizing submodule url for 'libraries/transformers'
25Synchronizing submodule url for 'libraries/unix'
26Synchronizing submodule url for 'libraries/xhtml'
27Synchronizing submodule url for 'nofib'
28Synchronizing submodule url for 'utils/haddock'
29Synchronizing submodule url for 'utils/hsc2hs'
30Submodule path 'libraries/Cabal': checked out '3da088e281f5cbc8a731e18ceb698cfea2e45004'
31Submodule path 'nofib': checked out 'a80baacfc29cc2e7ed50e94f3cd2648d11b1d7d5'
32

Lease Working Copy

When
Completed at Dec 10 2018, 1:34 PM · Built for 56 m, 48 s
Status
Passed
Description

Lease a working copy for OSX/amd64 builds.