Build 64518

Properties

Drydock: Build

When
Completed at Dec 10 2018, 2:29 PM · Built for 53 m
Status
Failed

Build Log 342051 (remote - stderr)
25 - 50 - 100 - Unlimited Lines

752CheckWeights
753 [ZCursor {zCursor :: a, zAbove :: S.Seq a, zBelow :: S.Seq a}]
754CheckWeights [Unsigned Integer, Signed Integer]
755CheckWeights
756 [LessOrEqual IntegerConstant, GreaterOrEqual IntegerConstant]
757WARNING: file compiler\\simplCore\\SimplCore.hs, line 680
758 Simplifier bailing out after 4 iterations [57, 2, 1, 1]
759 Size = {terms: 687, types: 903, coercions: 12, joins: 0/27}
760C:\msys64\var\drydock\workingcopy-121292\repo\glasgow-haskell-compiler\inplace\mingw\bin\ar.exe: creating libraries/binary/dist-install/build/libHSbinary-0.8.6.0.a
761C:\msys64\var\drydock\workingcopy-121292\repo\glasgow-haskell-compiler\inplace\mingw\bin\ar.exe: creating libraries/ghc-boot/dist-install/build/libHSghc-boot-8.7.a
762C:\msys64\var\drydock\workingcopy-121292\repo\glasgow-haskell-compiler\inplace\mingw\bin\ar.exe: creating libraries/haskeline/dist-install/build/libHShaskeline-0.7.4.3.a
763C:\msys64\var\drydock\workingcopy-121292\repo\glasgow-haskell-compiler\inplace\mingw\bin\ar.exe: creating libraries/parsec/dist-install/build/libHSparsec-3.1.13.0.a
764C:\msys64\var\drydock\workingcopy-121292\repo\glasgow-haskell-compiler\inplace\mingw\bin\ar.exe: creating libraries/text/dist-install/build/libHStext-1.2.3.1.a
765C:\msys64\var\drydock\workingcopy-121292\repo\glasgow-haskell-compiler\inplace\mingw\bin\ar.exe: creating libraries/ghci/dist-install/build/libHSghci-8.7.a
766C:\msys64\var\drydock\workingcopy-121292\repo\glasgow-haskell-compiler\inplace\mingw\bin\ar.exe: creating libraries/libiserv/dist-install/build/libHSlibiserv-8.7.1.a
767
768compiler\simplCore\HotCode.hs:5:1: error: [-Wunused-imports, -Werror=unused-imports]
769 The import of ‘defFreq’ from module ‘BasicTypes’ is redundant
770 |
7715 | import BasicTypes (defFreq, multiplyWeight)
772 | ^^^^^^^^^^^^^^^^^^^^^^^^^^^^^^^^^^^^^^^^^^^
773make[1]: *** [compiler/ghc.mk:445: compiler/stage2/build/HotCode.o] Error 1
774make[1]: *** Waiting for unfinished jobs....
775make: *** [Makefile:128: all] Error 2
776

Build Log 342050 (remote - stdout)
25 - 50 - 100 - Unlimited Lines

5952 HC [stage 1] compiler/stage2/build/PatSyn.o
5953 HC [stage 1] compiler/stage2/build/Literal.o
5954 HC [stage 1] compiler/stage2/build/HsLit.o
5955 HC [stage 1] compiler/stage2/build/Unify.o
5956 HC [stage 1] compiler/stage2/build/TrieMap.o
5957 HC [stage 1] compiler/stage2/build/Hoopl/Label.o
5958 HC [stage 1] compiler/stage2/build/Hoopl/Graph.o
5959 HC [stage 1] compiler/stage2/build/BlockId.o-boot
5960 HC [stage 1] compiler/stage2/build/CmmSwitch.o
5961 HC [stage 1] compiler/stage2/build/DataCon.o
5962 HC [stage 1] compiler/stage2/build/RepType.o
5963 HC [stage 1] compiler/stage2/build/Demand.o
5964 HC [stage 1] compiler/stage2/build/CoreSyn.o
5965 HC [stage 1] compiler/stage2/build/ConLike.o
5966 HC [stage 1] compiler/stage2/build/CoreMap.o
5967 HC [stage 1] compiler/stage2/build/IdInfo.o
5968 HC [stage 1] compiler/stage2/build/Id.o
5969 HC [stage 1] compiler/stage2/build/TysWiredIn.o
5970 HC [stage 1] compiler/stage2/build/CoreStats.o
5971 HC [stage 1] compiler/stage2/build/HsTypes.o
5972 HC [stage 1] compiler/stage2/build/InteractiveEvalTypes.o
5973 HC [stage 1] compiler/stage2/build/CoreSeq.o
5974 HC [stage 1] compiler/stage2/build/HotCode.o
5975 HC [stage 1] compiler/stage2/build/StgSubst.o
5976

Drydock: Prepare tree

When
Completed at Dec 10 2018, 1:36 PM · Built for 33 s
Status
Passed

Build Log 342049 (remote - stderr)
25 - 50 - 100 - Unlimited Lines

1+ git clean -qxfd
2+ git submodule foreach git checkout .
3+ git submodule foreach git clean -qxfd
4+ git submodule sync
5+ git submodule update --init --recursive
6+ git submodule foreach -q git clean -qxfd
7

Build Log 342048 (remote - stdout)
25 - 50 - 100 - Unlimited Lines

65Synchronizing submodule url for 'libraries/containers'
66Synchronizing submodule url for 'libraries/deepseq'
67Synchronizing submodule url for 'libraries/directory'
68Synchronizing submodule url for 'libraries/filepath'
69Synchronizing submodule url for 'libraries/haskeline'
70Synchronizing submodule url for 'libraries/hpc'
71Synchronizing submodule url for 'libraries/integer-gmp/gmp/gmp-tarballs'
72Synchronizing submodule url for 'libraries/mtl'
73Synchronizing submodule url for 'libraries/parallel'
74Synchronizing submodule url for 'libraries/parsec'
75Synchronizing submodule url for 'libraries/pretty'
76Synchronizing submodule url for 'libraries/process'
77Synchronizing submodule url for 'libraries/stm'
78Synchronizing submodule url for 'libraries/terminfo'
79Synchronizing submodule url for 'libraries/text'
80Synchronizing submodule url for 'libraries/time'
81Synchronizing submodule url for 'libraries/transformers'
82Synchronizing submodule url for 'libraries/unix'
83Synchronizing submodule url for 'libraries/xhtml'
84Synchronizing submodule url for 'nofib'
85Synchronizing submodule url for 'utils/haddock'
86Synchronizing submodule url for 'utils/hsc2hs'
87Submodule path 'libraries/Cabal': checked out '3da088e281f5cbc8a731e18ceb698cfea2e45004'
88Submodule path 'nofib': checked out 'a80baacfc29cc2e7ed50e94f3cd2648d11b1d7d5'
89

Lease Working Copy

When
Completed at Dec 10 2018, 1:36 PM · Built for 58 m, 54 s
Status
Passed