Build 64002

Properties

Drydock: Build

When
Completed at Nov 27 2018, 3:26 AM · Built for 7 m, 9 s
Status
Failed

Build Log 340286 (remote - stderr)
25 - 50 - 100 - Unlimited Lines

116 wrap the type with a newtype and declare the instance on the new type.
117 |
118103 | instance (Error e) => MonadPlus (Either e) where
119 | ^^^^^^^^^^^^^^^^^^^^^^^^^^^^^^^^^^^^^^^^^^^^^^^^...
120ar: creating libraries/ghc-boot-th/dist-boot/build/libHSghc-boot-th-8.7.a
121Warning: -rtsopts and -with-rtsopts have no effect with -no-hs-main.
122 Call hs_init_ghc() from your main() function to set these options.
123ar: creating libraries/terminfo/dist-boot/build/libHSterminfo-0.4.1.2.a
124ar: creating libraries/hpc/dist-boot/build/libHShpc-0.6.0.3.a
125ar: creating libraries/transformers/dist-boot/build/libHStransformers-0.5.5.0.a
126ar: creating libraries/ghc-heap/dist-boot/build/libHSghc-heap-8.7.a
127ar: creating libraries/mtl/dist-boot/build/libHSmtl-2.2.2.a
128ar: creating libraries/template-haskell/dist-boot/build/libHStemplate-haskell-2.15.0.0.a
129ar: creating libraries/binary/dist-boot/build/libHSbinary-0.8.6.0.a
130ar: creating libraries/ghc-boot/dist-boot/build/libHSghc-boot-8.7.a
131ar: creating libraries/ghci/dist-boot/build/libHSghci-8.7.a
132
133compiler/main/DynFlags.hs:2994:47: error: parse error on input ‘)’
134 |
1352994 | (NoArg $ addWarn "ignoring -split-objs"))
136 | ^
137make[1]: *** [compiler/stage1/build/DynFlags.o] Error 1
138make[1]: *** Waiting for unfinished jobs....
139make: *** [all] Error 2
140

Build Log 340285 (remote - stdout)
25 - 50 - 100 - Unlimited Lines

1072 HC [stage 0] compiler/stage1/build/RegAlloc/Graph/TrivColorable.o
1073 HC [stage 0] compiler/stage1/build/GraphPpr.o
1074 HC [stage 0] compiler/stage1/build/GraphOps.o
1075 HC [stage 0] compiler/stage1/build/RegAlloc/Graph/ArchX86.o
1076 HC [stage 0] compiler/stage1/build/GraphColor.o
1077 HC [stage 0] libraries/text/dist-boot/build/Data/Text/Internal/Lazy.o
1078 HC [stage 0] libraries/text/dist-boot/build/Data/Text/Internal/IO.o
1079 HC [stage 0] libraries/text/dist-boot/build/Data/Text/Read.o
1080 HC [stage 0] libraries/text/dist-boot/build/Data/Text/Internal/Lazy/Search.o
1081 HC [stage 0] libraries/text/dist-boot/build/Data/Text/Internal/Lazy/Fusion.o
1082 HC [stage 0] libraries/text/dist-boot/build/Data/Text/IO.o
1083 HC [stage 0] libraries/text/dist-boot/build/Data/Text/Lazy/Internal.o
1084 HC [stage 0] libraries/text/dist-boot/build/Data/Text/Lazy/Encoding.o
1085 HC [stage 0] compiler/stage1/build/DriverPhases.o
1086 HC [stage 0] compiler/stage1/build/Module.o
1087 HC [stage 0] compiler/stage1/build/CostCentreState.o
1088 HC [stage 0] compiler/stage1/build/BooleanFormula.o
1089 HC [stage 0] libraries/text/dist-boot/build/Data/Text/Lazy.o
1090 HC [stage 0] compiler/stage1/build/PrelNames.o-boot
1091 HC [stage 0] compiler/stage1/build/PackageConfig.o
1092 HC [stage 0] compiler/stage1/build/ForeignCall.o
1093 HC [stage 0] compiler/stage1/build/DynFlags.o
1094compiler/ghc.mk:437: recipe for target 'compiler/stage1/build/DynFlags.o' failed
1095Makefile:123: recipe for target 'all' failed
1096

Drydock: Prepare tree

When
Completed at Nov 27 2018, 3:19 AM · Built for 19 s
Status
Passed

Build Log 340284 (remote - stderr)
25 - 50 - 100 - Unlimited Lines

1+ git clean -qxfd
2+ git submodule sync
3+ git submodule update --init --recursive
4+ git submodule foreach -q git clean -qxfd
5

Build Log 340283 (remote - stdout)
25 - 50 - 100 - Unlimited Lines

10Synchronizing submodule url for 'libraries/filepath'
11Synchronizing submodule url for 'libraries/haskeline'
12Synchronizing submodule url for 'libraries/hpc'
13Synchronizing submodule url for 'libraries/integer-gmp/gmp/gmp-tarballs'
14Synchronizing submodule url for 'libraries/mtl'
15Synchronizing submodule url for 'libraries/parallel'
16Synchronizing submodule url for 'libraries/parsec'
17Synchronizing submodule url for 'libraries/pretty'
18Synchronizing submodule url for 'libraries/process'
19Synchronizing submodule url for 'libraries/stm'
20Synchronizing submodule url for 'libraries/terminfo'
21Synchronizing submodule url for 'libraries/text'
22Synchronizing submodule url for 'libraries/time'
23Synchronizing submodule url for 'libraries/transformers'
24Synchronizing submodule url for 'libraries/unix'
25Synchronizing submodule url for 'libraries/xhtml'
26Synchronizing submodule url for 'nofib'
27Synchronizing submodule url for 'utils/haddock'
28Synchronizing submodule url for 'utils/hsc2hs'
29Submodule path 'libraries/Cabal': checked out '3da088e281f5cbc8a731e18ceb698cfea2e45004'
30Submodule path 'libraries/bytestring': checked out '847563a2e5ce84714688429c4fee8df5c8568cb0'
31Submodule path 'libraries/containers': checked out '03dcb287c96613ceb1f64d5d5a82f7b94b879268'
32Submodule path 'libraries/text': checked out '69d625b9caa34fd8b384a4599ee98f5f53f20fbb'
33Submodule path 'utils/haddock': checked out '6414b46e1ac8b63cad20d662311788a80e3b29bb'
34

Build Working Copy

When
Completed at Nov 27 2018, 3:19 AM · Built for 9 h, 12 m
Status
Passed
Description

Lease a working copy for Linux/amd64 builds.