Build 64001

Properties

Drydock: Build

When
Completed at Nov 26 2018, 6:11 PM · Built for 3 m, 50 s
Status
Failed
Description

Run the build.

Build Log 340232 (remote - stderr)
25 - 50 - 100 - Unlimited Lines

153 move the instance declaration to the module of the class or of the type, or
154 wrap the type with a newtype and declare the instance on the new type.
155 |
15698 | instance (Error e) => Alternative (Either e) where
157 | ^^^^^^^^^^^^^^^^^^^^^^^^^^^^^^^^^^^^^^^^^^^^^^^^^^...
158
159libraries/transformers/Control/Monad/Trans/Error.hs:103:1: warning: [-Worphans]
160 Orphan instance: instance [safe] Error e => MonadPlus (Either e)
161 To avoid this
162 move the instance declaration to the module of the class or of the type, or
163 wrap the type with a newtype and declare the instance on the new type.
164 |
165103 | instance (Error e) => MonadPlus (Either e) where
166 | ^^^^^^^^^^^^^^^^^^^^^^^^^^^^^^^^^^^^^^^^^^^^^^^^...
167Warning: -rtsopts and -with-rtsopts have no effect with -no-hs-main.
168 Call hs_init_ghc() from your main() function to set these options.
169
170compiler/main/DynFlags.hs:2994:47: error: parse error on input ‘)’
171 |
1722994 | (NoArg $ addWarn "ignoring -split-objs"))
173 | ^
174make[1]: *** [compiler/stage1/build/DynFlags.o] Error 1
175make[1]: *** Waiting for unfinished jobs....
176make: *** [all] Error 2
177

Build Log 340231 (remote - stdout)
25 - 50 - 100 - Unlimited Lines

1067 HC [stage 0] compiler/stage1/build/GraphBase.o
1068 HC [stage 0] compiler/stage1/build/RegAlloc/Graph/ArchBase.o
1069 HC [stage 0] compiler/stage1/build/RegAlloc/Graph/TrivColorable.o
1070 HC [stage 0] compiler/stage1/build/GraphPpr.o
1071 HC [stage 0] compiler/stage1/build/GraphOps.o
1072 HC [stage 0] compiler/stage1/build/RegAlloc/Graph/ArchX86.o
1073 HC [stage 0] libraries/text/dist-boot/build/Data/Text/Internal/Lazy.o
1074 HC [stage 0] libraries/text/dist-boot/build/Data/Text/Internal/IO.o
1075 HC [stage 0] libraries/text/dist-boot/build/Data/Text/Read.o
1076 HC [stage 0] libraries/text/dist-boot/build/Data/Text/Internal/Lazy/Search.o
1077 HC [stage 0] libraries/text/dist-boot/build/Data/Text/Internal/Lazy/Fusion.o
1078 HC [stage 0] libraries/text/dist-boot/build/Data/Text/Lazy/Internal.o
1079 HC [stage 0] compiler/stage1/build/GraphColor.o
1080 HC [stage 0] libraries/text/dist-boot/build/Data/Text/Lazy/Encoding.o
1081 HC [stage 0] libraries/text/dist-boot/build/Data/Text/IO.o
1082 HC [stage 0] libraries/text/dist-boot/build/Data/Text/Lazy.o
1083 HC [stage 0] compiler/stage1/build/Module.o
1084 HC [stage 0] compiler/stage1/build/DriverPhases.o
1085 HC [stage 0] compiler/stage1/build/CostCentreState.o
1086 HC [stage 0] compiler/stage1/build/BooleanFormula.o
1087 HC [stage 0] compiler/stage1/build/PrelNames.o-boot
1088 HC [stage 0] compiler/stage1/build/PackageConfig.o
1089 HC [stage 0] compiler/stage1/build/ForeignCall.o
1090 HC [stage 0] compiler/stage1/build/DynFlags.o
1091

Drydock: Prepare tree

When
Completed at Nov 26 2018, 6:07 PM · Built for 7 s
Status
Passed

Build Log 340230 (remote - stderr)
25 - 50 - 100 - Unlimited Lines

1+ git clean -qxfd
2+ git submodule sync
3+ git submodule update --init --recursive
4+ git submodule foreach -q git clean -qxfd
5

Build Log 340229 (remote - stdout)
25 - 50 - 100 - Unlimited Lines

5Synchronizing submodule url for 'libraries/binary'
6Synchronizing submodule url for 'libraries/bytestring'
7Synchronizing submodule url for 'libraries/containers'
8Synchronizing submodule url for 'libraries/deepseq'
9Synchronizing submodule url for 'libraries/directory'
10Synchronizing submodule url for 'libraries/filepath'
11Synchronizing submodule url for 'libraries/haskeline'
12Synchronizing submodule url for 'libraries/hpc'
13Synchronizing submodule url for 'libraries/integer-gmp/gmp/gmp-tarballs'
14Synchronizing submodule url for 'libraries/mtl'
15Synchronizing submodule url for 'libraries/parallel'
16Synchronizing submodule url for 'libraries/parsec'
17Synchronizing submodule url for 'libraries/pretty'
18Synchronizing submodule url for 'libraries/process'
19Synchronizing submodule url for 'libraries/stm'
20Synchronizing submodule url for 'libraries/terminfo'
21Synchronizing submodule url for 'libraries/text'
22Synchronizing submodule url for 'libraries/time'
23Synchronizing submodule url for 'libraries/transformers'
24Synchronizing submodule url for 'libraries/unix'
25Synchronizing submodule url for 'libraries/xhtml'
26Synchronizing submodule url for 'nofib'
27Synchronizing submodule url for 'utils/haddock'
28Synchronizing submodule url for 'utils/hsc2hs'
29

Lease Working Copy

When
Completed at Nov 26 2018, 6:07 PM · Built for 8 s
Status
Passed
Description

Lease a working copy for OSX/amd64 builds.