Build 64000

Properties

Drydock: Build

When
Completed at Nov 26 2018, 6:30 PM · Built for 5 m, 53 s
Status
Failed

Build Log 340240 (remote - stderr)
25 - 50 - 100 - Unlimited Lines

144 move the instance declaration to the module of the class or of the type, or
145 wrap the type with a newtype and declare the instance on the new type.
146 |
147103 | instance (Error e) => MonadPlus (Either e) where
148 | ^^^^^^^^^^^^^^^^^^^^^^^^^^^^^^^^^^^^^^^^^^^^^^^^...
149C:\msys64\home\drydock\ghc-8.4.3-amd64\mingw\bin\ar.exe: creating libraries/ghc-boot-th/dist-boot/build/libHSghc-boot-th-8.7.a
150Warning: -rtsopts and -with-rtsopts have no effect with -no-hs-main.
151 Call hs_init_ghc() from your main() function to set these options.
152C:\msys64\home\drydock\ghc-8.4.3-amd64\mingw\bin\ar.exe: creating libraries/hpc/dist-boot/build/libHShpc-0.6.0.3.a
153C:\msys64\home\drydock\ghc-8.4.3-amd64\mingw\bin\ar.exe: creating libraries/transformers/dist-boot/build/libHStransformers-0.5.5.0.a
154C:\msys64\home\drydock\ghc-8.4.3-amd64\mingw\bin\ar.exe: creating libraries/ghc-heap/dist-boot/build/libHSghc-heap-8.7.a
155C:\msys64\home\drydock\ghc-8.4.3-amd64\mingw\bin\ar.exe: creating libraries/mtl/dist-boot/build/libHSmtl-2.2.2.a
156C:\msys64\home\drydock\ghc-8.4.3-amd64\mingw\bin\ar.exe: creating libraries/template-haskell/dist-boot/build/libHStemplate-haskell-2.15.0.0.a
157C:\msys64\home\drydock\ghc-8.4.3-amd64\mingw\bin\ar.exe: creating libraries/binary/dist-boot/build/libHSbinary-0.8.6.0.a
158C:\msys64\home\drydock\ghc-8.4.3-amd64\mingw\bin\ar.exe: creating libraries/ghc-boot/dist-boot/build/libHSghc-boot-8.7.a
159C:\msys64\home\drydock\ghc-8.4.3-amd64\mingw\bin\ar.exe: creating libraries/ghci/dist-boot/build/libHSghci-8.7.a
160
161compiler\main\DynFlags.hs:2994:47: error: parse error on input ‘)’
162 |
1632994 | (NoArg $ addWarn "ignoring -split-objs"))
164 | ^
165make[1]: *** [compiler/ghc.mk:437: compiler/stage1/build/DynFlags.o] Error 1
166make[1]: *** Waiting for unfinished jobs....
167make: *** [Makefile:126: all] Error 2
168

Build Log 340239 (remote - stdout)
25 - 50 - 100 - Unlimited Lines

1051 HC [stage 0] compiler/stage1/build/GraphBase.o
1052 HC [stage 0] compiler/stage1/build/RegAlloc/Graph/ArchBase.o
1053 HC [stage 0] compiler/stage1/build/RegAlloc/Graph/TrivColorable.o
1054 HC [stage 0] compiler/stage1/build/GraphPpr.o
1055 HC [stage 0] compiler/stage1/build/GraphOps.o
1056 HC [stage 0] compiler/stage1/build/RegAlloc/Graph/ArchX86.o
1057 HC [stage 0] compiler/stage1/build/GraphColor.o
1058 HC [stage 0] libraries/text/dist-boot/build/Data/Text/Internal/Lazy.o
1059 HC [stage 0] libraries/text/dist-boot/build/Data/Text/Internal/IO.o
1060 HC [stage 0] libraries/text/dist-boot/build/Data/Text/Read.o
1061 HC [stage 0] libraries/text/dist-boot/build/Data/Text/Internal/Lazy/Search.o
1062 HC [stage 0] libraries/text/dist-boot/build/Data/Text/Internal/Lazy/Fusion.o
1063 HC [stage 0] libraries/text/dist-boot/build/Data/Text/Lazy/Internal.o
1064 HC [stage 0] libraries/text/dist-boot/build/Data/Text/Lazy/Encoding.o
1065 HC [stage 0] libraries/text/dist-boot/build/Data/Text/IO.o
1066 HC [stage 0] compiler/stage1/build/Module.o
1067 HC [stage 0] compiler/stage1/build/DriverPhases.o
1068 HC [stage 0] compiler/stage1/build/CostCentreState.o
1069 HC [stage 0] compiler/stage1/build/BooleanFormula.o
1070 HC [stage 0] libraries/text/dist-boot/build/Data/Text/Lazy.o
1071 HC [stage 0] compiler/stage1/build/PrelNames.o-boot
1072 HC [stage 0] compiler/stage1/build/PackageConfig.o
1073 HC [stage 0] compiler/stage1/build/ForeignCall.o
1074 HC [stage 0] compiler/stage1/build/DynFlags.o
1075

Drydock: Prepare tree

When
Completed at Nov 26 2018, 6:25 PM · Built for 26 s
Status
Passed

Build Log 340238 (remote - stderr)
25 - 50 - 100 - Unlimited Lines

1+ git clean -qxfd
2+ git submodule foreach git checkout .
3+ git submodule foreach git clean -qxfd
4+ git submodule sync
5+ git submodule update --init --recursive
6+ git submodule foreach -q git clean -qxfd
7

Build Log 340237 (remote - stdout)
25 - 50 - 100 - Unlimited Lines

63Synchronizing submodule url for 'libraries/binary'
64Synchronizing submodule url for 'libraries/bytestring'
65Synchronizing submodule url for 'libraries/containers'
66Synchronizing submodule url for 'libraries/deepseq'
67Synchronizing submodule url for 'libraries/directory'
68Synchronizing submodule url for 'libraries/filepath'
69Synchronizing submodule url for 'libraries/haskeline'
70Synchronizing submodule url for 'libraries/hpc'
71Synchronizing submodule url for 'libraries/integer-gmp/gmp/gmp-tarballs'
72Synchronizing submodule url for 'libraries/mtl'
73Synchronizing submodule url for 'libraries/parallel'
74Synchronizing submodule url for 'libraries/parsec'
75Synchronizing submodule url for 'libraries/pretty'
76Synchronizing submodule url for 'libraries/process'
77Synchronizing submodule url for 'libraries/stm'
78Synchronizing submodule url for 'libraries/terminfo'
79Synchronizing submodule url for 'libraries/text'
80Synchronizing submodule url for 'libraries/time'
81Synchronizing submodule url for 'libraries/transformers'
82Synchronizing submodule url for 'libraries/unix'
83Synchronizing submodule url for 'libraries/xhtml'
84Synchronizing submodule url for 'nofib'
85Synchronizing submodule url for 'utils/haddock'
86Synchronizing submodule url for 'utils/hsc2hs'
87

Lease Working Copy

When
Completed at Nov 26 2018, 6:24 PM · Built for 17 m, 38 s
Status
Passed