Build 63966

Properties

Drydock: Build

When
Completed at Nov 26 2018, 12:41 PM · Built for 1 h, 14 m
Status
Failed

Build Log 340182 (remote - stderr)
25 - 50 - 100 - Unlimited Lines

548 Call hs_init_ghc() from your main() function to set these options.
549ar: creating libraries/parsec/dist-install/build/libHSparsec-3.1.13.0.a
550ar: creating libraries/text/dist-install/build/libHStext-1.2.3.1.a
551Warning: -rtsopts and -with-rtsopts have no effect with -shared.
552 Call hs_init_ghc() from your main() function to set these options.
553ar: creating libraries/ghci/dist-install/build/libHSghci-8.7.a
554Warning: -rtsopts and -with-rtsopts have no effect with -shared.
555 Call hs_init_ghc() from your main() function to set these options.
556Warning: -rtsopts and -with-rtsopts have no effect with -shared.
557 Call hs_init_ghc() from your main() function to set these options.
558ar: creating libraries/libiserv/dist-install/build/libHSlibiserv-8.7.1.a
559Warning: -rtsopts and -with-rtsopts have no effect with -shared.
560 Call hs_init_ghc() from your main() function to set these options.
561
562compiler/llvmGen/LlvmCodeGen/Base.hs:63:1: error: [-Wunused-imports, -Werror=unused-imports]
563 The import of ‘Data.Maybe’ is redundant
564 except perhaps to import instances from ‘Data.Maybe’
565 To import instances alone, use: import Data.Maybe()
566 |
56763 | import Data.Maybe (mapMaybe)
568 | ^^^^^^^^^^^^^^^^^^^^^^^^^^^^
569make[1]: *** [compiler/stage2/build/LlvmCodeGen/Base.o] Error 1
570make[1]: *** Waiting for unfinished jobs....
571make: *** [all] Error 2
572

Build Log 340181 (remote - stdout)
25 - 50 - 100 - Unlimited Lines

4960 HC [stage 1] compiler/stage2/build/PPC/CodeGen.o
4961 HC [stage 1] compiler/stage2/build/SPARC/CodeGen/Expand.o
4962 HC [stage 1] compiler/stage2/build/SPARC/CodeGen/Gen32.o-boot
4963 HC [stage 1] compiler/stage2/build/SPARC/CodeGen/Sanity.o
4964 HC [stage 1] compiler/stage2/build/X86/CodeGen.o
4965 HC [stage 1] compiler/stage2/build/StgCmmBind.o-boot
4966 HC [stage 1] compiler/stage2/build/StgCmmExtCode.o
4967 HC [stage 1] libraries/Cabal/Cabal/dist-install/build/Distribution/Types/PackageName.o
4968 HC [stage 1] libraries/Cabal/Cabal/dist-install/build/Distribution/Types/LegacyExeDependency.o
4969 HC [stage 1] libraries/Cabal/Cabal/dist-install/build/Distribution/PrettyUtils.o
4970 HC [stage 1] compiler/stage2/build/LlvmCodeGen/Regs.o
4971 HC [stage 1] compiler/stage2/build/StgCmmTicky.o
4972 HC [stage 1] compiler/stage2/build/StgCmmEnv.o
4973 HC [stage 1] compiler/stage2/build/RegAlloc/Linear/JoinToTargets.o
4974 HC [stage 1] compiler/stage2/build/SPARC/CodeGen/Amode.o
4975 HC [stage 1] compiler/stage2/build/SPARC/CodeGen/CondCode.o
4976 HC [stage 1] compiler/stage2/build/StgCmmProf.o
4977 HC [stage 1] libraries/Cabal/Cabal/dist-install/build/Distribution/Types/PackageId.o
4978 HC [stage 1] libraries/Cabal/Cabal/dist-install/build/Distribution/Types/UnqualComponentName.o
4979 HC [stage 1] libraries/Cabal/Cabal/dist-install/build/Distribution/Types/Mixin.o
4980 HC [stage 1] libraries/Cabal/Cabal/dist-install/build/Distribution/Types/ModuleReexport.o
4981 HC [stage 1] compiler/stage2/build/LlvmCodeGen/Base.o
4982compiler/ghc.mk:445: recipe for target 'compiler/stage2/build/LlvmCodeGen/Base.o' failed
4983Makefile:123: recipe for target 'all' failed
4984

Drydock: Prepare tree

When
Completed at Nov 26 2018, 11:26 AM · Built for 19 s
Status
Passed

Build Log 340180 (remote - stderr)
25 - 50 - 100 - Unlimited Lines

1+ git clean -qxfd
2+ git submodule sync
3+ git submodule update --init --recursive
4+ git submodule foreach -q git clean -qxfd
5

Build Log 340179 (remote - stdout)
25 - 50 - 100 - Unlimited Lines

7Synchronizing submodule url for 'libraries/containers'
8Synchronizing submodule url for 'libraries/deepseq'
9Synchronizing submodule url for 'libraries/directory'
10Synchronizing submodule url for 'libraries/filepath'
11Synchronizing submodule url for 'libraries/haskeline'
12Synchronizing submodule url for 'libraries/hpc'
13Synchronizing submodule url for 'libraries/integer-gmp/gmp/gmp-tarballs'
14Synchronizing submodule url for 'libraries/mtl'
15Synchronizing submodule url for 'libraries/parallel'
16Synchronizing submodule url for 'libraries/parsec'
17Synchronizing submodule url for 'libraries/pretty'
18Synchronizing submodule url for 'libraries/process'
19Synchronizing submodule url for 'libraries/stm'
20Synchronizing submodule url for 'libraries/terminfo'
21Synchronizing submodule url for 'libraries/text'
22Synchronizing submodule url for 'libraries/time'
23Synchronizing submodule url for 'libraries/transformers'
24Synchronizing submodule url for 'libraries/unix'
25Synchronizing submodule url for 'libraries/xhtml'
26Synchronizing submodule url for 'nofib'
27Synchronizing submodule url for 'utils/haddock'
28Synchronizing submodule url for 'utils/hsc2hs'
29Submodule path 'libraries/binary': checked out 'aa9fd16beef8c0025e2964d26d4b54bf04e071c9'
30Submodule path 'utils/haddock': checked out 'f3455051b59c99d26e0cf040be45f5916463ae55'
31

Build Working Copy

When
Completed at Nov 26 2018, 11:25 AM · Built for 6 h, 58 m
Status
Passed
Description

Lease a working copy for Linux/amd64 builds.