Build 63964

Properties

Drydock: Build

When
Completed at Nov 26 2018, 7:10 AM · Built for 56 m, 36 s
Status
Failed

Build Log 340122 (remote - stderr)
25 - 50 - 100 - Unlimited Lines

579 Size = {terms: 1,969, types: 2,087, coercions: 8, joins: 2/14}
580C:\msys64\var\drydock\workingcopy-121292\repo\glasgow-haskell-compiler\inplace\mingw\bin\ar.exe: creating libraries/directory/dist-install/build/libHSdirectory-1.3.3.1.a
581C:\msys64\var\drydock\workingcopy-121292\repo\glasgow-haskell-compiler\inplace\mingw\bin\ar.exe: creating libraries/process/dist-install/build/libHSprocess-1.6.3.0.a
582WARNING: file compiler\\simplCore\\SimplCore.hs, line 678
583 Simplifier bailing out after 4 iterations [57, 2, 1, 1]
584 Size = {terms: 687, types: 903, coercions: 12, joins: 0/27}
585C:\msys64\var\drydock\workingcopy-121292\repo\glasgow-haskell-compiler\inplace\mingw\bin\ar.exe: creating libraries/binary/dist-install/build/libHSbinary-0.8.6.0.a
586C:\msys64\var\drydock\workingcopy-121292\repo\glasgow-haskell-compiler\inplace\mingw\bin\ar.exe: creating libraries/ghc-boot/dist-install/build/libHSghc-boot-8.7.a
587C:\msys64\var\drydock\workingcopy-121292\repo\glasgow-haskell-compiler\inplace\mingw\bin\ar.exe: creating libraries/haskeline/dist-install/build/libHShaskeline-0.7.4.3.a
588C:\msys64\var\drydock\workingcopy-121292\repo\glasgow-haskell-compiler\inplace\mingw\bin\ar.exe: creating libraries/parsec/dist-install/build/libHSparsec-3.1.13.0.a
589C:\msys64\var\drydock\workingcopy-121292\repo\glasgow-haskell-compiler\inplace\mingw\bin\ar.exe: creating libraries/text/dist-install/build/libHStext-1.2.3.1.a
590C:\msys64\var\drydock\workingcopy-121292\repo\glasgow-haskell-compiler\inplace\mingw\bin\ar.exe: creating libraries/ghci/dist-install/build/libHSghci-8.7.a
591C:\msys64\var\drydock\workingcopy-121292\repo\glasgow-haskell-compiler\inplace\mingw\bin\ar.exe: creating libraries/libiserv/dist-install/build/libHSlibiserv-8.7.1.a
592
593compiler\llvmGen\LlvmCodeGen\Base.hs:63:1: error: [-Wunused-imports, -Werror=unused-imports]
594 The import of ‘Data.Maybe’ is redundant
595 except perhaps to import instances from ‘Data.Maybe’
596 To import instances alone, use: import Data.Maybe()
597 |
59863 | import Data.Maybe (mapMaybe)
599 | ^^^^^^^^^^^^^^^^^^^^^^^^^^^^
600make[1]: *** [compiler/ghc.mk:445: compiler/stage2/build/LlvmCodeGen/Base.o] Error 1
601make[1]: *** Waiting for unfinished jobs....
602make: *** [Makefile:128: all] Error 2
603

Build Log 340121 (remote - stdout)
25 - 50 - 100 - Unlimited Lines

6082 HC [stage 1] compiler/stage2/build/StgCmmUtils.o
6083 HC [stage 1] compiler/stage2/build/RegAlloc/Graph/Main.o
6084 HC [stage 1] compiler/stage2/build/RegAlloc/Linear/State.o
6085 HC [stage 1] compiler/stage2/build/PPC/CodeGen.o
6086 HC [stage 1] compiler/stage2/build/SPARC/CodeGen/Expand.o
6087 HC [stage 1] compiler/stage2/build/SPARC/CodeGen/Gen32.o-boot
6088 HC [stage 1] compiler/stage2/build/SPARC/CodeGen/Sanity.o
6089 HC [stage 1] compiler/stage2/build/X86/CodeGen.o
6090 HC [stage 1] compiler/stage2/build/StgCmmBind.o-boot
6091 HC [stage 1] compiler/stage2/build/StgCmmExtCode.o
6092 HC [stage 1] libraries/Cabal/Cabal/dist-install/build/Distribution/ParseUtils.o
6093 HC [stage 1] compiler/stage2/build/LlvmCodeGen/Regs.o
6094 HC [stage 1] compiler/stage2/build/StgCmmTicky.o
6095 HC [stage 1] compiler/stage2/build/StgCmmEnv.o
6096 HC [stage 1] compiler/stage2/build/RegAlloc/Linear/JoinToTargets.o
6097 HC [stage 1] compiler/stage2/build/SPARC/CodeGen/Amode.o
6098 HC [stage 1] compiler/stage2/build/SPARC/CodeGen/CondCode.o
6099 HC [stage 1] compiler/stage2/build/StgCmmProf.o
6100 HC [stage 1] libraries/Cabal/Cabal/dist-install/build/Distribution/Types/PackageName.o
6101 HC [stage 1] libraries/Cabal/Cabal/dist-install/build/Distribution/Types/LegacyExeDependency.o
6102 HC [stage 1] libraries/Cabal/Cabal/dist-install/build/Distribution/PrettyUtils.o
6103 HC [stage 1] compiler/stage2/build/LlvmCodeGen/Base.o
6104 HC [stage 1] compiler/stage2/build/StgCmmLayout.o
6105 HC [stage 1] compiler/stage2/build/RegAlloc/Linear/Main.o
6106

Drydock: Prepare tree

When
Completed at Nov 26 2018, 6:13 AM · Built for 59 s
Status
Passed

Build Log 340120 (remote - stderr)
25 - 50 - 100 - Unlimited Lines

1+ git clean -qxfd
2+ git submodule foreach git checkout .
3+ git submodule foreach git clean -qxfd
4+ git submodule sync
5+ git submodule update --init --recursive
6+ git submodule foreach -q git clean -qxfd
7

Build Log 340119 (remote - stdout)
25 - 50 - 100 - Unlimited Lines

65Synchronizing submodule url for 'libraries/containers'
66Synchronizing submodule url for 'libraries/deepseq'
67Synchronizing submodule url for 'libraries/directory'
68Synchronizing submodule url for 'libraries/filepath'
69Synchronizing submodule url for 'libraries/haskeline'
70Synchronizing submodule url for 'libraries/hpc'
71Synchronizing submodule url for 'libraries/integer-gmp/gmp/gmp-tarballs'
72Synchronizing submodule url for 'libraries/mtl'
73Synchronizing submodule url for 'libraries/parallel'
74Synchronizing submodule url for 'libraries/parsec'
75Synchronizing submodule url for 'libraries/pretty'
76Synchronizing submodule url for 'libraries/process'
77Synchronizing submodule url for 'libraries/stm'
78Synchronizing submodule url for 'libraries/terminfo'
79Synchronizing submodule url for 'libraries/text'
80Synchronizing submodule url for 'libraries/time'
81Synchronizing submodule url for 'libraries/transformers'
82Synchronizing submodule url for 'libraries/unix'
83Synchronizing submodule url for 'libraries/xhtml'
84Synchronizing submodule url for 'nofib'
85Synchronizing submodule url for 'utils/haddock'
86Synchronizing submodule url for 'utils/hsc2hs'
87Submodule path 'libraries/binary': checked out 'aa9fd16beef8c0025e2964d26d4b54bf04e071c9'
88Submodule path 'utils/haddock': checked out 'f3455051b59c99d26e0cf040be45f5916463ae55'
89

Lease Working Copy

When
Completed at Nov 26 2018, 6:13 AM · Built for 1 h, 45 m
Status
Passed