Build 5910

Properties

Run GHC Validate Build

When
Completed at Sep 4 2015, 4:11 AM · Built for 12 m, 31 s
Status
Failed
Description

Run GHC ./validate build.

Build Log 116769 (remote - stderr)
25 - 50 - 100 - Unlimited Lines

977In file included from includes/Rts.h:241:0: error:
978 0,
979 from rts/Globals.c:21:
980includes/rts/Libdw.h: In function ‘backtrace_free’:
981
982includes/rts/Libdw.h:44:46: error:
983 error: unused parameter ‘bt’ [-Werror=unused-parameter]
984 INLINE_HEADER void backtrace_free(Backtrace *bt) { }
985 ^
986cc1: all warnings being treated as errors
987
988In file included from includes/Rts.h:241:0: error:
989 0,
990 from rts/CheckUnload.c:12:
991includes/rts/Libdw.h: In function ‘backtrace_free’:
992
993includes/rts/Libdw.h:44:46: error:
994 error: unused parameter ‘bt’ [-Werror=unused-parameter]
995 INLINE_HEADER void backtrace_free(Backtrace *bt) { }
996 ^
997cc1: all warnings being treated as errors
998make[1]: *** [rts/dist/build/Globals.o] Error 1
999make[1]: *** [rts/dist/build/CheckUnload.o] Error 1
1000make: *** [all] Error 2
1001

Build Log 116768 (remote - stdout)
25 - 50 - 100 - Unlimited Lines

1Now building B5910: patch rGHC/D1196:4056
2 - Base directory: /srv/builds/patches/rGHC/B5910-D1196-4056
3 - Cloning repository............... OK (took about 60.029072965 seconds)
4 - Updating HEAD and grabbing submodules.... OK (took about 5.008208365 seconds)
5 - Applying diff 4056 via Arcanist... OK (took about 39.686354258 seconds)
6
7OK, starting build on Fri Sep 4 08:56:59 UTC 2015
8 - Using 8 CPUs on Linux phab-ghc07 3.13.0-33-generic #58-Ubuntu SMP Tue Jul 29 16:45:05 UTC 2014 x86_64 x86_64 x86_64 GNU/Linux
9 - Running validate...................................ERROR: validate failed!
10 - LZMA compressing full build logs.... OK (took about 5.010893340 seconds)
11

Lease GHC Build Machine

When
Completed at Sep 4 2015, 3:59 AM · Built instantly
Status
Passed
Description

Lease a build machine to perform a GHC build.