Build 54774

Properties

Drydock: Testsuite

When
Completed at Oct 18 2018, 5:42 AM · Built for 48 m, 42 s
Status
Passed

Build Log 306766 (remote - stderr)
25 - 50 - 100 - Unlimited Lines

1using THREADS=5
2Warning: include-dirs: C:\msys64\var\drydock\workingcopy-121280\repo\glasgow-haskell-compiler\compiler\stage2\build\utils doesn't exist or isn't a directory
3Warning: include-dirs: C:\msys64\var\drydock\workingcopy-121280\repo\glasgow-haskell-compiler\compiler\stage2\build\../rts/dist/build doesn't exist or isn't a directory
4Warning: include-dirs: C:\msys64\var\drydock\workingcopy-121280\repo\glasgow-haskell-compiler\compiler\stage2\build\stage2 doesn't exist or isn't a directory
5Warning: include-dirs: C:\msys64\var\drydock\workingcopy-121280\repo\glasgow-haskell-compiler\libraries\haskeline\dist-install\build\includes doesn't exist or isn't a directory
6Warning: include-dirs: C:\msys64\var\drydock\workingcopy-121280\repo\glasgow-haskell-compiler\libraries\text\dist-install\build\include doesn't exist or isn't a directory
7Warning: include-dirs: C:\msys64\var\drydock\workingcopy-121280\repo\glasgow-haskell-compiler\libraries\Win32\dist-install\build\include doesn't exist or isn't a directory
8Warning: include-dirs: C:\msys64\var\drydock\workingcopy-121280\repo\glasgow-haskell-compiler\libraries\containers\dist-install\build\include doesn't exist or isn't a directory
9Warning: include-dirs: C:\msys64\var\drydock\workingcopy-121280\repo\glasgow-haskell-compiler\libraries\bytestring\dist-install\build\include doesn't exist or isn't a directory
10

Build Log 306765 (remote - stdout)
25 - 50 - 100 - Unlimited Lines

305collect2.exe: error: ld returned 1 exit status
306`gcc.exe' failed in phase `Linker'. (Exit code: 1)
307make[2]: *** [Makefile:197: KeepCafsFail] Error 1
308make[1]: *** [Makefile:202: KeepCafs] Error 2
309*** unexpected failure for keep-cafs(normal)
310Wrong exit code for keep-cafs-fail()(expected 0 , actual 2 )
311Stderr ( keep-cafs-fail ):
312C://msys64//var//drydock//workingcopy-121280//repo//glasgow-haskell-compiler//bindisttest//install dir//mingw//bin/ld.exe: Error: export ordinal too large: 95839
313collect2.exe: error: ld returned 1 exit status
314`gcc.exe' failed in phase `Linker'. (Exit code: 1)
315make[1]: *** [Makefile:197: KeepCafsFail] Error 1
316*** unexpected failure for keep-cafs-fail(normal)
317Timeout happened...killed process "cd "/tmp/ghctest-625q45yf/test spaces/rts/T10672/T10672_x64.run" && $MAKE -s --no-print-directory T10672_x64 "...
318
319Wrong exit code for T10672_x64()(expected 0 , actual 99 )
320*** unexpected failure for T10672_x64(normal)
321
322Unexpected results from:
323TEST="FloatFnInverses MultiLayerModules T10018 T10672_x64 T10955 T10955dyn T12234 T12425 T12971 T15729 T5611 T5975a T5975b T7040_ghci T7117 T9293 ghci024 ghci057 haddock.base haddock.compiler keep-cafs keep-cafs-fail"
324
325make: *** [../mk/test.mk:332: test] Error 1
326Timeout is 300
327Found 1 .T files...
328Beginning test run at Thu Oct 18 10:42:41 2018 CUT
329
330
331==== STAGE 1 TESTS ====
332
333SUMMARY for test run started at Thu Oct 18 10:42:41 2018 CUT
334 0:00:02 spent to go through
335 2 total tests, which gave rise to
336 6 test cases, of which
337 4 were skipped
338
339 0 had missing libraries
340 2 expected passes
341 0 expected failures
342
343 0 caused framework failures
344 0 caused framework warnings
345 0 unexpected passes
346 0 unexpected failures
347 0 unexpected stat failures
348
349==== STAGE 2 TESTS ====
350
351Unexpected results from:
352TEST="FloatFnInverses MultiLayerModules T10018 T10672_x64 T10955 T10955dyn T12234 T12425 T12971 T15729 T5611 T5975a T5975b T7040_ghci T7117 T9293 ghci024 ghci057 haddock.base haddock.compiler keep-cafs keep-cafs-fail"
353
354SUMMARY for test run started at Thu Oct 18 09:54:27 2018 CUT
355 0:48:11 spent to go through
356 6582 total tests, which gave rise to
357 19015 test cases, of which
358 12023 were skipped
359
360 43 had missing libraries
361 6753 expected passes
362 174 expected failures
363
364 3 caused framework failures
365 1 caused framework warnings
366 0 unexpected passes
367 17 unexpected failures
368 5 unexpected stat failures
369
370Unexpected failures:
371 /tmp/ghctest-625q45yf/test spaces/concurrent/should_run/T5611.run T5611 [bad stderr] (normal)
372 /tmp/ghctest-625q45yf/test spaces/driver/T12971.run T12971 [bad exit code] (normal)
373 /tmp/ghctest-625q45yf/test spaces/ghci/linking/T15729.run T15729 [bad exit code] (normal)
374 /tmp/ghctest-625q45yf/test spaces/ghci/linking/dyn/T10955dyn.run T10955dyn [bad exit code] (normal)
375 /tmp/ghctest-625q45yf/test spaces/ghci/linking/dyn/T10955.run T10955 [bad stderr] (ghci)
376 /tmp/ghctest-625q45yf/test spaces/ghci/scripts/ghci024.run ghci024 [bad stdout] (normal)
377 /tmp/ghctest-625q45yf/test spaces/ghci/scripts/ghci057.run ghci057 [bad stdout] (ghci)
378 /tmp/ghctest-625q45yf/test spaces/ghci/scripts/T5975b.run T5975b [bad exit code] (ghci)
379 /tmp/ghctest-625q45yf/test spaces/ghci/scripts/T5975a.run T5975a [bad stderr] (ghci)
380 /tmp/ghctest-625q45yf/test spaces/ghci/scripts/T9293.run T9293 [bad stdout] (ghci)
381 /tmp/ghctest-625q45yf/test spaces/numeric/should_run/FloatFnInverses.run FloatFnInverses [bad stdout] (normal)
382 /tmp/ghctest-625q45yf/test spaces/ghci/scripts/T7117.run T7117 [bad exit code] (ghci)
383 /tmp/ghctest-625q45yf/test spaces/ghci/scripts/T10018.run T10018 [bad exit code] (ghci)
384 /tmp/ghctest-625q45yf/test spaces/rts/T7040_ghci.run T7040_ghci [bad stdout] (ghci)
385 /tmp/ghctest-625q45yf/test spaces/rts/keep-cafs.run keep-cafs [bad exit code] (normal)
386 /tmp/ghctest-625q45yf/test spaces/rts/keep-cafs-fail.run keep-cafs-fail [bad exit code] (normal)
387 /tmp/ghctest-625q45yf/test spaces/rts/T10672/T10672_x64.run T10672_x64 [bad exit code] (normal)
388
389Unexpected stat failures:
390 /tmp/ghctest-625q45yf/test spaces/perf/compiler/T12425.run T12425 [stat not good enough] (optasm)
391 /tmp/ghctest-625q45yf/test spaces/perf/compiler/T12234.run T12234 [stat not good enough] (optasm)
392 /tmp/ghctest-625q45yf/test spaces/perf/haddock/haddock.base.run haddock.base [stat not good enough] (normal)
393 /tmp/ghctest-625q45yf/test spaces/perf/haddock/haddock.compiler.run haddock.compiler [stat not good enough] (normal)
394 /tmp/ghctest-625q45yf/test spaces/perf/compiler/MultiLayerModules.run MultiLayerModules [stat not good enough] (normal)
395
396Framework failures:
397 /tmp/ghctest-625q45yf/test spaces/ghci/linking/dyn/T10955.run T10955 [ghci] (pre_cmd failed: 2)
398 /tmp/ghctest-625q45yf/test spaces/ghci/scripts/T5975a.run T5975a [ghci] (pre_cmd failed: 127)
399 /tmp/ghctest-625q45yf/test spaces/ghci/scripts/T5975b.run T5975b [ghci] (pre_cmd failed: 127)
400
401Framework warnings:
402 . T13701 [numfield-no-expected] (No expected value found for bytes allocated in num_field check)
403
404

Drydock: Build

When
Completed at Oct 18 2018, 4:54 AM · Built for 1 h, 21 m
Status
Passed

Build Log 306753 (remote - stderr)
25 - 50 - 100 - Unlimited Lines

625 Distribution.Types.ModuleRenaming,
626 Distribution.Types.MungedPackageId,
627 Distribution.Types.MungedPackageName,
628 Distribution.Types.PackageDescription,
629 Distribution.Types.PackageId, Distribution.Types.PackageName,
630 Distribution.Types.PkgconfigDependency,
631 Distribution.Types.PkgconfigName,
632 Distribution.Types.SetupBuildInfo, Distribution.Types.SourceRepo,
633 Distribution.Types.TargetInfo, Distribution.Types.TestSuite,
634 Distribution.Types.TestSuiteInterface, Distribution.Types.TestType,
635 Distribution.Types.UnitId, Distribution.Types.UnqualComponentName,
636 Distribution.Types.Version, Distribution.Types.VersionRange,
637 Distribution.Utils.ShortText, Distribution.Verbosity,
638 Language.Haskell.Extension, Control.Applicative, Data.Complex,
639 Data.Functor.Compose, Data.Functor.Const, Data.Functor.Identity,
640 Data.Functor.Product, Data.Functor.Sum, Data.Monoid,
641 Data.Semigroup, Data.Semigroup.Internal, Data.Version, Data.Void,
642 GHC.Exts, GHC.Generics, GHC.IO.Exception, Data.Graph,
643 Data.IntMap.Internal, Data.IntSet.Internal, Data.Map.Internal,
644 Data.Sequence.Internal, Data.Set.Internal, Data.Tree,
645 Text.PrettyPrint.Annotated.HughesPJ, Text.PrettyPrint.HughesPJ,
646 Data.Text, Data.Text.Lazy]
647WARNING: file compiler\\utils\\ListSetOps.hs, line 58
648 [Distribution.Backpack, Distribution.Backpack.FullUnitId,
649 Distribution.Backpack.ModuleShape,
650 Distribution.Backpack.PreModuleShape,
651 Distribution.Backpack.ReadyComponent,
652 Distribution.CabalSpecVersion, Distribution.Compat.Graph,
653 Distribution.Compat.Semigroup, Distribution.Compiler,
654 Distribution.License, Distribution.ModuleName,
655 Distribution.Parsec.Common, Distribution.SPDX.License,
656 Distribution.SPDX.LicenseExceptionId,
657 Distribution.SPDX.LicenseExpression, Distribution.SPDX.LicenseId,
658 Distribution.SPDX.LicenseReference,
659 Distribution.Simple.BuildTarget, Distribution.Simple.Compiler,
660 Distribution.Simple.Doctest, Distribution.Simple.Flag,
661 Distribution.Simple.Haddock, Distribution.Simple.InstallDirs,
662 Distribution.Simple.PackageIndex, Distribution.Simple.Program.Find,
663 Distribution.Simple.Program.GHC, Distribution.Simple.Program.Types,
664 Distribution.Simple.Setup, Distribution.System,
665 Distribution.Types.AbiDependency, Distribution.Types.AbiHash,
666 Distribution.Types.Benchmark,
667 Distribution.Types.BenchmarkInterface,
668 Distribution.Types.BenchmarkType, Distribution.Types.BuildInfo,
669 Distribution.Types.BuildType, Distribution.Types.ComponentId,
670 Distribution.Types.ComponentLocalBuildInfo,
671 Distribution.Types.ComponentName,
672 Distribution.Types.ComponentRequestedSpec,
673 Distribution.Types.CondTree, Distribution.Types.Condition,
674 Distribution.Types.Dependency, Distribution.Types.ExeDependency,
675 Distribution.Types.Executable, Distribution.Types.ExecutableScope,
676 Distribution.Types.ExposedModule, Distribution.Types.ForeignLib,
677 Distribution.Types.ForeignLibOption,
678 Distribution.Types.ForeignLibType,
679 Distribution.Types.GenericPackageDescription,
680 Distribution.Types.IncludeRenaming,
681 Distribution.Types.InstalledPackageInfo,
682 Distribution.Types.LegacyExeDependency, Distribution.Types.Library,
683 Distribution.Types.LocalBuildInfo, Distribution.Types.Mixin,
684 Distribution.Types.Module, Distribution.Types.ModuleReexport,
685 Distribution.Types.ModuleRenaming,
686 Distribution.Types.MungedPackageId,
687 Distribution.Types.MungedPackageName,
688 Distribution.Types.PackageDescription,
689 Distribution.Types.PackageId, Distribution.Types.PackageName,
690 Distribution.Types.PkgconfigDependency,
691 Distribution.Types.PkgconfigName,
692 Distribution.Types.SetupBuildInfo, Distribution.Types.SourceRepo,
693 Distribution.Types.TargetInfo, Distribution.Types.TestSuite,
694 Distribution.Types.TestSuiteInterface, Distribution.Types.TestType,
695 Distribution.Types.UnitId, Distribution.Types.UnqualComponentName,
696 Distribution.Types.Version, Distribution.Types.VersionRange,
697 Distribution.Utils.ShortText, Distribution.Verbosity,
698 Language.Haskell.Extension, Control.Applicative, Data.Complex,
699 Data.Functor.Compose, Data.Functor.Const, Data.Functor.Identity,
700 Data.Functor.Product, Data.Functor.Sum, Data.Monoid,
701 Data.Semigroup, Data.Semigroup.Internal, Data.Version, Data.Void,
702 GHC.Exts, GHC.Generics, GHC.IO.Exception, Data.Graph,
703 Data.IntMap.Internal, Data.IntSet.Internal, Data.Map.Internal,
704 Data.Sequence.Internal, Data.Set.Internal, Data.Tree,
705 Text.PrettyPrint.Annotated.HughesPJ, Text.PrettyPrint.HughesPJ,
706 Data.Text, Data.Text.Lazy]
707 []
708Warning: -rtsopts and -with-rtsopts have no effect with -no-hs-main.
709 Call hs_init_ghc() from your main() function to set these options.
710C:\msys64\var\drydock\workingcopy-121280\repo\glasgow-haskell-compiler\inplace\mingw\bin\ar.exe: creating compiler/stage2/build/libHSghc-8.7.a
711Warning: -rtsopts and -with-rtsopts have no effect with -no-hs-main.
712 Call hs_init_ghc() from your main() function to set these options.
713C:\msys64\var\drydock\workingcopy-121280\repo\glasgow-haskell-compiler\inplace\mingw\bin\ar.exe: creating libraries/parallel/dist-install/build/libHSparallel-3.2.2.0.a
714grep: ../random/random.cabal: No such file or directory
715Warning: include-dirs: C:\msys64\var\drydock\workingcopy-121280\repo\glasgow-haskell-compiler\compiler\stage2\build\utils doesn't exist or isn't a directory
716Warning: include-dirs: C:\msys64\var\drydock\workingcopy-121280\repo\glasgow-haskell-compiler\compiler\stage2\build\../rts/dist/build doesn't exist or isn't a directory
717Warning: include-dirs: C:\msys64\var\drydock\workingcopy-121280\repo\glasgow-haskell-compiler\compiler\stage2\build\stage2 doesn't exist or isn't a directory
718Warning: include-dirs: C:\msys64\var\drydock\workingcopy-121280\repo\glasgow-haskell-compiler\libraries\haskeline\dist-install\build\includes doesn't exist or isn't a directory
719Warning: include-dirs: C:\msys64\var\drydock\workingcopy-121280\repo\glasgow-haskell-compiler\libraries\text\dist-install\build\include doesn't exist or isn't a directory
720Warning: include-dirs: C:\msys64\var\drydock\workingcopy-121280\repo\glasgow-haskell-compiler\libraries\Win32\dist-install\build\include doesn't exist or isn't a directory
721Warning: include-dirs: C:\msys64\var\drydock\workingcopy-121280\repo\glasgow-haskell-compiler\libraries\containers\dist-install\build\include doesn't exist or isn't a directory
722Warning: include-dirs: C:\msys64\var\drydock\workingcopy-121280\repo\glasgow-haskell-compiler\libraries\bytestring\dist-install\build\include doesn't exist or isn't a directory
723rts-1.0: Warning: .:481:1: The field "hugs-options" is deprecated. hugs isn't supported anymore
724

Build Log 306752 (remote - stdout)
25 - 50 - 100 - Unlimited Lines

9341 href (Text\XHtml\Strict\Attributes.hs:29)
9342 hreflang (Text\XHtml\Strict\Attributes.hs:30)
9343 httpequiv (Text\XHtml\Strict\Attributes.hs:31)
9344 identifier (Text\XHtml\Strict\Attributes.hs:32)
9345 ismap (Text\XHtml\Strict\Attributes.hs:33)
9346 lang (Text\XHtml\Strict\Attributes.hs:34)
9347 maxlength (Text\XHtml\Strict\Attributes.hs:35)
9348 method (Text\XHtml\Strict\Attributes.hs:36)
9349 multiple (Text\XHtml\Strict\Attributes.hs:37)
9350 name (Text\XHtml\Strict\Attributes.hs:38)
9351 nohref (Text\XHtml\Strict\Attributes.hs:39)
9352 rel (Text\XHtml\Strict\Attributes.hs:40)
9353 rev (Text\XHtml\Strict\Attributes.hs:41)
9354 rows (Text\XHtml\Strict\Attributes.hs:42)
9355 rowspan (Text\XHtml\Strict\Attributes.hs:43)
9356 rules (Text\XHtml\Strict\Attributes.hs:44)
9357 selected (Text\XHtml\Strict\Attributes.hs:45)
9358 shape (Text\XHtml\Strict\Attributes.hs:46)
9359 size (Text\XHtml\Strict\Attributes.hs:47)
9360 src (Text\XHtml\Strict\Attributes.hs:48)
9361 theclass (Text\XHtml\Strict\Attributes.hs:49)
9362 thefor (Text\XHtml\Strict\Attributes.hs:50)
9363 thestyle (Text\XHtml\Strict\Attributes.hs:51)
9364 thetype (Text\XHtml\Strict\Attributes.hs:52)
9365 title (Text\XHtml\Strict\Attributes.hs:53)
9366 usemap (Text\XHtml\Strict\Attributes.hs:54)
9367 valign (Text\XHtml\Strict\Attributes.hs:55)
9368 value (Text\XHtml\Strict\Attributes.hs:56)
9369 width (Text\XHtml\Strict\Attributes.hs:57)
9370 frameborder (Text\XHtml\Frameset\Attributes.hs:9)
9371 marginheight (Text\XHtml\Frameset\Attributes.hs:12)
9372 marginwidth (Text\XHtml\Frameset\Attributes.hs:15)
9373 noresize (Text\XHtml\Frameset\Attributes.hs:18)
9374 scrolling (Text\XHtml\Frameset\Attributes.hs:21)
9375 alink (Text\XHtml\Transitional\Attributes.hs:10)
9376 background (Text\XHtml\Transitional\Attributes.hs:14)
9377 bgcolor (Text\XHtml\Transitional\Attributes.hs:18)
9378 clear (Text\XHtml\Transitional\Attributes.hs:22)
9379 code (Text\XHtml\Transitional\Attributes.hs:26)
9380 color (Text\XHtml\Transitional\Attributes.hs:30)
9381 compact (Text\XHtml\Transitional\Attributes.hs:34)
9382 face (Text\XHtml\Transitional\Attributes.hs:38)
9383 hspace (Text\XHtml\Transitional\Attributes.hs:42)
9384 link (Text\XHtml\Transitional\Attributes.hs:46)
9385 noshade (Text\XHtml\Transitional\Attributes.hs:50)
9386 nowrap (Text\XHtml\Transitional\Attributes.hs:54)
9387 start (Text\XHtml\Transitional\Attributes.hs:58)
9388 target (Text\XHtml\Transitional\Attributes.hs:61)
9389 text (Text\XHtml\Transitional\Attributes.hs:65)
9390 version (Text\XHtml\Transitional\Attributes.hs:69)
9391 vlink (Text\XHtml\Transitional\Attributes.hs:73)
9392 vspace (Text\XHtml\Transitional\Attributes.hs:77)
9393 aqua (Text\XHtml\Transitional\Attributes.hs:87)
9394 black (Text\XHtml\Transitional\Attributes.hs:88)
9395 blue (Text\XHtml\Transitional\Attributes.hs:89)
9396 fuchsia (Text\XHtml\Transitional\Attributes.hs:90)
9397 gray (Text\XHtml\Transitional\Attributes.hs:91)
9398 green (Text\XHtml\Transitional\Attributes.hs:92)
9399 lime (Text\XHtml\Transitional\Attributes.hs:93)
9400 maroon (Text\XHtml\Transitional\Attributes.hs:94)
9401 navy (Text\XHtml\Transitional\Attributes.hs:95)
9402 olive (Text\XHtml\Transitional\Attributes.hs:96)
9403 purple (Text\XHtml\Transitional\Attributes.hs:97)
9404 red (Text\XHtml\Transitional\Attributes.hs:98)
9405 silver (Text\XHtml\Transitional\Attributes.hs:99)
9406 teal (Text\XHtml\Transitional\Attributes.hs:100)
9407 yellow (Text\XHtml\Transitional\Attributes.hs:101)
9408 white (Text\XHtml\Transitional\Attributes.hs:102)
9409 primHtmlChar (Text\XHtml\Extras.hs:34)
9410 bullet (Text\XHtml\Extras.hs:41)
9411 URL (Text\XHtml\Extras.hs:57)
9412 HotLink (Text\XHtml\Extras.hs:59)
9413 hotlink (Text\XHtml\Extras.hs:72)
9414 ordList (Text\XHtml\Extras.hs:85)
9415 unordList (Text\XHtml\Extras.hs:88)
9416 defList (Text\XHtml\Extras.hs:91)
9417 widget (Text\XHtml\Extras.hs:99)
9418 checkbox (Text\XHtml\Extras.hs:103)
9419 hidden (Text\XHtml\Extras.hs:104)
9420 radio (Text\XHtml\Extras.hs:105)
9421 reset (Text\XHtml\Extras.hs:106)
9422 submit (Text\XHtml\Extras.hs:107)
9423 password (Text\XHtml\Extras.hs:108)
9424 textfield (Text\XHtml\Extras.hs:109)
9425 afile (Text\XHtml\Extras.hs:110)
9426 clickmap (Text\XHtml\Extras.hs:111)
9427 menu (Text\XHtml\Extras.hs:124)
9428 gui (Text\XHtml\Extras.hs:128)
9429 71% ( 5 / 7) in 'Text.XHtml'
9430 Missing documentation for:
9431 treeHtml (Text\XHtml\Debug.hs:24)
9432 treeColors (Text\XHtml\Debug.hs:64)
9433Installing library in C:/msys64/var/drydock/workingcopy-121280/repo/glasgow-haskell-compiler/bindisttest/install dir\x86_64-windows-ghc-8.7.20181017\xhtml-3000.2.2.1-FbbswYqHoHjI6bfJsZmh8z
9434Registering library for xhtml-3000.2.2.1..
9435cleaning...
9436-------------------------------------------------------------------
9437Congratulations! This tree has compiled successfully.
9438
9439You can now test your new compiler using ./validate --testsuite-only.
9440

Drydock: Prepare tree

When
Completed at Oct 18 2018, 3:32 AM · Built for 1 m, 11 s
Status
Passed

Build Log 306751 (remote - stderr)
25 - 50 - 100 - Unlimited Lines

1+ git clean -qxfd
2+ git submodule foreach git checkout .
3+ git submodule foreach git clean -qxfd
4+ git submodule sync
5+ git submodule update --init --recursive
6+ git submodule foreach -q git clean -qxfd
7

Build Log 306750 (remote - stdout)
25 - 50 - 100 - Unlimited Lines

1Entering '.arc-linters/arcanist-external-json-linter'
2Entering 'hadrian'
3Entering 'libffi-tarballs'
4Entering 'libraries/Cabal'
5Entering 'libraries/Win32'
6Entering 'libraries/array'
7Entering 'libraries/binary'
8Entering 'libraries/bytestring'
9Entering 'libraries/containers'
10Entering 'libraries/deepseq'
11Entering 'libraries/directory'
12Entering 'libraries/filepath'
13Entering 'libraries/haskeline'
14Entering 'libraries/hpc'
15Entering 'libraries/integer-gmp/gmp/gmp-tarballs'
16Entering 'libraries/mtl'
17Entering 'libraries/parallel'
18Entering 'libraries/parsec'
19Entering 'libraries/pretty'
20Entering 'libraries/process'
21Entering 'libraries/stm'
22Entering 'libraries/terminfo'
23Entering 'libraries/text'
24Entering 'libraries/time'
25Entering 'libraries/transformers'
26Entering 'libraries/unix'
27Entering 'libraries/xhtml'
28Entering 'nofib'
29Entering 'utils/haddock'
30Entering 'utils/hsc2hs'
31Entering '.arc-linters/arcanist-external-json-linter'
32Entering 'hadrian'
33Entering 'libffi-tarballs'
34Entering 'libraries/Cabal'
35Entering 'libraries/Win32'
36Entering 'libraries/array'
37Entering 'libraries/binary'
38Entering 'libraries/bytestring'
39Entering 'libraries/containers'
40Entering 'libraries/deepseq'
41Entering 'libraries/directory'
42Entering 'libraries/filepath'
43Entering 'libraries/haskeline'
44Entering 'libraries/hpc'
45Entering 'libraries/integer-gmp/gmp/gmp-tarballs'
46Entering 'libraries/mtl'
47Entering 'libraries/parallel'
48Entering 'libraries/parsec'
49Entering 'libraries/pretty'
50Entering 'libraries/process'
51Entering 'libraries/stm'
52Entering 'libraries/terminfo'
53Entering 'libraries/text'
54Entering 'libraries/time'
55Entering 'libraries/transformers'
56Entering 'libraries/unix'
57Entering 'libraries/xhtml'
58Entering 'nofib'
59Entering 'utils/haddock'
60Entering 'utils/hsc2hs'
61Synchronizing submodule url for '.arc-linters/arcanist-external-json-linter'
62Synchronizing submodule url for 'hadrian'
63Synchronizing submodule url for 'libffi-tarballs'
64Synchronizing submodule url for 'libraries/Cabal'
65Synchronizing submodule url for 'libraries/Win32'
66Synchronizing submodule url for 'libraries/array'
67Synchronizing submodule url for 'libraries/binary'
68Synchronizing submodule url for 'libraries/bytestring'
69Synchronizing submodule url for 'libraries/containers'
70Synchronizing submodule url for 'libraries/deepseq'
71Synchronizing submodule url for 'libraries/directory'
72Synchronizing submodule url for 'libraries/filepath'
73Synchronizing submodule url for 'libraries/haskeline'
74Synchronizing submodule url for 'libraries/hpc'
75Synchronizing submodule url for 'libraries/integer-gmp/gmp/gmp-tarballs'
76Synchronizing submodule url for 'libraries/mtl'
77Synchronizing submodule url for 'libraries/parallel'
78Synchronizing submodule url for 'libraries/parsec'
79Synchronizing submodule url for 'libraries/pretty'
80Synchronizing submodule url for 'libraries/process'
81Synchronizing submodule url for 'libraries/stm'
82Synchronizing submodule url for 'libraries/terminfo'
83Synchronizing submodule url for 'libraries/text'
84Synchronizing submodule url for 'libraries/time'
85Synchronizing submodule url for 'libraries/transformers'
86Synchronizing submodule url for 'libraries/unix'
87Synchronizing submodule url for 'libraries/xhtml'
88Synchronizing submodule url for 'nofib'
89Synchronizing submodule url for 'utils/haddock'
90Synchronizing submodule url for 'utils/hsc2hs'
91

Lease Working Copy

When
Completed at Oct 18 2018, 3:31 AM · Built for 11 h, 18 m
Status
Passed