Build 53504

Drydock: Build

When
Completed at Sep 24 2018, 12:22 PM · Built for 35 m, 9 s
Status
Failed

Build Log 301893 (remote - stderr)
25 - 50 - 100 - Unlimited Lines

364Makefile:672: warning: ignoring old recipe for target 'libffi.map'
365Makefile:1804: warning: overriding recipe for target 'libffi.map'
366Makefile:672: warning: ignoring old recipe for target 'libffi.map'
367ar: `u' modifier ignored since `D' is the default (see `U')
368ar: `u' modifier ignored since `D' is the default (see `U')
369Makefile:3406: warning: overriding recipe for target 'libffi.map'
370Makefile:731: warning: ignoring old recipe for target 'libffi.map'
371Makefile:1804: warning: overriding recipe for target 'libffi.map'
372Makefile:672: warning: ignoring old recipe for target 'libffi.map'
373Makefile:1804: warning: overriding recipe for target 'libffi.map'
374Makefile:672: warning: ignoring old recipe for target 'libffi.map'
375Makefile:1804: warning: overriding recipe for target 'libffi.map'
376Makefile:672: warning: ignoring old recipe for target 'libffi.map'
377
378Extension error:
379when adding directive classes, no additional arguments may be given
380
381Extension error:
382when adding directive classes, no additional arguments may be given
383make[1]: *** [docs/users_guide/build-html/users_guide/index.html] Error 1
384make[1]: *** Waiting for unfinished jobs....
385make[1]: *** [docs/users_guide/build-man/ghc.1] Error 1
386/var/drydock/workingcopy-121262/repo/glasgow-haskell-compiler/utils/haddock/doc/invoking.rst:457: WARNING: unknown option: -cpp
387make: *** [all] Error 2
388

Build Log 301892 (remote - stdout)
25 - 50 - 100 - Unlimited Lines

3543building [html]: targets for 4 source files that are out of date
3544updating environment: 4 added, 0 changed, 0 removed
3545reading sources... [ 25%] index
3546reading sources... [ 50%] intro
3547reading sources... [ 75%] invoking
3548reading sources... [100%] markup
3549
3550looking for now-outdated files... none found
3551pickling environment... done
3552checking consistency... done
3553preparing documents... done
3554writing output... [ 25%] index
3555writing output... [ 50%] intro
3556writing output... [ 75%] invoking
3557writing output... [100%] markup
3558
3559generating indices... genindex
3560writing additional pages... search
3561copying static files... done
3562copying extra files... done
3563dumping search index in English (code: en) ... done
3564dumping object inventory... done
3565build succeeded, 1 warning.
3566Makefile:122: recipe for target 'all' failed
3567

Drydock: Prepare tree

When
Completed at Sep 24 2018, 11:47 AM · Built for 19 s
Status
Passed

Build Log 301891 (remote - stderr)
25 - 50 - 100 - Unlimited Lines

1+ git clean -qxfd
2+ git submodule sync
3+ git submodule update --init --recursive
4+ git submodule foreach -q git clean -qxfd
5

Build Log 301890 (remote - stdout)
25 - 50 - 100 - Unlimited Lines

6Synchronizing submodule url for 'libraries/binary'
7Synchronizing submodule url for 'libraries/bytestring'
8Synchronizing submodule url for 'libraries/containers'
9Synchronizing submodule url for 'libraries/deepseq'
10Synchronizing submodule url for 'libraries/directory'
11Synchronizing submodule url for 'libraries/filepath'
12Synchronizing submodule url for 'libraries/haskeline'
13Synchronizing submodule url for 'libraries/hpc'
14Synchronizing submodule url for 'libraries/integer-gmp/gmp/gmp-tarballs'
15Synchronizing submodule url for 'libraries/mtl'
16Synchronizing submodule url for 'libraries/parallel'
17Synchronizing submodule url for 'libraries/parsec'
18Synchronizing submodule url for 'libraries/pretty'
19Synchronizing submodule url for 'libraries/process'
20Synchronizing submodule url for 'libraries/stm'
21Synchronizing submodule url for 'libraries/terminfo'
22Synchronizing submodule url for 'libraries/text'
23Synchronizing submodule url for 'libraries/time'
24Synchronizing submodule url for 'libraries/transformers'
25Synchronizing submodule url for 'libraries/unix'
26Synchronizing submodule url for 'libraries/xhtml'
27Synchronizing submodule url for 'nofib'
28Synchronizing submodule url for 'utils/haddock'
29Synchronizing submodule url for 'utils/hsc2hs'
30

Build Working Copy

When
Completed at Sep 24 2018, 11:47 AM · Built for 3 d, 20 h
Status
Passed
Description

Lease a working copy for Linux/amd64 builds.