Build 53503

Drydock: Build

When
Completed at Sep 20 2018, 4:19 PM · Built for 19 m, 28 s
Status
Failed
Description

Run the build.

Build Log 300997 (remote - stderr)
25 - 50 - 100 - Unlimited Lines

404Makefile:1804: warning: overriding commands for target `libffi.map'
405Makefile:672: warning: ignoring old commands for target `libffi.map'
406Makefile:1804: warning: overriding commands for target `libffi.map'
407Makefile:672: warning: ignoring old commands for target `libffi.map'
408Makefile:1804: warning: overriding commands for target `libffi.map'
409Makefile:672: warning: ignoring old commands for target `libffi.map'
410Configured with: --prefix=/Applications/Xcode-7.2/Xcode.app/Contents/Developer/usr --with-gxx-include-dir=/usr/include/c++/4.2.1
411Warning: -rtsopts and -with-rtsopts have no effect with -no-hs-main.
412 Call hs_init_ghc() from your main() function to set these options.
413Warning: -rtsopts and -with-rtsopts have no effect with -no-hs-main.
414 Call hs_init_ghc() from your main() function to set these options.
415Warning: -rtsopts and -with-rtsopts have no effect with -no-hs-main.
416 Call hs_init_ghc() from your main() function to set these options.
417
418Extension error:
419when adding directive classes, no additional arguments may be given
420
421Extension error:
422when adding directive classes, no additional arguments may be given
423make[1]: *** [docs/users_guide/build-html/users_guide/index.html] Error 1
424make[1]: *** Waiting for unfinished jobs....
425make[1]: *** [docs/users_guide/build-man/ghc.1] Error 1
426/private/var/drydock/workingcopy-121281/repo/glasgow-haskell-compiler/utils/haddock/doc/invoking.rst:457: WARNING: unknown option: -cpp
427make: *** [all] Error 2
428

Build Log 300996 (remote - stdout)
25 - 50 - 100 - Unlimited Lines

3500building [mo]: targets for 0 po files that are out of date
3501building [html]: targets for 4 source files that are out of date
3502updating environment: 4 added, 0 changed, 0 removed
3503reading sources... [ 25%] index
3504reading sources... [ 50%] intro
3505reading sources... [ 75%] invoking
3506reading sources... [100%] markup
3507
3508looking for now-outdated files... none found
3509pickling environment... done
3510checking consistency... done
3511preparing documents... done
3512writing output... [ 25%] index
3513writing output... [ 50%] intro
3514writing output... [ 75%] invoking
3515writing output... [100%] markup
3516
3517generating indices... genindex
3518writing additional pages... search
3519copying static files... done
3520copying extra files... done
3521dumping search index in English (code: en) ... done
3522dumping object inventory... done
3523build succeeded, 1 warning.
3524

Drydock: Prepare tree

When
Completed at Sep 20 2018, 3:59 PM · Built for 8 s
Status
Passed

Build Log 300995 (remote - stderr)
25 - 50 - 100 - Unlimited Lines

1+ git clean -qxfd
2+ git submodule sync
3+ git submodule update --init --recursive
4+ git submodule foreach -q git clean -qxfd
5

Build Log 300994 (remote - stdout)
25 - 50 - 100 - Unlimited Lines

6Synchronizing submodule url for 'libraries/binary'
7Synchronizing submodule url for 'libraries/bytestring'
8Synchronizing submodule url for 'libraries/containers'
9Synchronizing submodule url for 'libraries/deepseq'
10Synchronizing submodule url for 'libraries/directory'
11Synchronizing submodule url for 'libraries/filepath'
12Synchronizing submodule url for 'libraries/haskeline'
13Synchronizing submodule url for 'libraries/hpc'
14Synchronizing submodule url for 'libraries/integer-gmp/gmp/gmp-tarballs'
15Synchronizing submodule url for 'libraries/mtl'
16Synchronizing submodule url for 'libraries/parallel'
17Synchronizing submodule url for 'libraries/parsec'
18Synchronizing submodule url for 'libraries/pretty'
19Synchronizing submodule url for 'libraries/process'
20Synchronizing submodule url for 'libraries/stm'
21Synchronizing submodule url for 'libraries/terminfo'
22Synchronizing submodule url for 'libraries/text'
23Synchronizing submodule url for 'libraries/time'
24Synchronizing submodule url for 'libraries/transformers'
25Synchronizing submodule url for 'libraries/unix'
26Synchronizing submodule url for 'libraries/xhtml'
27Synchronizing submodule url for 'nofib'
28Synchronizing submodule url for 'utils/haddock'
29Synchronizing submodule url for 'utils/hsc2hs'
30

Lease Working Copy

When
Completed at Sep 20 2018, 3:59 PM · Built for 51 m, 43 s
Status
Passed
Description

Lease a working copy for OSX/amd64 builds.