Build 53501

Drydock: Build

When
Completed at Sep 21 2018, 4:46 PM · Built for 32 m, 16 s
Status
Failed

Build Log 301239 (remote - stderr)
25 - 50 - 100 - Unlimited Lines

460 | ^^^^^^^^^^^
461
462utils\gen-dll\Main.hs:306:30: warning: [-Wunused-local-binds]
463 Defined but not used: ‘imp_lib’
464 |
465306 | imp_lib = base_pt <.> "dll.a"
466 | ^^^^^^^
467Warning: -rtsopts and -with-rtsopts have no effect with -no-hs-main.
468 Call hs_init_ghc() from your main() function to set these options.
469Warning: -rtsopts and -with-rtsopts have no effect with -no-hs-main.
470 Call hs_init_ghc() from your main() function to set these options.
471Warning: -rtsopts and -with-rtsopts have no effect with -no-hs-main.
472 Call hs_init_ghc() from your main() function to set these options.
473
474Extension error:
475when adding directive classes, no additional arguments may be given
476
477Extension error:
478when adding directive classes, no additional arguments may be given
479make[1]: *** [docs/users_guide/ghc.mk:16: docs/users_guide/build-html/users_guide/index.html] Error 1
480make[1]: *** Waiting for unfinished jobs....
481make[1]: *** [docs/users_guide/ghc.mk:28: docs/users_guide/build-man/ghc.1] Error 1
482C:/msys64/var/drydock/workingcopy-121280/repo/glasgow-haskell-compiler/utils/haddock/doc/invoking.rst:457: WARNING: unknown option: -cpp
483make: *** [Makefile:127: all] Error 2
484

Build Log 301238 (remote - stdout)
25 - 50 - 100 - Unlimited Lines

4678building [mo]: targets for 0 po files that are out of date
4679building [html]: targets for 4 source files that are out of date
4680updating environment: 4 added, 0 changed, 0 removed
4681reading sources... [ 25%] index
4682reading sources... [ 50%] intro
4683reading sources... [ 75%] invoking
4684reading sources... [100%] markup
4685
4686looking for now-outdated files... none found
4687pickling environment... done
4688checking consistency... done
4689preparing documents... done
4690writing output... [ 25%] index
4691writing output... [ 50%] intro
4692writing output... [ 75%] invoking
4693writing output... [100%] markup
4694
4695generating indices... genindex
4696writing additional pages... search
4697copying static files... done
4698copying extra files... done
4699dumping search index in English (code: en) ... done
4700dumping object inventory... done
4701build succeeded, 1 warning.
4702

Drydock: Prepare tree

When
Completed at Sep 21 2018, 4:14 PM · Built for 43 s
Status
Passed

Build Log 301237 (remote - stderr)
25 - 50 - 100 - Unlimited Lines

1+ git clean -qxfd
2+ git submodule foreach git checkout .
3+ git submodule foreach git clean -qxfd
4+ git submodule sync
5+ git submodule update --init --recursive
6+ git submodule foreach -q git clean -qxfd
7

Build Log 301236 (remote - stdout)
25 - 50 - 100 - Unlimited Lines

66Synchronizing submodule url for 'libraries/binary'
67Synchronizing submodule url for 'libraries/bytestring'
68Synchronizing submodule url for 'libraries/containers'
69Synchronizing submodule url for 'libraries/deepseq'
70Synchronizing submodule url for 'libraries/directory'
71Synchronizing submodule url for 'libraries/filepath'
72Synchronizing submodule url for 'libraries/haskeline'
73Synchronizing submodule url for 'libraries/hpc'
74Synchronizing submodule url for 'libraries/integer-gmp/gmp/gmp-tarballs'
75Synchronizing submodule url for 'libraries/mtl'
76Synchronizing submodule url for 'libraries/parallel'
77Synchronizing submodule url for 'libraries/parsec'
78Synchronizing submodule url for 'libraries/pretty'
79Synchronizing submodule url for 'libraries/process'
80Synchronizing submodule url for 'libraries/stm'
81Synchronizing submodule url for 'libraries/terminfo'
82Synchronizing submodule url for 'libraries/text'
83Synchronizing submodule url for 'libraries/time'
84Synchronizing submodule url for 'libraries/transformers'
85Synchronizing submodule url for 'libraries/unix'
86Synchronizing submodule url for 'libraries/xhtml'
87Synchronizing submodule url for 'nofib'
88Synchronizing submodule url for 'utils/haddock'
89Synchronizing submodule url for 'utils/hsc2hs'
90

Lease Working Copy

When
Completed at Sep 21 2018, 4:13 PM · Built for 1 d, 1 h
Status
Passed