Build 52335

Properties

Drydock: Testsuite

When
Completed at Aug 27 2018, 5:07 AM · Built for 29 s
Status
Passed

Build Log 296100 (remote - stderr)
25 - 50 - 100 - Unlimited Lines

1using THREADS=5
2cat: testsuite_summary_stage1.txt: No such file or directory
3

Build Log 296099 (remote - stdout)
25 - 50 - 100 - Unlimited Lines

15Traceback (most recent call last):
16 File "../driver/runtests.py", line 174, in <module>
17 from testlib import *
18 File "/var/drydock/workingcopy-121280/repo/glasgow-haskell-compiler/testsuite/driver/testlib.py", line 26, in <module>
19 import winbindings
20 File "/var/drydock/workingcopy-121280/repo/glasgow-haskell-compiler/testsuite/driver/winbindings.py", line 4, in <module>
21 from ctypes.wintypes import *
22 File "/usr/lib/python3.6/ctypes/wintypes.py", line 20, in <module>
23 class VARIANT_BOOL(ctypes._SimpleCData):
24ValueError: _type_ 'v' not supported
25make: *** [../mk/test.mk:329: test] Error 1
26Traceback (most recent call last):
27 File "../../driver/runtests.py", line 174, in <module>
28 from testlib import *
29 File "/var/drydock/workingcopy-121280/repo/glasgow-haskell-compiler/testsuite/driver/testlib.py", line 26, in <module>
30 import winbindings
31 File "/var/drydock/workingcopy-121280/repo/glasgow-haskell-compiler/testsuite/driver/winbindings.py", line 4, in <module>
32 from ctypes.wintypes import *
33 File "/usr/lib/python3.6/ctypes/wintypes.py", line 20, in <module>
34 class VARIANT_BOOL(ctypes._SimpleCData):
35ValueError: _type_ 'v' not supported
36make: *** [../../mk/test.mk:329: test] Error 1
37
38==== STAGE 1 TESTS ====
39

Drydock: Build

When
Completed at Aug 27 2018, 5:07 AM · Built for 1 h, 24 m
Status
Passed

Build Log 296098 (remote - stderr)
25 - 50 - 100 - Unlimited Lines

704 Data.Functor.Product, Data.Functor.Sum, Data.Monoid,
705 Data.Semigroup, Data.Semigroup.Internal, Data.Version, Data.Void,
706 GHC.Exts, GHC.Generics, GHC.IO.Exception, Data.Graph,
707 Data.IntMap.Internal, Data.IntSet.Internal, Data.Map.Internal,
708 Data.Sequence.Internal, Data.Set.Internal, Data.Tree,
709 Text.PrettyPrint.Annotated.HughesPJ, Text.PrettyPrint.HughesPJ,
710 Data.Text, Data.Text.Lazy]
711 []
712Warning: -rtsopts and -with-rtsopts have no effect with -no-hs-main.
713 Call hs_init_ghc() from your main() function to set these options.
714C:\msys64\var\drydock\workingcopy-121280\repo\glasgow-haskell-compiler\inplace\mingw\bin\ar.exe: creating compiler/stage2/build/libHSghc-8.7.a
715Warning: -rtsopts and -with-rtsopts have no effect with -no-hs-main.
716 Call hs_init_ghc() from your main() function to set these options.
717C:\msys64\var\drydock\workingcopy-121280\repo\glasgow-haskell-compiler\inplace\mingw\bin\ar.exe: creating libraries/parallel/dist-install/build/libHSparallel-3.2.2.0.a
718grep: ../random/random.cabal: No such file or directory
719Warning: include-dirs: C:\msys64\var\drydock\workingcopy-121280\repo\glasgow-haskell-compiler\compiler\stage2\build\utils doesn't exist or isn't a directory
720Warning: include-dirs: C:\msys64\var\drydock\workingcopy-121280\repo\glasgow-haskell-compiler\compiler\stage2\build\../rts/dist/build doesn't exist or isn't a directory
721Warning: include-dirs: C:\msys64\var\drydock\workingcopy-121280\repo\glasgow-haskell-compiler\compiler\stage2\build\stage2 doesn't exist or isn't a directory
722Warning: include-dirs: C:\msys64\var\drydock\workingcopy-121280\repo\glasgow-haskell-compiler\libraries\haskeline\dist-install\build\includes doesn't exist or isn't a directory
723Warning: include-dirs: C:\msys64\var\drydock\workingcopy-121280\repo\glasgow-haskell-compiler\libraries\text\dist-install\build\include doesn't exist or isn't a directory
724Warning: include-dirs: C:\msys64\var\drydock\workingcopy-121280\repo\glasgow-haskell-compiler\libraries\Win32\dist-install\build\include doesn't exist or isn't a directory
725Warning: include-dirs: C:\msys64\var\drydock\workingcopy-121280\repo\glasgow-haskell-compiler\libraries\containers\dist-install\build\include doesn't exist or isn't a directory
726Warning: include-dirs: C:\msys64\var\drydock\workingcopy-121280\repo\glasgow-haskell-compiler\libraries\bytestring\dist-install\build\include doesn't exist or isn't a directory
727rts-1.0: Warning: .:479:1: The field "hugs-options" is deprecated. hugs isn't supported anymore
728

Build Log 296097 (remote - stdout)
25 - 50 - 100 - Unlimited Lines

9847 defList (Text\XHtml\Extras.hs:91)
9848 widget (Text\XHtml\Extras.hs:99)
9849 checkbox (Text\XHtml\Extras.hs:103)
9850 hidden (Text\XHtml\Extras.hs:104)
9851 radio (Text\XHtml\Extras.hs:105)
9852 reset (Text\XHtml\Extras.hs:106)
9853 submit (Text\XHtml\Extras.hs:107)
9854 password (Text\XHtml\Extras.hs:108)
9855 textfield (Text\XHtml\Extras.hs:109)
9856 afile (Text\XHtml\Extras.hs:110)
9857 clickmap (Text\XHtml\Extras.hs:111)
9858 menu (Text\XHtml\Extras.hs:124)
9859 gui (Text\XHtml\Extras.hs:128)
9860 71% ( 5 / 7) in 'Text.XHtml'
9861 Missing documentation for:
9862 treeHtml (Text\XHtml\Debug.hs:24)
9863 treeColors (Text\XHtml\Debug.hs:64)
9864Installing library in C:/msys64/var/drydock/workingcopy-121280/repo/glasgow-haskell-compiler/bindisttest/install dir\x86_64-windows-ghc-8.7.20180826\xhtml-3000.2.2.1-FbbswYqHoHjI6bfJsZmh8z
9865Registering library for xhtml-3000.2.2.1..
9866cleaning...
9867-------------------------------------------------------------------
9868Congratulations! This tree has compiled successfully.
9869
9870You can now test your new compiler using ./validate --testsuite-only.
9871

Drydock: Prepare tree

When
Completed at Aug 27 2018, 3:42 AM · Built for 55 s
Status
Passed

Build Log 296096 (remote - stderr)
25 - 50 - 100 - Unlimited Lines

1+ git clean -qxfd
2+ git submodule foreach git checkout .
3+ git submodule foreach git clean -qxfd
4+ git submodule sync
5+ git submodule update --init --recursive
6+ git submodule foreach -q git clean -qxfd
7

Build Log 296095 (remote - stdout)
25 - 50 - 100 - Unlimited Lines

66Synchronizing submodule url for 'libraries/binary'
67Synchronizing submodule url for 'libraries/bytestring'
68Synchronizing submodule url for 'libraries/containers'
69Synchronizing submodule url for 'libraries/deepseq'
70Synchronizing submodule url for 'libraries/directory'
71Synchronizing submodule url for 'libraries/filepath'
72Synchronizing submodule url for 'libraries/haskeline'
73Synchronizing submodule url for 'libraries/hpc'
74Synchronizing submodule url for 'libraries/integer-gmp/gmp/gmp-tarballs'
75Synchronizing submodule url for 'libraries/mtl'
76Synchronizing submodule url for 'libraries/parallel'
77Synchronizing submodule url for 'libraries/parsec'
78Synchronizing submodule url for 'libraries/pretty'
79Synchronizing submodule url for 'libraries/process'
80Synchronizing submodule url for 'libraries/stm'
81Synchronizing submodule url for 'libraries/terminfo'
82Synchronizing submodule url for 'libraries/text'
83Synchronizing submodule url for 'libraries/time'
84Synchronizing submodule url for 'libraries/transformers'
85Synchronizing submodule url for 'libraries/unix'
86Synchronizing submodule url for 'libraries/xhtml'
87Synchronizing submodule url for 'nofib'
88Synchronizing submodule url for 'utils/haddock'
89Synchronizing submodule url for 'utils/hsc2hs'
90

Lease Working Copy

When
Completed at Aug 27 2018, 3:41 AM · Built for 10 h, 30 m
Status
Passed