Build 51388

Properties

Drydock: Build

When
Completed at Aug 13 2018, 3:47 AM · Built for 53 m, 6 s
Status
Failed
Description

Run the build.

Build Log 292537 (remote - stderr)
25 - 50 - 100 - Unlimited Lines

1038/Applications/Xcode-7.2/Xcode.app/Contents/Developer/Toolchains/XcodeDefault.xctoolchain/usr/bin/ranlib: file: /var/drydock/workingcopy-121269/repo/glasgow-haskell-compiler/bindisttest/install dir/lib/ghc-8.7.20180808/rts/libHSrts_thr_l.a(Disassembler.thr_l_o) has no symbols
1039/Applications/Xcode-7.2/Xcode.app/Contents/Developer/Toolchains/XcodeDefault.xctoolchain/usr/bin/ranlib: file: /var/drydock/workingcopy-121269/repo/glasgow-haskell-compiler/bindisttest/install dir/lib/ghc-8.7.20180808/rts/libHSrts_thr_l.a(LdvProfile.thr_l_o) has no symbols
1040/Applications/Xcode-7.2/Xcode.app/Contents/Developer/Toolchains/XcodeDefault.xctoolchain/usr/bin/ranlib: file: /var/drydock/workingcopy-121269/repo/glasgow-haskell-compiler/bindisttest/install dir/lib/ghc-8.7.20180808/rts/libHSrts_thr_l.a(OldARMAtomic.thr_l_o) has no symbols
1041/Applications/Xcode-7.2/Xcode.app/Contents/Developer/Toolchains/XcodeDefault.xctoolchain/usr/bin/ranlib: file: /var/drydock/workingcopy-121269/repo/glasgow-haskell-compiler/bindisttest/install dir/lib/ghc-8.7.20180808/rts/libHSrts_thr_l.a(ProfilerReport.thr_l_o) has no symbols
1042/Applications/Xcode-7.2/Xcode.app/Contents/Developer/Toolchains/XcodeDefault.xctoolchain/usr/bin/ranlib: file: /var/drydock/workingcopy-121269/repo/glasgow-haskell-compiler/bindisttest/install dir/lib/ghc-8.7.20180808/rts/libHSrts_thr_l.a(ProfilerReportJson.thr_l_o) has no symbols
1043/Applications/Xcode-7.2/Xcode.app/Contents/Developer/Toolchains/XcodeDefault.xctoolchain/usr/bin/ranlib: file: /var/drydock/workingcopy-121269/repo/glasgow-haskell-compiler/bindisttest/install dir/lib/ghc-8.7.20180808/rts/libHSrts_thr_l.a(Profiling.thr_l_o) has no symbols
1044/Applications/Xcode-7.2/Xcode.app/Contents/Developer/Toolchains/XcodeDefault.xctoolchain/usr/bin/ranlib: file: /var/drydock/workingcopy-121269/repo/glasgow-haskell-compiler/bindisttest/install dir/lib/ghc-8.7.20180808/rts/libHSrts_thr_l.a(RetainerProfile.thr_l_o) has no symbols
1045/Applications/Xcode-7.2/Xcode.app/Contents/Developer/Toolchains/XcodeDefault.xctoolchain/usr/bin/ranlib: file: /var/drydock/workingcopy-121269/repo/glasgow-haskell-compiler/bindisttest/install dir/lib/ghc-8.7.20180808/rts/libHSrts_thr_l.a(RetainerSet.thr_l_o) has no symbols
1046/Applications/Xcode-7.2/Xcode.app/Contents/Developer/Toolchains/XcodeDefault.xctoolchain/usr/bin/ranlib: file: /var/drydock/workingcopy-121269/repo/glasgow-haskell-compiler/bindisttest/install dir/lib/ghc-8.7.20180808/rts/libHSrts_thr_l.a(RtsDllMain.thr_l_o) has no symbols
1047/Applications/Xcode-7.2/Xcode.app/Contents/Developer/Toolchains/XcodeDefault.xctoolchain/usr/bin/ranlib: file: /var/drydock/workingcopy-121269/repo/glasgow-haskell-compiler/bindisttest/install dir/lib/ghc-8.7.20180808/rts/libHSrts_thr_l.a(Sanity.thr_l_o) has no symbols
1048/Applications/Xcode-7.2/Xcode.app/Contents/Developer/Toolchains/XcodeDefault.xctoolchain/usr/bin/ranlib: file: /var/drydock/workingcopy-121269/repo/glasgow-haskell-compiler/bindisttest/install dir/lib/ghc-8.7.20180808/rts/libHSrts_thr_l.a(Elf.thr_l_o) has no symbols
1049/Applications/Xcode-7.2/Xcode.app/Contents/Developer/Toolchains/XcodeDefault.xctoolchain/usr/bin/ranlib: file: /var/drydock/workingcopy-121269/repo/glasgow-haskell-compiler/bindisttest/install dir/lib/ghc-8.7.20180808/rts/libHSrts_thr_l.a(PEi386.thr_l_o) has no symbols
1050/Applications/Xcode-7.2/Xcode.app/Contents/Developer/Toolchains/XcodeDefault.xctoolchain/usr/bin/ranlib: file: /var/drydock/workingcopy-121269/repo/glasgow-haskell-compiler/bindisttest/install dir/lib/ghc-8.7.20180808/rts/libHSrts_thr_l.a(elf_got.thr_l_o) has no symbols
1051/Applications/Xcode-7.2/Xcode.app/Contents/Developer/Toolchains/XcodeDefault.xctoolchain/usr/bin/ranlib: file: /var/drydock/workingcopy-121269/repo/glasgow-haskell-compiler/bindisttest/install dir/lib/ghc-8.7.20180808/rts/libHSrts_thr_l.a(elf_plt.thr_l_o) has no symbols
1052/Applications/Xcode-7.2/Xcode.app/Contents/Developer/Toolchains/XcodeDefault.xctoolchain/usr/bin/ranlib: file: /var/drydock/workingcopy-121269/repo/glasgow-haskell-compiler/bindisttest/install dir/lib/ghc-8.7.20180808/rts/libHSrts_thr_l.a(elf_plt_aarch64.thr_l_o) has no symbols
1053/Applications/Xcode-7.2/Xcode.app/Contents/Developer/Toolchains/XcodeDefault.xctoolchain/usr/bin/ranlib: file: /var/drydock/workingcopy-121269/repo/glasgow-haskell-compiler/bindisttest/install dir/lib/ghc-8.7.20180808/rts/libHSrts_thr_l.a(elf_plt_arm.thr_l_o) has no symbols
1054/Applications/Xcode-7.2/Xcode.app/Contents/Developer/Toolchains/XcodeDefault.xctoolchain/usr/bin/ranlib: file: /var/drydock/workingcopy-121269/repo/glasgow-haskell-compiler/bindisttest/install dir/lib/ghc-8.7.20180808/rts/libHSrts_thr_l.a(elf_reloc.thr_l_o) has no symbols
1055/Applications/Xcode-7.2/Xcode.app/Contents/Developer/Toolchains/XcodeDefault.xctoolchain/usr/bin/ranlib: file: /var/drydock/workingcopy-121269/repo/glasgow-haskell-compiler/bindisttest/install dir/lib/ghc-8.7.20180808/rts/libHSrts_thr_l.a(elf_reloc_aarch64.thr_l_o) has no symbols
1056/Applications/Xcode-7.2/Xcode.app/Contents/Developer/Toolchains/XcodeDefault.xctoolchain/usr/bin/ranlib: file: /var/drydock/workingcopy-121269/repo/glasgow-haskell-compiler/bindisttest/install dir/lib/ghc-8.7.20180808/rts/libHSrts_thr_l.a(elf_util.thr_l_o) has no symbols
1057/Applications/Xcode-7.2/Xcode.app/Contents/Developer/Toolchains/XcodeDefault.xctoolchain/usr/bin/ranlib: file: /var/drydock/workingcopy-121269/repo/glasgow-haskell-compiler/bindisttest/install dir/lib/ghc-8.7.20180808/rts/libHSrts_thr_l.a(Select.thr_l_o) has no symbols
1058make[3]: *** [install_packages] Segmentation fault: 11
1059make[2]: *** [install] Error 2
1060make[1]: *** [test_bindist] Error 2
1061make: *** [test_bindist] Error 2
1062

Build Log 292536 (remote - stdout)
25 - 50 - 100 - Unlimited Lines

8128checking for sys/types.h... yes
8129checking for sys/stat.h... yes
8130checking for stdlib.h... yes
8131checking for string.h... yes
8132checking for memory.h... yes
8133checking for strings.h... yes
8134checking for inttypes.h... yes
8135checking for stdint.h... yes
8136checking for unistd.h... yes
8137checking size of void *... 8
8138checking for -ar... no
8139checking for ar... ar
8140checking whether ar is GNU ar... no
8141checking for ar arguments... qcls
8142checking whether ar supports @file... no
8143checking for ranlib... ranlib
8144configure: creating ./config.status
8145config.status: creating settings
8146config.status: creating mk/config.mk
8147config.status: creating mk/install.mk
8148****************************************************
8149Configuration done, ready to 'make install'
8150(see README and INSTALL files for more info.)
8151****************************************************
8152

Drydock: Prepare tree

When
Completed at Aug 13 2018, 2:54 AM · Built for 10 s
Status
Passed

Build Log 292535 (remote - stderr)
25 - 50 - 100 - Unlimited Lines

1+ git clean -qxfd
2+ git submodule sync
3+ git submodule update --init --recursive
4+ git submodule foreach -q git clean -qxfd
5

Build Log 292534 (remote - stdout)
25 - 50 - 100 - Unlimited Lines

12Synchronizing submodule url for 'libraries/haskeline'
13Synchronizing submodule url for 'libraries/hpc'
14Synchronizing submodule url for 'libraries/integer-gmp/gmp/gmp-tarballs'
15Synchronizing submodule url for 'libraries/mtl'
16Synchronizing submodule url for 'libraries/parallel'
17Synchronizing submodule url for 'libraries/parsec'
18Synchronizing submodule url for 'libraries/pretty'
19Synchronizing submodule url for 'libraries/process'
20Synchronizing submodule url for 'libraries/stm'
21Synchronizing submodule url for 'libraries/terminfo'
22Synchronizing submodule url for 'libraries/text'
23Synchronizing submodule url for 'libraries/time'
24Synchronizing submodule url for 'libraries/transformers'
25Synchronizing submodule url for 'libraries/unix'
26Synchronizing submodule url for 'libraries/xhtml'
27Synchronizing submodule url for 'nofib'
28Synchronizing submodule url for 'utils/haddock'
29Synchronizing submodule url for 'utils/hsc2hs'
30Submodule path 'hadrian': checked out '4265e3aab7df92722b81148cf8bf3954ebfc2d21'
31Submodule path 'libraries/Cabal': checked out '6671506b488a0fe2079f9059a23510b35514c031'
32Submodule path 'libraries/binary': checked out 'b5a2454e331ba516a14bed77e30f7ef8251eea48'
33Submodule path 'libraries/filepath': checked out 'b10724be8a907e191d153ad6674415be0c1325fd'
34Submodule path 'libraries/terminfo': checked out '27e82750fac178fc6e049fe44be6de45f24814ae'
35Submodule path 'utils/haddock': checked out 'a264b6b3e41dd42946110afcf5000341e5fb3a6d'
36

Lease Working Copy

When
Completed at Aug 13 2018, 2:54 AM · Built for 4 d, 18 h
Status
Passed
Description

Lease a working copy for OSX/amd64 builds.