Build 51368

Drydock: Build

When
Completed at Aug 7 2018, 5:07 PM · Built for 1 h, 17 m
Status
Failed
Description

Run the build.

Build Log 290995 (remote - stderr)
25 - 50 - 100 - Unlimited Lines

859/Applications/Xcode-7.2/Xcode.app/Contents/Developer/Toolchains/XcodeDefault.xctoolchain/usr/bin/ranlib: file: /var/drydock/workingcopy-121269/repo/glasgow-haskell-compiler/bindisttest/install dir/lib/ghc-8.7.20180807/rts/libHSrts_l.a(ProfilerReportJson.l_o) has no symbols
860/Applications/Xcode-7.2/Xcode.app/Contents/Developer/Toolchains/XcodeDefault.xctoolchain/usr/bin/ranlib: file: /var/drydock/workingcopy-121269/repo/glasgow-haskell-compiler/bindisttest/install dir/lib/ghc-8.7.20180807/rts/libHSrts_l.a(Profiling.l_o) has no symbols
861/Applications/Xcode-7.2/Xcode.app/Contents/Developer/Toolchains/XcodeDefault.xctoolchain/usr/bin/ranlib: file: /var/drydock/workingcopy-121269/repo/glasgow-haskell-compiler/bindisttest/install dir/lib/ghc-8.7.20180807/rts/libHSrts_l.a(RetainerProfile.l_o) has no symbols
862/Applications/Xcode-7.2/Xcode.app/Contents/Developer/Toolchains/XcodeDefault.xctoolchain/usr/bin/ranlib: file: /var/drydock/workingcopy-121269/repo/glasgow-haskell-compiler/bindisttest/install dir/lib/ghc-8.7.20180807/rts/libHSrts_l.a(RetainerSet.l_o) has no symbols
863/Applications/Xcode-7.2/Xcode.app/Contents/Developer/Toolchains/XcodeDefault.xctoolchain/usr/bin/ranlib: file: /var/drydock/workingcopy-121269/repo/glasgow-haskell-compiler/bindisttest/install dir/lib/ghc-8.7.20180807/rts/libHSrts_l.a(RtsDllMain.l_o) has no symbols
864/Applications/Xcode-7.2/Xcode.app/Contents/Developer/Toolchains/XcodeDefault.xctoolchain/usr/bin/ranlib: file: /var/drydock/workingcopy-121269/repo/glasgow-haskell-compiler/bindisttest/install dir/lib/ghc-8.7.20180807/rts/libHSrts_l.a(Evac_thr.l_o) has no symbols
865/Applications/Xcode-7.2/Xcode.app/Contents/Developer/Toolchains/XcodeDefault.xctoolchain/usr/bin/ranlib: file: /var/drydock/workingcopy-121269/repo/glasgow-haskell-compiler/bindisttest/install dir/lib/ghc-8.7.20180807/rts/libHSrts_l.a(Sanity.l_o) has no symbols
866/Applications/Xcode-7.2/Xcode.app/Contents/Developer/Toolchains/XcodeDefault.xctoolchain/usr/bin/ranlib: file: /var/drydock/workingcopy-121269/repo/glasgow-haskell-compiler/bindisttest/install dir/lib/ghc-8.7.20180807/rts/libHSrts_l.a(Scav_thr.l_o) has no symbols
867/Applications/Xcode-7.2/Xcode.app/Contents/Developer/Toolchains/XcodeDefault.xctoolchain/usr/bin/ranlib: file: /var/drydock/workingcopy-121269/repo/glasgow-haskell-compiler/bindisttest/install dir/lib/ghc-8.7.20180807/rts/libHSrts_l.a(Elf.l_o) has no symbols
868/Applications/Xcode-7.2/Xcode.app/Contents/Developer/Toolchains/XcodeDefault.xctoolchain/usr/bin/ranlib: file: /var/drydock/workingcopy-121269/repo/glasgow-haskell-compiler/bindisttest/install dir/lib/ghc-8.7.20180807/rts/libHSrts_l.a(PEi386.l_o) has no symbols
869/Applications/Xcode-7.2/Xcode.app/Contents/Developer/Toolchains/XcodeDefault.xctoolchain/usr/bin/ranlib: file: /var/drydock/workingcopy-121269/repo/glasgow-haskell-compiler/bindisttest/install dir/lib/ghc-8.7.20180807/rts/libHSrts_l.a(elf_got.l_o) has no symbols
870/Applications/Xcode-7.2/Xcode.app/Contents/Developer/Toolchains/XcodeDefault.xctoolchain/usr/bin/ranlib: file: /var/drydock/workingcopy-121269/repo/glasgow-haskell-compiler/bindisttest/install dir/lib/ghc-8.7.20180807/rts/libHSrts_l.a(elf_plt.l_o) has no symbols
871/Applications/Xcode-7.2/Xcode.app/Contents/Developer/Toolchains/XcodeDefault.xctoolchain/usr/bin/ranlib: file: /var/drydock/workingcopy-121269/repo/glasgow-haskell-compiler/bindisttest/install dir/lib/ghc-8.7.20180807/rts/libHSrts_l.a(elf_plt_aarch64.l_o) has no symbols
872/Applications/Xcode-7.2/Xcode.app/Contents/Developer/Toolchains/XcodeDefault.xctoolchain/usr/bin/ranlib: file: /var/drydock/workingcopy-121269/repo/glasgow-haskell-compiler/bindisttest/install dir/lib/ghc-8.7.20180807/rts/libHSrts_l.a(elf_plt_arm.l_o) has no symbols
873/Applications/Xcode-7.2/Xcode.app/Contents/Developer/Toolchains/XcodeDefault.xctoolchain/usr/bin/ranlib: file: /var/drydock/workingcopy-121269/repo/glasgow-haskell-compiler/bindisttest/install dir/lib/ghc-8.7.20180807/rts/libHSrts_l.a(elf_reloc.l_o) has no symbols
874/Applications/Xcode-7.2/Xcode.app/Contents/Developer/Toolchains/XcodeDefault.xctoolchain/usr/bin/ranlib: file: /var/drydock/workingcopy-121269/repo/glasgow-haskell-compiler/bindisttest/install dir/lib/ghc-8.7.20180807/rts/libHSrts_l.a(elf_reloc_aarch64.l_o) has no symbols
875/Applications/Xcode-7.2/Xcode.app/Contents/Developer/Toolchains/XcodeDefault.xctoolchain/usr/bin/ranlib: file: /var/drydock/workingcopy-121269/repo/glasgow-haskell-compiler/bindisttest/install dir/lib/ghc-8.7.20180807/rts/libHSrts_l.a(elf_util.l_o) has no symbols
876/Applications/Xcode-7.2/Xcode.app/Contents/Developer/Toolchains/XcodeDefault.xctoolchain/usr/bin/ranlib: file: /var/drydock/workingcopy-121269/repo/glasgow-haskell-compiler/bindisttest/install dir/lib/ghc-8.7.20180807/rts/libHSrts_debug.a(LdvProfile.debug_o) has no symbols
877/Applications/Xcode-7.2/Xcode.app/Contents/Developer/Toolchains/XcodeDefault.xctoolchain/usr/bin/ranlib: file: /var/drydock/workingcopy-121269/repo/glasgow-haskell-compiler/bindisttest/install dir/lib/ghc-8.7.20180807/rts/libHSrts_debug.a(OldARMAtomic.debug_o) has no symbols
878/Applications/Xcode-7.2/Xcode.app/Contents/Developer/Toolchains/XcodeDefault.xctoolchain/usr/bin/ranlib: file: /var/drydock/workingcopy-121269/repo/glasgow-haskell-compiler/bindisttest/install dir/lib/ghc-8.7.20180807/rts/libHSrts_debug.a(ProfilerReport.debug_o) has no symbols
879/Applications/Xcode-7.2/Xcode.app/Contents/Developer/Toolchains/XcodeDefault.xctoolchain/usr/bin/ranlib: file: /var/drydock/workingcopy-121269/repo/glasgow-haskell-compiler/bindisttest/install dir/lib/ghc-8.7.20180807/rts/libHSrts_debug.a(ProfilerReportJson.debug_o) has no symbols
880/Applications/Xcode-7.2/Xcode.app/Contents/Developer/Toolchains/XcodeDefault.xctoolchain/usr/bin/ranlib: file: /var/drydock/workingcopy-121269/repo/glasgow-haskell-compiler/bindisttest/install dir/lib/ghc-8.7.20180807/rts/libHSrts_debug.a(Profiling.debug_o) has no symbols
881/Applications/Xcode-7.2/Xcode.app/Contents/Developer/Toolchains/XcodeDefault.xctoolchain/usr/bin/ranlib: file: /var/drydock/workingcopy-121269/repo/glasgow-haskell-compiler/bindisttest/install dir/lib/ghc-8.7.20180807/rts/libHSrts_debug.a(RetainerProfile.debug_o) has no symbols
882/Applications/Xcode-7.2/Xcode.app/Contents/Developer/Toolchains/XcodeDefault.xctoolchain/usr/bin/ranlib: file: /var/drydock/workingcopy-121269/repo/glasgow-haskell-compiler/bindisttest/install dir/lib/ghc-8.7.20180807/rts/libHSrts_debug.a(RetainerSet.debug_o) has no symbols
883/Applications/Xcode-7.2/Xcode.app/Contents/Developer/Toolchains/XcodeDefault.xctoolchain/usr/bin/ranlib: file: /var/drydock/workingcopy-121269/repo/glasgow-haskell-compiler/bindisttest/install dir/lib/ghc-8.7.20180807/rts/libHSrts_debug.a(RtsDllMain.debug_o) has no symbols
884/Applications/Xcode-7.2/Xcode.app/Contents/Developer/Toolchains/XcodeDefault.xctoolchain/usr/bin/ranlib: file: /var/drydock/workingcopy-121269/repo/glasgow-haskell-compiler/bindisttest/install dir/lib/ghc-8.7.20180807/rts/libHSrts_debug.a(Evac_thr.debug_o) has no symbols
885/Applications/Xcode-7.2/Xcode.app/Contents/Developer/Toolchains/XcodeDefault.xctoolchain/usr/bin/ranlib: file: /var/drydock/workingcopy-121269/repo/glasgow-haskell-compiler/bindisttest/install dir/lib/ghc-8.7.20180807/rts/libHSrts_debug.a(Scav_thr.debug_o) has no symbols
886/Applications/Xcode-7.2/Xcode.app/Contents/Developer/Toolchains/XcodeDefault.xctoolchain/usr/bin/ranlib: file: /var/drydock/workingcopy-121269/repo/glasgow-haskell-compiler/bindisttest/install dir/lib/ghc-8.7.20180807/rts/libHSrts_debug.a(Elf.debug_o) has no symbols
887/Applications/Xcode-7.2/Xcode.app/Contents/Developer/Toolchains/XcodeDefault.xctoolchain/usr/bin/ranlib: file: /var/drydock/workingcopy-121269/repo/glasgow-haskell-compiler/bindisttest/install dir/lib/ghc-8.7.20180807/rts/libHSrts_debug.a(PEi386.debug_o) has no symbols
888/Applications/Xcode-7.2/Xcode.app/Contents/Developer/Toolchains/XcodeDefault.xctoolchain/usr/bin/ranlib: file: /var/drydock/workingcopy-121269/repo/glasgow-haskell-compiler/bindisttest/install dir/lib/ghc-8.7.20180807/rts/libHSrts_debug.a(elf_got.debug_o) has no symbols
889/Applications/Xcode-7.2/Xcode.app/Contents/Developer/Toolchains/XcodeDefault.xctoolchain/usr/bin/ranlib: file: /var/drydock/workingcopy-121269/repo/glasgow-haskell-compiler/bindisttest/install dir/lib/ghc-8.7.20180807/rts/libHSrts_debug.a(elf_plt.debug_o) has no symbols
890/Applications/Xcode-7.2/Xcode.app/Contents/Developer/Toolchains/XcodeDefault.xctoolchain/usr/bin/ranlib: file: /var/drydock/workingcopy-121269/repo/glasgow-haskell-compiler/bindisttest/install dir/lib/ghc-8.7.20180807/rts/libHSrts_debug.a(elf_plt_aarch64.debug_o) has no symbols
891/Applications/Xcode-7.2/Xcode.app/Contents/Developer/Toolchains/XcodeDefault.xctoolchain/usr/bin/ranlib: file: /var/drydock/workingcopy-121269/repo/glasgow-haskell-compiler/bindisttest/install dir/lib/ghc-8.7.20180807/rts/libHSrts_debug.a(elf_plt_arm.debug_o) has no symbols
892/Applications/Xcode-7.2/Xcode.app/Contents/Developer/Toolchains/XcodeDefault.xctoolchain/usr/bin/ranlib: file: /var/drydock/workingcopy-121269/repo/glasgow-haskell-compiler/bindisttest/install dir/lib/ghc-8.7.20180807/rts/libHSrts_debug.a(elf_reloc.debug_o) has no symbols
893/Applications/Xcode-7.2/Xcode.app/Contents/Developer/Toolchains/XcodeDefault.xctoolchain/usr/bin/ranlib: file: /var/drydock/workingcopy-121269/repo/glasgow-haskell-compiler/bindisttest/install dir/lib/ghc-8.7.20180807/rts/libHSrts_debug.a(elf_reloc_aarch64.debug_o) has no symbols
894/Applications/Xcode-7.2/Xcode.app/Contents/Developer/Toolchains/XcodeDefault.xctoolchain/usr/bin/ranlib: file: /var/drydock/workingcopy-121269/repo/glasgow-haskell-compiler/bindisttest/install dir/lib/ghc-8.7.20180807/rts/libHSrts_debug.a(elf_util.debug_o) has no symbols
895/Applications/Xcode-7.2/Xcode.app/Contents/Developer/Toolchains/XcodeDefault.xctoolchain/usr/bin/ranlib: file: /var/drydock/workingcopy-121269/repo/glasgow-haskell-compiler/bindisttest/install dir/lib/ghc-8.7.20180807/rts/libHSrts_thr.a(Disassembler.thr_o) has no symbols
896/Applications/Xcode-7.2/Xcode.app/Contents/Developer/Toolchains/XcodeDefault.xctoolchain/usr/bin/ranlib: file: /var/drydock/workingcopy-121269/repo/glasgow-haskell-compiler/bindisttest/install dir/lib/ghc-8.7.20180807/rts/libHSrts_thr.a(LdvProfile.thr_o) has no symbols
897/Applications/Xcode-7.2/Xcode.app/Contents/Developer/Toolchains/XcodeDefault.xctoolchain/usr/bin/ranlib: file: /var/drydock/workingcopy-121269/repo/glasgow-haskell-compiler/bindisttest/install dir/lib/ghc-8.7.20180807/rts/libHSrts_thr.a(OldARMAtomic.thr_o) has no symbols
898/Applications/Xcode-7.2/Xcode.app/Contents/Developer/Toolchains/XcodeDefault.xctoolchain/usr/bin/ranlib: file: /var/drydock/workingcopy-121269/repo/glasgow-haskell-compiler/bindisttest/install dir/lib/ghc-8.7.20180807/rts/libHSrts_thr.a(ProfilerReport.thr_o) has no symbols
899/Applications/Xcode-7.2/Xcode.app/Contents/Developer/Toolchains/XcodeDefault.xctoolchain/usr/bin/ranlib: file: /var/drydock/workingcopy-121269/repo/glasgow-haskell-compiler/bindisttest/install dir/lib/ghc-8.7.20180807/rts/libHSrts_thr.a(ProfilerReportJson.thr_o) has no symbols
900/Applications/Xcode-7.2/Xcode.app/Contents/Developer/Toolchains/XcodeDefault.xctoolchain/usr/bin/ranlib: file: /var/drydock/workingcopy-121269/repo/glasgow-haskell-compiler/bindisttest/install dir/lib/ghc-8.7.20180807/rts/libHSrts_thr.a(Profiling.thr_o) has no symbols
901/Applications/Xcode-7.2/Xcode.app/Contents/Developer/Toolchains/XcodeDefault.xctoolchain/usr/bin/ranlib: file: /var/drydock/workingcopy-121269/repo/glasgow-haskell-compiler/bindisttest/install dir/lib/ghc-8.7.20180807/rts/libHSrts_thr.a(RetainerProfile.thr_o) has no symbols
902/Applications/Xcode-7.2/Xcode.app/Contents/Developer/Toolchains/XcodeDefault.xctoolchain/usr/bin/ranlib: file: /var/drydock/workingcopy-121269/repo/glasgow-haskell-compiler/bindisttest/install dir/lib/ghc-8.7.20180807/rts/libHSrts_thr.a(RetainerSet.thr_o) has no symbols
903/Applications/Xcode-7.2/Xcode.app/Contents/Developer/Toolchains/XcodeDefault.xctoolchain/usr/bin/ranlib: file: /var/drydock/workingcopy-121269/repo/glasgow-haskell-compiler/bindisttest/install dir/lib/ghc-8.7.20180807/rts/libHSrts_thr.a(RtsDllMain.thr_o) has no symbols
904/Applications/Xcode-7.2/Xcode.app/Contents/Developer/Toolchains/XcodeDefault.xctoolchain/usr/bin/ranlib: file: /var/drydock/workingcopy-121269/repo/glasgow-haskell-compiler/bindisttest/install dir/lib/ghc-8.7.20180807/rts/libHSrts_thr.a(Sanity.thr_o) has no symbols
905/Applications/Xcode-7.2/Xcode.app/Contents/Developer/Toolchains/XcodeDefault.xctoolchain/usr/bin/ranlib: file: /var/drydock/workingcopy-121269/repo/glasgow-haskell-compiler/bindisttest/install dir/lib/ghc-8.7.20180807/rts/libHSrts_thr.a(EventLog.thr_o) has no symbols
906/Applications/Xcode-7.2/Xcode.app/Contents/Developer/Toolchains/XcodeDefault.xctoolchain/usr/bin/ranlib: file: /var/drydock/workingcopy-121269/repo/glasgow-haskell-compiler/bindisttest/install dir/lib/ghc-8.7.20180807/rts/libHSrts_thr.a(Elf.thr_o) has no symbols
907/Applications/Xcode-7.2/Xcode.app/Contents/Developer/Toolchains/XcodeDefault.xctoolchain/usr/bin/ranlib: file: /var/drydock/workingcopy-121269/repo/glasgow-haskell-compiler/bindisttest/install dir/lib/ghc-8.7.20180807/rts/libHSrts_thr.a(PEi386.thr_o) has no symbols
908/Applications/Xcode-7.2/Xcode.app/Contents/Developer/Toolchains/XcodeDefault.xctoolchain/usr/bin/ranlib: file: /var/drydock/workingcopy-121269/repo/glasgow-haskell-compiler/bindisttest/install dir/lib/ghc-8.7.20180807/rts/libHSrts_thr.a(elf_got.thr_o) has no symbols
909/Applications/Xcode-7.2/Xcode.app/Contents/Developer/Toolchains/XcodeDefault.xctoolchain/usr/bin/ranlib: file: /var/drydock/workingcopy-121269/repo/glasgow-haskell-compiler/bindisttest/install dir/lib/ghc-8.7.20180807/rts/libHSrts_thr.a(elf_plt.thr_o) has no symbols
910/Applications/Xcode-7.2/Xcode.app/Contents/Developer/Toolchains/XcodeDefault.xctoolchain/usr/bin/ranlib: file: /var/drydock/workingcopy-121269/repo/glasgow-haskell-compiler/bindisttest/install dir/lib/ghc-8.7.20180807/rts/libHSrts_thr.a(elf_plt_aarch64.thr_o) has no symbols
911/Applications/Xcode-7.2/Xcode.app/Contents/Developer/Toolchains/XcodeDefault.xctoolchain/usr/bin/ranlib: file: /var/drydock/workingcopy-121269/repo/glasgow-haskell-compiler/bindisttest/install dir/lib/ghc-8.7.20180807/rts/libHSrts_thr.a(elf_plt_arm.thr_o) has no symbols
912/Applications/Xcode-7.2/Xcode.app/Contents/Developer/Toolchains/XcodeDefault.xctoolchain/usr/bin/ranlib: file: /var/drydock/workingcopy-121269/repo/glasgow-haskell-compiler/bindisttest/install dir/lib/ghc-8.7.20180807/rts/libHSrts_thr.a(elf_reloc.thr_o) has no symbols
913/Applications/Xcode-7.2/Xcode.app/Contents/Developer/Toolchains/XcodeDefault.xctoolchain/usr/bin/ranlib: file: /var/drydock/workingcopy-121269/repo/glasgow-haskell-compiler/bindisttest/install dir/lib/ghc-8.7.20180807/rts/libHSrts_thr.a(elf_reloc_aarch64.thr_o) has no symbols
914/Applications/Xcode-7.2/Xcode.app/Contents/Developer/Toolchains/XcodeDefault.xctoolchain/usr/bin/ranlib: file: /var/drydock/workingcopy-121269/repo/glasgow-haskell-compiler/bindisttest/install dir/lib/ghc-8.7.20180807/rts/libHSrts_thr.a(elf_util.thr_o) has no symbols
915/Applications/Xcode-7.2/Xcode.app/Contents/Developer/Toolchains/XcodeDefault.xctoolchain/usr/bin/ranlib: file: /var/drydock/workingcopy-121269/repo/glasgow-haskell-compiler/bindisttest/install dir/lib/ghc-8.7.20180807/rts/libHSrts_thr.a(Select.thr_o) has no symbols
916/Applications/Xcode-7.2/Xcode.app/Contents/Developer/Toolchains/XcodeDefault.xctoolchain/usr/bin/ranlib: file: /var/drydock/workingcopy-121269/repo/glasgow-haskell-compiler/bindisttest/install dir/lib/ghc-8.7.20180807/rts/libHSrts_thr_debug.a(LdvProfile.thr_debug_o) has no symbols
917/Applications/Xcode-7.2/Xcode.app/Contents/Developer/Toolchains/XcodeDefault.xctoolchain/usr/bin/ranlib: file: /var/drydock/workingcopy-121269/repo/glasgow-haskell-compiler/bindisttest/install dir/lib/ghc-8.7.20180807/rts/libHSrts_thr_debug.a(OldARMAtomic.thr_debug_o) has no symbols
918/Applications/Xcode-7.2/Xcode.app/Contents/Developer/Toolchains/XcodeDefault.xctoolchain/usr/bin/ranlib: file: /var/drydock/workingcopy-121269/repo/glasgow-haskell-compiler/bindisttest/install dir/lib/ghc-8.7.20180807/rts/libHSrts_thr_debug.a(ProfilerReport.thr_debug_o) has no symbols
919/Applications/Xcode-7.2/Xcode.app/Contents/Developer/Toolchains/XcodeDefault.xctoolchain/usr/bin/ranlib: file: /var/drydock/workingcopy-121269/repo/glasgow-haskell-compiler/bindisttest/install dir/lib/ghc-8.7.20180807/rts/libHSrts_thr_debug.a(ProfilerReportJson.thr_debug_o) has no symbols
920/Applications/Xcode-7.2/Xcode.app/Contents/Developer/Toolchains/XcodeDefault.xctoolchain/usr/bin/ranlib: file: /var/drydock/workingcopy-121269/repo/glasgow-haskell-compiler/bindisttest/install dir/lib/ghc-8.7.20180807/rts/libHSrts_thr_debug.a(Profiling.thr_debug_o) has no symbols
921/Applications/Xcode-7.2/Xcode.app/Contents/Developer/Toolchains/XcodeDefault.xctoolchain/usr/bin/ranlib: file: /var/drydock/workingcopy-121269/repo/glasgow-haskell-compiler/bindisttest/install dir/lib/ghc-8.7.20180807/rts/libHSrts_thr_debug.a(RetainerProfile.thr_debug_o) has no symbols
922/Applications/Xcode-7.2/Xcode.app/Contents/Developer/Toolchains/XcodeDefault.xctoolchain/usr/bin/ranlib: file: /var/drydock/workingcopy-121269/repo/glasgow-haskell-compiler/bindisttest/install dir/lib/ghc-8.7.20180807/rts/libHSrts_thr_debug.a(RetainerSet.thr_debug_o) has no symbols
923/Applications/Xcode-7.2/Xcode.app/Contents/Developer/Toolchains/XcodeDefault.xctoolchain/usr/bin/ranlib: file: /var/drydock/workingcopy-121269/repo/glasgow-haskell-compiler/bindisttest/install dir/lib/ghc-8.7.20180807/rts/libHSrts_thr_debug.a(RtsDllMain.thr_debug_o) has no symbols
924/Applications/Xcode-7.2/Xcode.app/Contents/Developer/Toolchains/XcodeDefault.xctoolchain/usr/bin/ranlib: file: /var/drydock/workingcopy-121269/repo/glasgow-haskell-compiler/bindisttest/install dir/lib/ghc-8.7.20180807/rts/libHSrts_thr_debug.a(Elf.thr_debug_o) has no symbols
925/Applications/Xcode-7.2/Xcode.app/Contents/Developer/Toolchains/XcodeDefault.xctoolchain/usr/bin/ranlib: file: /var/drydock/workingcopy-121269/repo/glasgow-haskell-compiler/bindisttest/install dir/lib/ghc-8.7.20180807/rts/libHSrts_thr_debug.a(PEi386.thr_debug_o) has no symbols
926/Applications/Xcode-7.2/Xcode.app/Contents/Developer/Toolchains/XcodeDefault.xctoolchain/usr/bin/ranlib: file: /var/drydock/workingcopy-121269/repo/glasgow-haskell-compiler/bindisttest/install dir/lib/ghc-8.7.20180807/rts/libHSrts_thr_debug.a(elf_got.thr_debug_o) has no symbols
927/Applications/Xcode-7.2/Xcode.app/Contents/Developer/Toolchains/XcodeDefault.xctoolchain/usr/bin/ranlib: file: /var/drydock/workingcopy-121269/repo/glasgow-haskell-compiler/bindisttest/install dir/lib/ghc-8.7.20180807/rts/libHSrts_thr_debug.a(elf_plt.thr_debug_o) has no symbols
928/Applications/Xcode-7.2/Xcode.app/Contents/Developer/Toolchains/XcodeDefault.xctoolchain/usr/bin/ranlib: file: /var/drydock/workingcopy-121269/repo/glasgow-haskell-compiler/bindisttest/install dir/lib/ghc-8.7.20180807/rts/libHSrts_thr_debug.a(elf_plt_aarch64.thr_debug_o) has no symbols
929/Applications/Xcode-7.2/Xcode.app/Contents/Developer/Toolchains/XcodeDefault.xctoolchain/usr/bin/ranlib: file: /var/drydock/workingcopy-121269/repo/glasgow-haskell-compiler/bindisttest/install dir/lib/ghc-8.7.20180807/rts/libHSrts_thr_debug.a(elf_plt_arm.thr_debug_o) has no symbols
930/Applications/Xcode-7.2/Xcode.app/Contents/Developer/Toolchains/XcodeDefault.xctoolchain/usr/bin/ranlib: file: /var/drydock/workingcopy-121269/repo/glasgow-haskell-compiler/bindisttest/install dir/lib/ghc-8.7.20180807/rts/libHSrts_thr_debug.a(elf_reloc.thr_debug_o) has no symbols
931/Applications/Xcode-7.2/Xcode.app/Contents/Developer/Toolchains/XcodeDefault.xctoolchain/usr/bin/ranlib: file: /var/drydock/workingcopy-121269/repo/glasgow-haskell-compiler/bindisttest/install dir/lib/ghc-8.7.20180807/rts/libHSrts_thr_debug.a(elf_reloc_aarch64.thr_debug_o) has no symbols
932/Applications/Xcode-7.2/Xcode.app/Contents/Developer/Toolchains/XcodeDefault.xctoolchain/usr/bin/ranlib: file: /var/drydock/workingcopy-121269/repo/glasgow-haskell-compiler/bindisttest/install dir/lib/ghc-8.7.20180807/rts/libHSrts_thr_debug.a(elf_util.thr_debug_o) has no symbols
933/Applications/Xcode-7.2/Xcode.app/Contents/Developer/Toolchains/XcodeDefault.xctoolchain/usr/bin/ranlib: file: /var/drydock/workingcopy-121269/repo/glasgow-haskell-compiler/bindisttest/install dir/lib/ghc-8.7.20180807/rts/libHSrts_thr_debug.a(Select.thr_debug_o) has no symbols
934/Applications/Xcode-7.2/Xcode.app/Contents/Developer/Toolchains/XcodeDefault.xctoolchain/usr/bin/ranlib: file: /var/drydock/workingcopy-121269/repo/glasgow-haskell-compiler/bindisttest/install dir/lib/ghc-8.7.20180807/rts/libHSrts_thr_l.a(Disassembler.thr_l_o) has no symbols
935/Applications/Xcode-7.2/Xcode.app/Contents/Developer/Toolchains/XcodeDefault.xctoolchain/usr/bin/ranlib: file: /var/drydock/workingcopy-121269/repo/glasgow-haskell-compiler/bindisttest/install dir/lib/ghc-8.7.20180807/rts/libHSrts_thr_l.a(LdvProfile.thr_l_o) has no symbols
936/Applications/Xcode-7.2/Xcode.app/Contents/Developer/Toolchains/XcodeDefault.xctoolchain/usr/bin/ranlib: file: /var/drydock/workingcopy-121269/repo/glasgow-haskell-compiler/bindisttest/install dir/lib/ghc-8.7.20180807/rts/libHSrts_thr_l.a(OldARMAtomic.thr_l_o) has no symbols
937/Applications/Xcode-7.2/Xcode.app/Contents/Developer/Toolchains/XcodeDefault.xctoolchain/usr/bin/ranlib: file: /var/drydock/workingcopy-121269/repo/glasgow-haskell-compiler/bindisttest/install dir/lib/ghc-8.7.20180807/rts/libHSrts_thr_l.a(ProfilerReport.thr_l_o) has no symbols
938/Applications/Xcode-7.2/Xcode.app/Contents/Developer/Toolchains/XcodeDefault.xctoolchain/usr/bin/ranlib: file: /var/drydock/workingcopy-121269/repo/glasgow-haskell-compiler/bindisttest/install dir/lib/ghc-8.7.20180807/rts/libHSrts_thr_l.a(ProfilerReportJson.thr_l_o) has no symbols
939/Applications/Xcode-7.2/Xcode.app/Contents/Developer/Toolchains/XcodeDefault.xctoolchain/usr/bin/ranlib: file: /var/drydock/workingcopy-121269/repo/glasgow-haskell-compiler/bindisttest/install dir/lib/ghc-8.7.20180807/rts/libHSrts_thr_l.a(Profiling.thr_l_o) has no symbols
940/Applications/Xcode-7.2/Xcode.app/Contents/Developer/Toolchains/XcodeDefault.xctoolchain/usr/bin/ranlib: file: /var/drydock/workingcopy-121269/repo/glasgow-haskell-compiler/bindisttest/install dir/lib/ghc-8.7.20180807/rts/libHSrts_thr_l.a(RetainerProfile.thr_l_o) has no symbols
941/Applications/Xcode-7.2/Xcode.app/Contents/Developer/Toolchains/XcodeDefault.xctoolchain/usr/bin/ranlib: file: /var/drydock/workingcopy-121269/repo/glasgow-haskell-compiler/bindisttest/install dir/lib/ghc-8.7.20180807/rts/libHSrts_thr_l.a(RetainerSet.thr_l_o) has no symbols
942/Applications/Xcode-7.2/Xcode.app/Contents/Developer/Toolchains/XcodeDefault.xctoolchain/usr/bin/ranlib: file: /var/drydock/workingcopy-121269/repo/glasgow-haskell-compiler/bindisttest/install dir/lib/ghc-8.7.20180807/rts/libHSrts_thr_l.a(RtsDllMain.thr_l_o) has no symbols
943/Applications/Xcode-7.2/Xcode.app/Contents/Developer/Toolchains/XcodeDefault.xctoolchain/usr/bin/ranlib: file: /var/drydock/workingcopy-121269/repo/glasgow-haskell-compiler/bindisttest/install dir/lib/ghc-8.7.20180807/rts/libHSrts_thr_l.a(Sanity.thr_l_o) has no symbols
944/Applications/Xcode-7.2/Xcode.app/Contents/Developer/Toolchains/XcodeDefault.xctoolchain/usr/bin/ranlib: file: /var/drydock/workingcopy-121269/repo/glasgow-haskell-compiler/bindisttest/install dir/lib/ghc-8.7.20180807/rts/libHSrts_thr_l.a(Elf.thr_l_o) has no symbols
945/Applications/Xcode-7.2/Xcode.app/Contents/Developer/Toolchains/XcodeDefault.xctoolchain/usr/bin/ranlib: file: /var/drydock/workingcopy-121269/repo/glasgow-haskell-compiler/bindisttest/install dir/lib/ghc-8.7.20180807/rts/libHSrts_thr_l.a(PEi386.thr_l_o) has no symbols
946/Applications/Xcode-7.2/Xcode.app/Contents/Developer/Toolchains/XcodeDefault.xctoolchain/usr/bin/ranlib: file: /var/drydock/workingcopy-121269/repo/glasgow-haskell-compiler/bindisttest/install dir/lib/ghc-8.7.20180807/rts/libHSrts_thr_l.a(elf_got.thr_l_o) has no symbols
947/Applications/Xcode-7.2/Xcode.app/Contents/Developer/Toolchains/XcodeDefault.xctoolchain/usr/bin/ranlib: file: /var/drydock/workingcopy-121269/repo/glasgow-haskell-compiler/bindisttest/install dir/lib/ghc-8.7.20180807/rts/libHSrts_thr_l.a(elf_plt.thr_l_o) has no symbols
948/Applications/Xcode-7.2/Xcode.app/Contents/Developer/Toolchains/XcodeDefault.xctoolchain/usr/bin/ranlib: file: /var/drydock/workingcopy-121269/repo/glasgow-haskell-compiler/bindisttest/install dir/lib/ghc-8.7.20180807/rts/libHSrts_thr_l.a(elf_plt_aarch64.thr_l_o) has no symbols
949/Applications/Xcode-7.2/Xcode.app/Contents/Developer/Toolchains/XcodeDefault.xctoolchain/usr/bin/ranlib: file: /var/drydock/workingcopy-121269/repo/glasgow-haskell-compiler/bindisttest/install dir/lib/ghc-8.7.20180807/rts/libHSrts_thr_l.a(elf_plt_arm.thr_l_o) has no symbols
950/Applications/Xcode-7.2/Xcode.app/Contents/Developer/Toolchains/XcodeDefault.xctoolchain/usr/bin/ranlib: file: /var/drydock/workingcopy-121269/repo/glasgow-haskell-compiler/bindisttest/install dir/lib/ghc-8.7.20180807/rts/libHSrts_thr_l.a(elf_reloc.thr_l_o) has no symbols
951/Applications/Xcode-7.2/Xcode.app/Contents/Developer/Toolchains/XcodeDefault.xctoolchain/usr/bin/ranlib: file: /var/drydock/workingcopy-121269/repo/glasgow-haskell-compiler/bindisttest/install dir/lib/ghc-8.7.20180807/rts/libHSrts_thr_l.a(elf_reloc_aarch64.thr_l_o) has no symbols
952/Applications/Xcode-7.2/Xcode.app/Contents/Developer/Toolchains/XcodeDefault.xctoolchain/usr/bin/ranlib: file: /var/drydock/workingcopy-121269/repo/glasgow-haskell-compiler/bindisttest/install dir/lib/ghc-8.7.20180807/rts/libHSrts_thr_l.a(elf_util.thr_l_o) has no symbols
953/Applications/Xcode-7.2/Xcode.app/Contents/Developer/Toolchains/XcodeDefault.xctoolchain/usr/bin/ranlib: file: /var/drydock/workingcopy-121269/repo/glasgow-haskell-compiler/bindisttest/install dir/lib/ghc-8.7.20180807/rts/libHSrts_thr_l.a(Select.thr_l_o) has no symbols
954make[3]: *** [install_packages] Segmentation fault: 11
955make[2]: *** [install] Error 2
956make[1]: *** [test_bindist] Error 2
957make: *** [test_bindist] Error 2
958

Build Log 290994 (remote - stdout)
25 - 50 - 100 - Unlimited Lines

8052 OnOff SseVersion BmiVersion modSummary tm_internals DesugaredMod WhetherHasFamInst holeUnitId
8053Warning: DriverBkp: could not find link destinations for:
8054 BkpEnv BkpM backpackProgressMsg
8055===--- building phase 0
8056===--- building phase 1
8057===--- building final phase
8058checking build system type... x86_64-apple-darwin16.0.0
8059checking host system type... x86_64-apple-darwin16.0.0
8060checking target system type... x86_64-apple-darwin16.0.0
8061Build platform inferred as: x86_64-apple-darwin
8062Host platform inferred as: x86_64-apple-darwin
8063Target platform inferred as: x86_64-apple-darwin
8064GHC build : x86_64-apple-darwin
8065GHC host : x86_64-apple-darwin
8066GHC target : x86_64-apple-darwin
8067LLVM target: x86_64-apple-darwin
8068checking for path to top of build tree... /var/drydock/workingcopy-121269/repo/glasgow-haskell-compiler/bindisttest/a/b/c/ghc-8.7.20180807
8069checking for perl... /usr/bin/perl
8070checking for a BSD-compatible install... /usr/local/bin/ginstall -c
8071checking for gfind... no
8072checking for find... /usr/bin/find
8073checking whether ln -s works... yes
8074checking for gsed... sed
8075checking XCode version... 8.0
8076configure: XCode version component 1: 8
8077configure: XCode version component 2: 0
8078checking whether the C compiler works... yes
8079checking for C compiler default output file name... a.out
8080checking for suffix of executables...
8081checking whether we are cross compiling... no
8082checking for suffix of object files... o
8083checking whether we are using the GNU C compiler... yes
8084checking whether gcc accepts -g... yes
8085checking for gcc option to accept ISO C89... none needed
8086checking how to run the C preprocessor... gcc -E
8087checking for gcc option to accept ISO C99... none needed
8088checking for gcc option to accept ISO C99... none needed
8089checking for gcc option to accept ISO C99... none needed
8090checking for -ld.lld... no
8091checking for ld.lld... ld.lld
8092checking whether C compiler supports -fuse-ld=lld... no
8093configure: unable to convince 'gcc' to use linker 'ld.lld'
8094checking for -ld.gold... no
8095checking for ld.gold... no
8096checking for -ld... no
8097checking for ld... ld
8098configure: unknown linker version
8099configure: unable to convince 'gcc' to use linker 'ld'
8100checking for -ld... no
8101checking for ld... ld
8102checking whether ld is GNU ld... NO
8103checking whether ld understands --build-id... no
8104checking whether ld understands -no_compact_unwind... yes
8105checking whether ld understands -filelist... yes
8106checking for -strip... no
8107checking for strip... strip
8108checking for llc-6.0... no
8109checking for llc... llc
8110checking llc is version 6.0... no
8111checking for opt-6.0... no
8112checking for opt... opt
8113checking opt is version 6.0... no
8114checking version of gcc... 8.0.0
8115checking whether GCC supports -no-pie... no
8116checking for extra options to pass gcc when compiling via C... -fwrapv -fno-builtin
8117checking Setting up CFLAGS, LDFLAGS, IGNORE_LINKER_LD_FLAGS and CPPFLAGS... done
8118checking Setting up CONF_CC_OPTS_STAGE0, CONF_GCC_LINKER_OPTS_STAGE0, CONF_LD_LINKER_OPTS_STAGE0 and CONF_CPP_OPTS_STAGE0... done
8119checking Setting up CONF_CC_OPTS_STAGE1, CONF_GCC_LINKER_OPTS_STAGE1, CONF_LD_LINKER_OPTS_STAGE1 and CONF_CPP_OPTS_STAGE1... done
8120checking Setting up CONF_CC_OPTS_STAGE2, CONF_GCC_LINKER_OPTS_STAGE2, CONF_LD_LINKER_OPTS_STAGE2 and CONF_CPP_OPTS_STAGE2... done
8121checking for .subsections_via_symbols... yes
8122checking whether your assembler supports .ident directive... yes
8123checking for GNU non-executable stack support... no
8124checking for grep that handles long lines and -e... /usr/bin/grep
8125checking for egrep... /usr/bin/grep -E
8126checking for ANSI C header files... yes
8127checking for sys/types.h... yes
8128checking for sys/stat.h... yes
8129checking for stdlib.h... yes
8130checking for string.h... yes
8131checking for memory.h... yes
8132checking for strings.h... yes
8133checking for inttypes.h... yes
8134checking for stdint.h... yes
8135checking for unistd.h... yes
8136checking size of void *... 8
8137checking for -ar... no
8138checking for ar... ar
8139checking whether ar is GNU ar... no
8140checking for ar arguments... qcls
8141checking whether ar supports @file... no
8142checking for ranlib... ranlib
8143configure: creating ./config.status
8144config.status: creating settings
8145config.status: creating mk/config.mk
8146config.status: creating mk/install.mk
8147****************************************************
8148Configuration done, ready to 'make install'
8149(see README and INSTALL files for more info.)
8150****************************************************
8151

Drydock: Prepare tree

When
Completed at Aug 7 2018, 3:50 PM · Built for 13 s
Status
Passed

Build Log 290993 (remote - stderr)
25 - 50 - 100 - Unlimited Lines

1+ git clean -qxfd
2+ git submodule sync
3+ git submodule update --init --recursive
4+ git submodule foreach -q git clean -qxfd
5

Build Log 290992 (remote - stdout)
25 - 50 - 100 - Unlimited Lines

1Synchronizing submodule url for '.arc-linters/arcanist-external-json-linter'
2Synchronizing submodule url for 'hadrian'
3Synchronizing submodule url for 'libffi-tarballs'
4Synchronizing submodule url for 'libraries/Cabal'
5Synchronizing submodule url for 'libraries/Win32'
6Synchronizing submodule url for 'libraries/array'
7Synchronizing submodule url for 'libraries/binary'
8Synchronizing submodule url for 'libraries/bytestring'
9Synchronizing submodule url for 'libraries/containers'
10Synchronizing submodule url for 'libraries/deepseq'
11Synchronizing submodule url for 'libraries/directory'
12Synchronizing submodule url for 'libraries/filepath'
13Synchronizing submodule url for 'libraries/haskeline'
14Synchronizing submodule url for 'libraries/hpc'
15Synchronizing submodule url for 'libraries/integer-gmp/gmp/gmp-tarballs'
16Synchronizing submodule url for 'libraries/mtl'
17Synchronizing submodule url for 'libraries/parallel'
18Synchronizing submodule url for 'libraries/parsec'
19Synchronizing submodule url for 'libraries/pretty'
20Synchronizing submodule url for 'libraries/process'
21Synchronizing submodule url for 'libraries/stm'
22Synchronizing submodule url for 'libraries/terminfo'
23Synchronizing submodule url for 'libraries/text'
24Synchronizing submodule url for 'libraries/time'
25Synchronizing submodule url for 'libraries/transformers'
26Synchronizing submodule url for 'libraries/unix'
27Synchronizing submodule url for 'libraries/xhtml'
28Synchronizing submodule url for 'nofib'
29Synchronizing submodule url for 'utils/haddock'
30Synchronizing submodule url for 'utils/hsc2hs'
31Submodule path 'hadrian': checked out '4265e3aab7df92722b81148cf8bf3954ebfc2d21'
32Submodule path 'libraries/Cabal': checked out '6671506b488a0fe2079f9059a23510b35514c031'
33Submodule path 'libraries/binary': checked out '38adf7ce1ad6a497fba61de500c3f35b186303a9'
34Submodule path 'libraries/directory': checked out 'e9debc1d4a9c4b608a32f60bae173ed10f89fdce'
35Submodule path 'libraries/filepath': checked out 'b10724be8a907e191d153ad6674415be0c1325fd'
36Submodule path 'libraries/haskeline': checked out '84a7b2b0afb9325cfcedc3ca56603539f0e8af3e'
37Submodule path 'libraries/mtl': checked out 'c7d396732bd45e409478bd4df1d0ca95d6f39356'
38Submodule path 'libraries/parallel': checked out '5015bc74127beac29b4d08dcb3beb230149fed25'
39Submodule path 'libraries/stm': checked out '4c24db6071fc1319232934562f7dbed45d498831'
40Submodule path 'libraries/terminfo': checked out '27e82750fac178fc6e049fe44be6de45f24814ae'
41Submodule path 'libraries/unix': checked out 'ee3e99a0d8a75edc90a1a4e9fb1c593a99a02bb9'
42Submodule path 'libraries/xhtml': checked out '721779acc35dccd6a43a292b24099b65d93d390c'
43Submodule path 'utils/haddock': checked out 'a264b6b3e41dd42946110afcf5000341e5fb3a6d'
44

Lease Working Copy

When
Completed at Aug 7 2018, 3:49 PM · Built for 39 s
Status
Passed
Description

Lease a working copy for OSX/amd64 builds.