Build 51368

Drydock: Build

When
Completed at Aug 7 2018, 5:07 PM · Built for 1 h, 17 m
Status
Failed
Description

Run the build.

Build Log 290995 (remote - stderr)
25 - 50 - 100 - Unlimited Lines

934/Applications/Xcode-7.2/Xcode.app/Contents/Developer/Toolchains/XcodeDefault.xctoolchain/usr/bin/ranlib: file: /var/drydock/workingcopy-121269/repo/glasgow-haskell-compiler/bindisttest/install dir/lib/ghc-8.7.20180807/rts/libHSrts_thr_l.a(Disassembler.thr_l_o) has no symbols
935/Applications/Xcode-7.2/Xcode.app/Contents/Developer/Toolchains/XcodeDefault.xctoolchain/usr/bin/ranlib: file: /var/drydock/workingcopy-121269/repo/glasgow-haskell-compiler/bindisttest/install dir/lib/ghc-8.7.20180807/rts/libHSrts_thr_l.a(LdvProfile.thr_l_o) has no symbols
936/Applications/Xcode-7.2/Xcode.app/Contents/Developer/Toolchains/XcodeDefault.xctoolchain/usr/bin/ranlib: file: /var/drydock/workingcopy-121269/repo/glasgow-haskell-compiler/bindisttest/install dir/lib/ghc-8.7.20180807/rts/libHSrts_thr_l.a(OldARMAtomic.thr_l_o) has no symbols
937/Applications/Xcode-7.2/Xcode.app/Contents/Developer/Toolchains/XcodeDefault.xctoolchain/usr/bin/ranlib: file: /var/drydock/workingcopy-121269/repo/glasgow-haskell-compiler/bindisttest/install dir/lib/ghc-8.7.20180807/rts/libHSrts_thr_l.a(ProfilerReport.thr_l_o) has no symbols
938/Applications/Xcode-7.2/Xcode.app/Contents/Developer/Toolchains/XcodeDefault.xctoolchain/usr/bin/ranlib: file: /var/drydock/workingcopy-121269/repo/glasgow-haskell-compiler/bindisttest/install dir/lib/ghc-8.7.20180807/rts/libHSrts_thr_l.a(ProfilerReportJson.thr_l_o) has no symbols
939/Applications/Xcode-7.2/Xcode.app/Contents/Developer/Toolchains/XcodeDefault.xctoolchain/usr/bin/ranlib: file: /var/drydock/workingcopy-121269/repo/glasgow-haskell-compiler/bindisttest/install dir/lib/ghc-8.7.20180807/rts/libHSrts_thr_l.a(Profiling.thr_l_o) has no symbols
940/Applications/Xcode-7.2/Xcode.app/Contents/Developer/Toolchains/XcodeDefault.xctoolchain/usr/bin/ranlib: file: /var/drydock/workingcopy-121269/repo/glasgow-haskell-compiler/bindisttest/install dir/lib/ghc-8.7.20180807/rts/libHSrts_thr_l.a(RetainerProfile.thr_l_o) has no symbols
941/Applications/Xcode-7.2/Xcode.app/Contents/Developer/Toolchains/XcodeDefault.xctoolchain/usr/bin/ranlib: file: /var/drydock/workingcopy-121269/repo/glasgow-haskell-compiler/bindisttest/install dir/lib/ghc-8.7.20180807/rts/libHSrts_thr_l.a(RetainerSet.thr_l_o) has no symbols
942/Applications/Xcode-7.2/Xcode.app/Contents/Developer/Toolchains/XcodeDefault.xctoolchain/usr/bin/ranlib: file: /var/drydock/workingcopy-121269/repo/glasgow-haskell-compiler/bindisttest/install dir/lib/ghc-8.7.20180807/rts/libHSrts_thr_l.a(RtsDllMain.thr_l_o) has no symbols
943/Applications/Xcode-7.2/Xcode.app/Contents/Developer/Toolchains/XcodeDefault.xctoolchain/usr/bin/ranlib: file: /var/drydock/workingcopy-121269/repo/glasgow-haskell-compiler/bindisttest/install dir/lib/ghc-8.7.20180807/rts/libHSrts_thr_l.a(Sanity.thr_l_o) has no symbols
944/Applications/Xcode-7.2/Xcode.app/Contents/Developer/Toolchains/XcodeDefault.xctoolchain/usr/bin/ranlib: file: /var/drydock/workingcopy-121269/repo/glasgow-haskell-compiler/bindisttest/install dir/lib/ghc-8.7.20180807/rts/libHSrts_thr_l.a(Elf.thr_l_o) has no symbols
945/Applications/Xcode-7.2/Xcode.app/Contents/Developer/Toolchains/XcodeDefault.xctoolchain/usr/bin/ranlib: file: /var/drydock/workingcopy-121269/repo/glasgow-haskell-compiler/bindisttest/install dir/lib/ghc-8.7.20180807/rts/libHSrts_thr_l.a(PEi386.thr_l_o) has no symbols
946/Applications/Xcode-7.2/Xcode.app/Contents/Developer/Toolchains/XcodeDefault.xctoolchain/usr/bin/ranlib: file: /var/drydock/workingcopy-121269/repo/glasgow-haskell-compiler/bindisttest/install dir/lib/ghc-8.7.20180807/rts/libHSrts_thr_l.a(elf_got.thr_l_o) has no symbols
947/Applications/Xcode-7.2/Xcode.app/Contents/Developer/Toolchains/XcodeDefault.xctoolchain/usr/bin/ranlib: file: /var/drydock/workingcopy-121269/repo/glasgow-haskell-compiler/bindisttest/install dir/lib/ghc-8.7.20180807/rts/libHSrts_thr_l.a(elf_plt.thr_l_o) has no symbols
948/Applications/Xcode-7.2/Xcode.app/Contents/Developer/Toolchains/XcodeDefault.xctoolchain/usr/bin/ranlib: file: /var/drydock/workingcopy-121269/repo/glasgow-haskell-compiler/bindisttest/install dir/lib/ghc-8.7.20180807/rts/libHSrts_thr_l.a(elf_plt_aarch64.thr_l_o) has no symbols
949/Applications/Xcode-7.2/Xcode.app/Contents/Developer/Toolchains/XcodeDefault.xctoolchain/usr/bin/ranlib: file: /var/drydock/workingcopy-121269/repo/glasgow-haskell-compiler/bindisttest/install dir/lib/ghc-8.7.20180807/rts/libHSrts_thr_l.a(elf_plt_arm.thr_l_o) has no symbols
950/Applications/Xcode-7.2/Xcode.app/Contents/Developer/Toolchains/XcodeDefault.xctoolchain/usr/bin/ranlib: file: /var/drydock/workingcopy-121269/repo/glasgow-haskell-compiler/bindisttest/install dir/lib/ghc-8.7.20180807/rts/libHSrts_thr_l.a(elf_reloc.thr_l_o) has no symbols
951/Applications/Xcode-7.2/Xcode.app/Contents/Developer/Toolchains/XcodeDefault.xctoolchain/usr/bin/ranlib: file: /var/drydock/workingcopy-121269/repo/glasgow-haskell-compiler/bindisttest/install dir/lib/ghc-8.7.20180807/rts/libHSrts_thr_l.a(elf_reloc_aarch64.thr_l_o) has no symbols
952/Applications/Xcode-7.2/Xcode.app/Contents/Developer/Toolchains/XcodeDefault.xctoolchain/usr/bin/ranlib: file: /var/drydock/workingcopy-121269/repo/glasgow-haskell-compiler/bindisttest/install dir/lib/ghc-8.7.20180807/rts/libHSrts_thr_l.a(elf_util.thr_l_o) has no symbols
953/Applications/Xcode-7.2/Xcode.app/Contents/Developer/Toolchains/XcodeDefault.xctoolchain/usr/bin/ranlib: file: /var/drydock/workingcopy-121269/repo/glasgow-haskell-compiler/bindisttest/install dir/lib/ghc-8.7.20180807/rts/libHSrts_thr_l.a(Select.thr_l_o) has no symbols
954make[3]: *** [install_packages] Segmentation fault: 11
955make[2]: *** [install] Error 2
956make[1]: *** [test_bindist] Error 2
957make: *** [test_bindist] Error 2
958

Build Log 290994 (remote - stdout)
25 - 50 - 100 - Unlimited Lines

8127checking for sys/types.h... yes
8128checking for sys/stat.h... yes
8129checking for stdlib.h... yes
8130checking for string.h... yes
8131checking for memory.h... yes
8132checking for strings.h... yes
8133checking for inttypes.h... yes
8134checking for stdint.h... yes
8135checking for unistd.h... yes
8136checking size of void *... 8
8137checking for -ar... no
8138checking for ar... ar
8139checking whether ar is GNU ar... no
8140checking for ar arguments... qcls
8141checking whether ar supports @file... no
8142checking for ranlib... ranlib
8143configure: creating ./config.status
8144config.status: creating settings
8145config.status: creating mk/config.mk
8146config.status: creating mk/install.mk
8147****************************************************
8148Configuration done, ready to 'make install'
8149(see README and INSTALL files for more info.)
8150****************************************************
8151

Drydock: Prepare tree

When
Completed at Aug 7 2018, 3:50 PM · Built for 13 s
Status
Passed

Build Log 290993 (remote - stderr)
25 - 50 - 100 - Unlimited Lines

1+ git clean -qxfd
2+ git submodule sync
3+ git submodule update --init --recursive
4+ git submodule foreach -q git clean -qxfd
5

Build Log 290992 (remote - stdout)
25 - 50 - 100 - Unlimited Lines

19Synchronizing submodule url for 'libraries/process'
20Synchronizing submodule url for 'libraries/stm'
21Synchronizing submodule url for 'libraries/terminfo'
22Synchronizing submodule url for 'libraries/text'
23Synchronizing submodule url for 'libraries/time'
24Synchronizing submodule url for 'libraries/transformers'
25Synchronizing submodule url for 'libraries/unix'
26Synchronizing submodule url for 'libraries/xhtml'
27Synchronizing submodule url for 'nofib'
28Synchronizing submodule url for 'utils/haddock'
29Synchronizing submodule url for 'utils/hsc2hs'
30Submodule path 'hadrian': checked out '4265e3aab7df92722b81148cf8bf3954ebfc2d21'
31Submodule path 'libraries/Cabal': checked out '6671506b488a0fe2079f9059a23510b35514c031'
32Submodule path 'libraries/binary': checked out '38adf7ce1ad6a497fba61de500c3f35b186303a9'
33Submodule path 'libraries/directory': checked out 'e9debc1d4a9c4b608a32f60bae173ed10f89fdce'
34Submodule path 'libraries/filepath': checked out 'b10724be8a907e191d153ad6674415be0c1325fd'
35Submodule path 'libraries/haskeline': checked out '84a7b2b0afb9325cfcedc3ca56603539f0e8af3e'
36Submodule path 'libraries/mtl': checked out 'c7d396732bd45e409478bd4df1d0ca95d6f39356'
37Submodule path 'libraries/parallel': checked out '5015bc74127beac29b4d08dcb3beb230149fed25'
38Submodule path 'libraries/stm': checked out '4c24db6071fc1319232934562f7dbed45d498831'
39Submodule path 'libraries/terminfo': checked out '27e82750fac178fc6e049fe44be6de45f24814ae'
40Submodule path 'libraries/unix': checked out 'ee3e99a0d8a75edc90a1a4e9fb1c593a99a02bb9'
41Submodule path 'libraries/xhtml': checked out '721779acc35dccd6a43a292b24099b65d93d390c'
42Submodule path 'utils/haddock': checked out 'a264b6b3e41dd42946110afcf5000341e5fb3a6d'
43

Lease Working Copy

When
Completed at Aug 7 2018, 3:49 PM · Built for 39 s
Status
Passed
Description

Lease a working copy for OSX/amd64 builds.