Build 50778

Properties

Drydock: Build

When
Completed at Aug 10 2018, 10:41 AM · Built for 16 m, 4 s
Status
Failed
Description

Run the build.

Build Log 291896 (remote - stderr)
25 - 50 - 100 - Unlimited Lines

410Makefile:1804: warning: overriding commands for target `libffi.map'
411Makefile:672: warning: ignoring old commands for target `libffi.map'
412Makefile:1804: warning: overriding commands for target `libffi.map'
413Makefile:672: warning: ignoring old commands for target `libffi.map'
414Makefile:1804: warning: overriding commands for target `libffi.map'
415Makefile:672: warning: ignoring old commands for target `libffi.map'
416Configured with: --prefix=/Applications/Xcode-7.2/Xcode.app/Contents/Developer/usr --with-gxx-include-dir=/usr/include/c++/4.2.1
417clang: error: optimization flag '-fkeep-inline-functions' is not supported
418clang: error: optimization flag '-fkeep-inline-functions' is not supported
419`gcc' failed in phase `C Compiler'. (Exit code: 1)
420`gcc' failed in phase `C Compiler'. (Exit code: 1)
421clang: error: optimization flag '-fkeep-inline-functions' is not supported
422make[1]: *** [rts/dist/build/Capability.debug_o] Error 1
423make[1]: *** Waiting for unfinished jobs....
424`gcc' failed in phase `C Compiler'. (Exit code: 1)
425make[1]: *** [rts/dist/build/Adjustor.debug_o] Error 1
426make[1]: *** [rts/dist/build/Arena.debug_o] Error 1
427clang: error: optimization flag '-fkeep-inline-functions' is not supported
428`gcc' failed in phase `C Compiler'. (Exit code: 1)
429make[1]: *** [rts/dist/build/CheckUnload.debug_o] Error 1
430clang: error: optimization flag '-fkeep-inline-functions' is not supported
431`gcc' failed in phase `C Compiler'. (Exit code: 1)
432make[1]: *** [rts/dist/build/ClosureFlags.debug_o] Error 1
433make: *** [all] Error 2
434

Build Log 291895 (remote - stdout)
25 - 50 - 100 - Unlimited Lines

2410 rts_dist_HC rts/dist/build/linker/elf_reloc_aarch64.l_o
2411 rts_dist_HC rts/dist/build/linker/elf_util.l_o
2412 rts_dist_HC rts/dist/build/posix/GetEnv.l_o
2413 rts_dist_HC rts/dist/build/posix/GetTime.l_o
2414 rts_dist_HC rts/dist/build/posix/Itimer.l_o
2415 rts_dist_HC rts/dist/build/posix/OSMem.l_o
2416 rts_dist_HC rts/dist/build/posix/OSThreads.l_o
2417 rts_dist_HC rts/dist/build/posix/Select.l_o
2418 rts_dist_HC rts/dist/build/posix/Signals.l_o
2419 rts_dist_HC rts/dist/build/posix/TTY.l_o
2420 rts_dist_HC rts/dist/build/Apply.l_o
2421 rts_dist_HC rts/dist/build/Compact.l_o
2422 rts_dist_HC rts/dist/build/Exception.l_o
2423 rts_dist_HC rts/dist/build/HeapStackCheck.l_o
2424 rts_dist_HC rts/dist/build/PrimOps.l_o
2425 rts_dist_HC rts/dist/build/StgMiscClosures.l_o
2426 rts_dist_HC rts/dist/build/StgStartup.l_o
2427 rts_dist_HC rts/dist/build/StgStdThunks.l_o
2428 rts_dist_HC rts/dist/build/Updates.l_o
2429 rts_dist_HC rts/dist/build/Adjustor.debug_o
2430 rts_dist_HC rts/dist/build/Arena.debug_o
2431 rts_dist_HC rts/dist/build/Capability.debug_o
2432 rts_dist_HC rts/dist/build/CheckUnload.debug_o
2433 rts_dist_HC rts/dist/build/ClosureFlags.debug_o
2434

Drydock: Prepare tree

When
Completed at Aug 10 2018, 10:24 AM · Built for 11 s
Status
Passed

Build Log 291894 (remote - stderr)
25 - 50 - 100 - Unlimited Lines

1+ git clean -qxfd
2+ git submodule sync
3+ git submodule update --init --recursive
4+ git submodule foreach -q git clean -qxfd
5

Build Log 291893 (remote - stdout)
25 - 50 - 100 - Unlimited Lines

14Synchronizing submodule url for 'libraries/integer-gmp/gmp/gmp-tarballs'
15Synchronizing submodule url for 'libraries/mtl'
16Synchronizing submodule url for 'libraries/parallel'
17Synchronizing submodule url for 'libraries/parsec'
18Synchronizing submodule url for 'libraries/pretty'
19Synchronizing submodule url for 'libraries/process'
20Synchronizing submodule url for 'libraries/stm'
21Synchronizing submodule url for 'libraries/terminfo'
22Synchronizing submodule url for 'libraries/text'
23Synchronizing submodule url for 'libraries/time'
24Synchronizing submodule url for 'libraries/transformers'
25Synchronizing submodule url for 'libraries/unix'
26Synchronizing submodule url for 'libraries/xhtml'
27Synchronizing submodule url for 'nofib'
28Synchronizing submodule url for 'utils/haddock'
29Synchronizing submodule url for 'utils/hsc2hs'
30Submodule path 'libraries/directory': checked out 'e9debc1d4a9c4b608a32f60bae173ed10f89fdce'
31Submodule path 'libraries/haskeline': checked out '84a7b2b0afb9325cfcedc3ca56603539f0e8af3e'
32Submodule path 'libraries/mtl': checked out 'c7d396732bd45e409478bd4df1d0ca95d6f39356'
33Submodule path 'libraries/parallel': checked out '5015bc74127beac29b4d08dcb3beb230149fed25'
34Submodule path 'libraries/stm': checked out '4c24db6071fc1319232934562f7dbed45d498831'
35Submodule path 'libraries/unix': checked out 'ee3e99a0d8a75edc90a1a4e9fb1c593a99a02bb9'
36Submodule path 'libraries/xhtml': checked out '721779acc35dccd6a43a292b24099b65d93d390c'
37Submodule path 'utils/haddock': checked out '612f44f9a582b1f7c8a9ba709651bce83692b60b'
38

Lease Working Copy

When
Completed at Aug 10 2018, 10:24 AM · Built for 1 w, 4 d
Status
Passed
Description

Lease a working copy for OSX/amd64 builds.