Build 50717

Drydock: Build

When
Completed at Aug 5 2018, 7:46 PM · Built for 22 m, 58 s
Status
Failed
Description

Run the build.

Build Log 290482 (remote - stderr)
25 - 50 - 100 - Unlimited Lines

329libraries/hpc/ghc.mk:4: libraries/hpc/dist-install/build/.depend-v-dyn.c_asm: No such file or directory
330libraries/pretty/ghc.mk:4: libraries/pretty/dist-install/build/.depend-v-dyn.haskell: No such file or directory
331libraries/pretty/ghc.mk:4: libraries/pretty/dist-install/build/.depend-v-dyn.c_asm: No such file or directory
332libraries/binary/ghc.mk:4: libraries/binary/dist-install/build/.depend-v-dyn.haskell: No such file or directory
333libraries/binary/ghc.mk:4: libraries/binary/dist-install/build/.depend-v-dyn.c_asm: No such file or directory
334libraries/text/ghc.mk:4: libraries/text/dist-install/build/.depend-v-dyn.haskell: No such file or directory
335libraries/text/ghc.mk:4: libraries/text/dist-install/build/.depend-v-dyn.c_asm: No such file or directory
336libraries/transformers/ghc.mk:4: libraries/transformers/dist-install/build/.depend-v-dyn.haskell: No such file or directory
337libraries/transformers/ghc.mk:4: libraries/transformers/dist-install/build/.depend-v-dyn.c_asm: No such file or directory
338libraries/mtl/ghc.mk:4: libraries/mtl/dist-install/build/.depend-v-dyn.haskell: No such file or directory
339libraries/mtl/ghc.mk:4: libraries/mtl/dist-install/build/.depend-v-dyn.c_asm: No such file or directory
340libraries/parsec/ghc.mk:4: libraries/parsec/dist-install/build/.depend-v-dyn.haskell: No such file or directory
341libraries/parsec/ghc.mk:4: libraries/parsec/dist-install/build/.depend-v-dyn.c_asm: No such file or directory
342libraries/Cabal/Cabal/ghc.mk:4: libraries/Cabal/Cabal/dist-install/build/.depend-v-dyn.haskell: No such file or directory
343libraries/Cabal/Cabal/ghc.mk:4: libraries/Cabal/Cabal/dist-install/build/.depend-v-dyn.c_asm: No such file or directory
344libraries/ghc-boot-th/ghc.mk:4: libraries/ghc-boot-th/dist-install/build/.depend-v-dyn.haskell: No such file or directory
345libraries/ghc-boot-th/ghc.mk:4: libraries/ghc-boot-th/dist-install/build/.depend-v-dyn.c_asm: No such file or directory
346libraries/ghc-boot/ghc.mk:4: libraries/ghc-boot/dist-install/build/.depend-v-dyn.haskell: No such file or directory
347libraries/ghc-boot/ghc.mk:4: libraries/ghc-boot/dist-install/build/.depend-v-dyn.c_asm: No such file or directory
348libraries/template-haskell/ghc.mk:4: libraries/template-haskell/dist-install/build/.depend-v-dyn.haskell: No such file or directory
349libraries/template-haskell/ghc.mk:4: libraries/template-haskell/dist-install/build/.depend-v-dyn.c_asm: No such file or directory
350libraries/ghc-compact/ghc.mk:4: libraries/ghc-compact/dist-install/build/.depend-v-dyn.haskell: No such file or directory
351libraries/ghc-compact/ghc.mk:4: libraries/ghc-compact/dist-install/build/.depend-v-dyn.c_asm: No such file or directory
352libraries/ghc-heap/ghc.mk:4: libraries/ghc-heap/dist-install/build/.depend-v-dyn.haskell: No such file or directory
353libraries/ghc-heap/ghc.mk:4: libraries/ghc-heap/dist-install/build/.depend-v-dyn.c_asm: No such file or directory
354libraries/xhtml/ghc.mk:4: libraries/xhtml/dist-install/build/.depend-v-dyn.haskell: No such file or directory
355libraries/xhtml/ghc.mk:4: libraries/xhtml/dist-install/build/.depend-v-dyn.c_asm: No such file or directory
356libraries/terminfo/ghc.mk:4: libraries/terminfo/dist-install/build/.depend-v-dyn.haskell: No such file or directory
357libraries/terminfo/ghc.mk:4: libraries/terminfo/dist-install/build/.depend-v-dyn.c_asm: No such file or directory
358libraries/stm/ghc.mk:4: libraries/stm/dist-install/build/.depend-v-dyn.haskell: No such file or directory
359libraries/stm/ghc.mk:4: libraries/stm/dist-install/build/.depend-v-dyn.c_asm: No such file or directory
360libraries/haskeline/ghc.mk:4: libraries/haskeline/dist-install/build/.depend-v-dyn.haskell: No such file or directory
361libraries/haskeline/ghc.mk:4: libraries/haskeline/dist-install/build/.depend-v-dyn.c_asm: No such file or directory
362libraries/ghci/ghc.mk:4: libraries/ghci/dist-install/build/.depend-v-dyn.haskell: No such file or directory
363libraries/ghci/ghc.mk:4: libraries/ghci/dist-install/build/.depend-v-dyn.c_asm: No such file or directory
364libraries/libiserv/ghc.mk:4: libraries/libiserv/dist-install/build/.depend-v-dyn.haskell: No such file or directory
365libraries/libiserv/ghc.mk:4: libraries/libiserv/dist-install/build/.depend-v-dyn.c_asm: No such file or directory
366Configured with: --prefix=/Applications/Xcode-7.2/Xcode.app/Contents/Developer/usr --with-gxx-include-dir=/usr/include/c++/4.2.1
367utils/haddock/ghc.mk:20: utils/haddock/dist/build/.depend.haskell: No such file or directory
368utils/haddock/ghc.mk:20: utils/haddock/dist/build/.depend.c_asm: No such file or directory
369compiler/ghc.mk:447: compiler/stage2/build/.depend-v-dyn.haskell: No such file or directory
370compiler/ghc.mk:447: compiler/stage2/build/.depend-v-dyn.c_asm: No such file or directory
371utils/hsc2hs/ghc.mk:22: utils/hsc2hs/dist-install/build/.depend.haskell: No such file or directory
372utils/hsc2hs/ghc.mk:22: utils/hsc2hs/dist-install/build/.depend.c_asm: No such file or directory
373utils/ghc-pkg/ghc.mk:93: utils/ghc-pkg/dist-install/build/.depend.haskell: No such file or directory
374utils/ghc-pkg/ghc.mk:93: utils/ghc-pkg/dist-install/build/.depend.c_asm: No such file or directory
375utils/ghctags/ghc.mk:18: utils/ghctags/dist-install/build/.depend.haskell: No such file or directory
376utils/ghctags/ghc.mk:18: utils/ghctags/dist-install/build/.depend.c_asm: No such file or directory
377utils/check-api-annotations/ghc.mk:18: utils/check-api-annotations/dist-install/build/.depend.haskell: No such file or directory
378utils/check-api-annotations/ghc.mk:18: utils/check-api-annotations/dist-install/build/.depend.c_asm: No such file or directory
379utils/check-ppr/ghc.mk:18: utils/check-ppr/dist-install/build/.depend.haskell: No such file or directory
380utils/check-ppr/ghc.mk:18: utils/check-ppr/dist-install/build/.depend.c_asm: No such file or directory
381utils/ghc-cabal/ghc.mk:103: utils/ghc-cabal/dist-install/build/.depend.haskell: No such file or directory
382utils/ghc-cabal/ghc.mk:103: utils/ghc-cabal/dist-install/build/.depend.c_asm: No such file or directory
383utils/hpc/ghc.mk:21: utils/hpc/dist-install/build/.depend.haskell: No such file or directory
384utils/hpc/ghc.mk:21: utils/hpc/dist-install/build/.depend.c_asm: No such file or directory
385utils/runghc/ghc.mk:30: utils/runghc/dist-install/build/.depend.haskell: No such file or directory
386utils/runghc/ghc.mk:30: utils/runghc/dist-install/build/.depend.c_asm: No such file or directory
387ghc/ghc.mk:112: ghc/stage2/build/.depend.haskell: No such file or directory
388ghc/ghc.mk:112: ghc/stage2/build/.depend.c_asm: No such file or directory
389utils/compare_sizes/ghc.mk:8: utils/compare_sizes/dist-install/build/.depend.haskell: No such file or directory
390utils/compare_sizes/ghc.mk:8: utils/compare_sizes/dist-install/build/.depend.c_asm: No such file or directory
391utils/iserv/ghc.mk:100: utils/iserv/stage2/build/.depend.haskell: No such file or directory
392utils/iserv/ghc.mk:100: utils/iserv/stage2/build/.depend.c_asm: No such file or directory
393utils/iserv/ghc.mk:108: utils/iserv/stage2_dyn/build/.depend.haskell: No such file or directory
394utils/iserv/ghc.mk:108: utils/iserv/stage2_dyn/build/.depend.c_asm: No such file or directory
395unused terminals: 1
396clang: error: unsupported option '-print-multi-os-directory'
397clang: error: no input files
398Makefile:3406: warning: overriding commands for target `libffi.map'
399Makefile:731: warning: ignoring old commands for target `libffi.map'
400Makefile:1804: warning: overriding commands for target `libffi.map'
401Makefile:672: warning: ignoring old commands for target `libffi.map'
402Makefile:1804: warning: overriding commands for target `libffi.map'
403Makefile:672: warning: ignoring old commands for target `libffi.map'
404Makefile:1804: warning: overriding commands for target `libffi.map'
405Makefile:672: warning: ignoring old commands for target `libffi.map'
406unused terminals: 2
407ld: warning: could not create compact unwind for _ffi_call_unix64: does not use RBP or RSP based frame
408Makefile:3406: warning: overriding commands for target `libffi.map'
409Makefile:731: warning: ignoring old commands for target `libffi.map'
410Makefile:1804: warning: overriding commands for target `libffi.map'
411Makefile:672: warning: ignoring old commands for target `libffi.map'
412Makefile:1804: warning: overriding commands for target `libffi.map'
413Makefile:672: warning: ignoring old commands for target `libffi.map'
414Makefile:1804: warning: overriding commands for target `libffi.map'
415Makefile:672: warning: ignoring old commands for target `libffi.map'
416Configured with: --prefix=/Applications/Xcode-7.2/Xcode.app/Contents/Developer/usr --with-gxx-include-dir=/usr/include/c++/4.2.1
417clang: error: optimization flag '-fkeep-inline-functions' is not supported
418clang: error: optimization flag '-fkeep-inline-functions' is not supported
419`gcc' failed in phase `C Compiler'. (Exit code: 1)
420`gcc' failed in phase `C Compiler'. (Exit code: 1)
421make[1]: *** [rts/dist/build/Adjustor.debug_o] Error 1
422make[1]: *** Waiting for unfinished jobs....
423make[1]: *** [rts/dist/build/Arena.debug_o] Error 1
424clang: error: optimization flag '-fkeep-inline-functions' is not supported
425`gcc' failed in phase `C Compiler'. (Exit code: 1)
426make[1]: *** [rts/dist/build/Capability.debug_o] Error 1
427make: *** [all] Error 2
428

Build Log 290481 (remote - stdout)
25 - 50 - 100 - Unlimited Lines

2333 rts_dist_HC rts/dist/build/Messages.l_o
2334 rts_dist_HC rts/dist/build/OldARMAtomic.l_o
2335 rts_dist_HC rts/dist/build/PathUtils.l_o
2336 rts_dist_HC rts/dist/build/Pool.l_o
2337 rts_dist_HC rts/dist/build/Printer.l_o
2338 rts_dist_HC rts/dist/build/ProfHeap.l_o
2339 rts_dist_HC rts/dist/build/ProfilerReport.l_o
2340 rts_dist_HC rts/dist/build/ProfilerReportJson.l_o
2341 rts_dist_HC rts/dist/build/Profiling.l_o
2342 rts_dist_HC rts/dist/build/Proftimer.l_o
2343 rts_dist_HC rts/dist/build/RaiseAsync.l_o
2344 rts_dist_HC rts/dist/build/RetainerProfile.l_o
2345 rts_dist_HC rts/dist/build/RetainerSet.l_o
2346 rts_dist_HC rts/dist/build/RtsAPI.l_o
2347 rts_dist_HC rts/dist/build/RtsDllMain.l_o
2348 rts_dist_HC rts/dist/build/RtsFlags.l_o
2349 rts_dist_HC rts/dist/build/RtsMain.l_o
2350 rts_dist_HC rts/dist/build/RtsMessages.l_o
2351 rts_dist_HC rts/dist/build/RtsStartup.l_o
2352 rts_dist_HC rts/dist/build/RtsSymbolInfo.l_o
2353 rts_dist_HC rts/dist/build/RtsSymbols.l_o
2354 rts_dist_HC rts/dist/build/RtsUtils.l_o
2355 rts_dist_HC rts/dist/build/STM.l_o
2356 rts_dist_HC rts/dist/build/Schedule.l_o
2357 rts_dist_HC rts/dist/build/Sparks.l_o
2358 rts_dist_HC rts/dist/build/Stable.l_o
2359 rts_dist_HC rts/dist/build/StaticPtrTable.l_o
2360 rts_dist_HC rts/dist/build/Stats.l_o
2361 rts_dist_HC rts/dist/build/StgCRun.l_o
2362 rts_dist_HC rts/dist/build/StgPrimFloat.l_o
2363 rts_dist_HC rts/dist/build/Task.l_o
2364 rts_dist_HC rts/dist/build/ThreadLabels.l_o
2365 rts_dist_HC rts/dist/build/ThreadPaused.l_o
2366 rts_dist_HC rts/dist/build/Threads.l_o
2367 rts_dist_HC rts/dist/build/Ticky.l_o
2368 rts_dist_HC rts/dist/build/Timer.l_o
2369 rts_dist_HC rts/dist/build/TopHandler.l_o
2370 rts_dist_HC rts/dist/build/Trace.l_o
2371 rts_dist_HC rts/dist/build/WSDeque.l_o
2372 rts_dist_HC rts/dist/build/Weak.l_o
2373 rts_dist_HC rts/dist/build/fs.l_o
2374 rts_dist_HC rts/dist/build/xxhash.l_o
2375 rts_dist_HC rts/dist/build/hooks/FlagDefaults.l_o
2376 rts_dist_HC rts/dist/build/hooks/LongGCSync.l_o
2377 rts_dist_HC rts/dist/build/hooks/MallocFail.l_o
2378 rts_dist_HC rts/dist/build/hooks/OnExit.l_o
2379 rts_dist_HC rts/dist/build/hooks/OutOfHeap.l_o
2380 rts_dist_HC rts/dist/build/hooks/StackOverflow.l_o
2381 rts_dist_HC rts/dist/build/sm/BlockAlloc.l_o
2382 rts_dist_HC rts/dist/build/sm/CNF.l_o
2383 rts_dist_HC rts/dist/build/sm/Compact.l_o
2384 rts_dist_HC rts/dist/build/sm/Evac.l_o
2385 rts_dist_HC rts/dist/build/sm/Evac_thr.l_o
2386 rts_dist_HC rts/dist/build/sm/GC.l_o
2387 rts_dist_HC rts/dist/build/sm/GCAux.l_o
2388 rts_dist_HC rts/dist/build/sm/GCUtils.l_o
2389 rts_dist_HC rts/dist/build/sm/MBlock.l_o
2390 rts_dist_HC rts/dist/build/sm/MarkWeak.l_o
2391 rts_dist_HC rts/dist/build/sm/Sanity.l_o
2392 rts_dist_HC rts/dist/build/sm/Scav.l_o
2393 rts_dist_HC rts/dist/build/sm/Scav_thr.l_o
2394 rts_dist_HC rts/dist/build/sm/Storage.l_o
2395 rts_dist_HC rts/dist/build/sm/Sweep.l_o
2396 rts_dist_HC rts/dist/build/eventlog/EventLog.l_o
2397 rts_dist_HC rts/dist/build/eventlog/EventLogWriter.l_o
2398 rts_dist_HC rts/dist/build/linker/CacheFlush.l_o
2399 rts_dist_HC rts/dist/build/linker/Elf.l_o
2400 rts_dist_HC rts/dist/build/linker/LoadArchive.l_o
2401 rts_dist_HC rts/dist/build/linker/M32Alloc.l_o
2402 rts_dist_HC rts/dist/build/linker/MachO.l_o
2403 rts_dist_HC rts/dist/build/linker/PEi386.l_o
2404 rts_dist_HC rts/dist/build/linker/SymbolExtras.l_o
2405 rts_dist_HC rts/dist/build/linker/elf_got.l_o
2406 rts_dist_HC rts/dist/build/linker/elf_plt.l_o
2407 rts_dist_HC rts/dist/build/linker/elf_plt_aarch64.l_o
2408 rts_dist_HC rts/dist/build/linker/elf_plt_arm.l_o
2409 rts_dist_HC rts/dist/build/linker/elf_reloc.l_o
2410 rts_dist_HC rts/dist/build/linker/elf_reloc_aarch64.l_o
2411 rts_dist_HC rts/dist/build/linker/elf_util.l_o
2412 rts_dist_HC rts/dist/build/posix/GetEnv.l_o
2413 rts_dist_HC rts/dist/build/posix/GetTime.l_o
2414 rts_dist_HC rts/dist/build/posix/Itimer.l_o
2415 rts_dist_HC rts/dist/build/posix/OSMem.l_o
2416 rts_dist_HC rts/dist/build/posix/OSThreads.l_o
2417 rts_dist_HC rts/dist/build/posix/Select.l_o
2418 rts_dist_HC rts/dist/build/posix/Signals.l_o
2419 rts_dist_HC rts/dist/build/posix/TTY.l_o
2420 rts_dist_HC rts/dist/build/Apply.l_o
2421 rts_dist_HC rts/dist/build/Compact.l_o
2422 rts_dist_HC rts/dist/build/Exception.l_o
2423 rts_dist_HC rts/dist/build/HeapStackCheck.l_o
2424 rts_dist_HC rts/dist/build/PrimOps.l_o
2425 rts_dist_HC rts/dist/build/StgMiscClosures.l_o
2426 rts_dist_HC rts/dist/build/StgStartup.l_o
2427 rts_dist_HC rts/dist/build/StgStdThunks.l_o
2428 rts_dist_HC rts/dist/build/Updates.l_o
2429 rts_dist_HC rts/dist/build/Adjustor.debug_o
2430 rts_dist_HC rts/dist/build/Arena.debug_o
2431 rts_dist_HC rts/dist/build/Capability.debug_o
2432

Drydock: Prepare tree

When
Completed at Aug 5 2018, 7:23 PM · Built for 12 s
Status
Passed

Build Log 290480 (remote - stderr)
25 - 50 - 100 - Unlimited Lines

1+ git clean -qxfd
2+ git submodule sync
3+ git submodule update --init --recursive
4+ git submodule foreach -q git clean -qxfd
5

Build Log 290479 (remote - stdout)
25 - 50 - 100 - Unlimited Lines

1Synchronizing submodule url for '.arc-linters/arcanist-external-json-linter'
2Synchronizing submodule url for 'hadrian'
3Synchronizing submodule url for 'libffi-tarballs'
4Synchronizing submodule url for 'libraries/Cabal'
5Synchronizing submodule url for 'libraries/Win32'
6Synchronizing submodule url for 'libraries/array'
7Synchronizing submodule url for 'libraries/binary'
8Synchronizing submodule url for 'libraries/bytestring'
9Synchronizing submodule url for 'libraries/containers'
10Synchronizing submodule url for 'libraries/deepseq'
11Synchronizing submodule url for 'libraries/directory'
12Synchronizing submodule url for 'libraries/filepath'
13Synchronizing submodule url for 'libraries/haskeline'
14Synchronizing submodule url for 'libraries/hpc'
15Synchronizing submodule url for 'libraries/integer-gmp/gmp/gmp-tarballs'
16Synchronizing submodule url for 'libraries/mtl'
17Synchronizing submodule url for 'libraries/parallel'
18Synchronizing submodule url for 'libraries/parsec'
19Synchronizing submodule url for 'libraries/pretty'
20Synchronizing submodule url for 'libraries/process'
21Synchronizing submodule url for 'libraries/stm'
22Synchronizing submodule url for 'libraries/terminfo'
23Synchronizing submodule url for 'libraries/text'
24Synchronizing submodule url for 'libraries/time'
25Synchronizing submodule url for 'libraries/transformers'
26Synchronizing submodule url for 'libraries/unix'
27Synchronizing submodule url for 'libraries/xhtml'
28Synchronizing submodule url for 'nofib'
29Synchronizing submodule url for 'utils/haddock'
30Synchronizing submodule url for 'utils/hsc2hs'
31Submodule path 'hadrian': checked out 'a63ad3294b5d51eec50d454810a314c0b2a696c7'
32Submodule path 'libraries/Cabal': checked out '8fbacca029f3ad764576aefb610a0408c4b6aaad'
33Submodule path 'libraries/binary': checked out 'ecf48c4589b927de3ae3fff8455c1c25140df7e9'
34Submodule path 'libraries/filepath': checked out '1be834e1b3a3f8c5a14a58d73ce30133b4c69679'
35Submodule path 'libraries/terminfo': checked out '72a08c5435c332bdfd0444dd3ab3fad96e401da1'
36Submodule path 'utils/haddock': checked out '612f44f9a582b1f7c8a9ba709651bce83692b60b'
37

Lease Working Copy

When
Completed at Aug 5 2018, 7:23 PM · Built for 1 w, 1 d
Status
Passed
Description

Lease a working copy for OSX/amd64 builds.