Build 50717

Drydock: Build

When
Completed at Aug 5 2018, 7:46 PM · Built for 22 m, 58 s
Status
Failed
Description

Run the build.

Build Log 290482 (remote - stderr)
25 - 50 - 100 - Unlimited Lines

1using THREADS=5
2configure: WARNING: unrecognized options: --with-nm
3ld: unknown option: --version
4./configure: line 7780: $: command not found
5./configure: line 11265: test: Sphinx (sphinx-build) 1: integer expression expected
6configure: WARNING: unrecognized options: --with-nm
7+ test -f mk/config.mk.old
8+ cp -p mk/config.mk mk/config.mk.old
9+ test -f mk/project.mk.old
10+ cp -p mk/project.mk mk/project.mk.old
11+ test -f compiler/ghc.cabal.old
12+ cp -p compiler/ghc.cabal compiler/ghc.cabal.old
13utils/genprimopcode/ghc.mk:19: utils/genprimopcode/dist/package-data.mk: No such file or directory
14utils/deriveConstants/ghc.mk:19: utils/deriveConstants/dist/package-data.mk: No such file or directory
15utils/genapply/ghc.mk:23: utils/genapply/dist/package-data.mk: No such file or directory
16libraries/hpc/ghc.mk:3: libraries/hpc/dist-boot/package-data.mk: No such file or directory
17libraries/binary/ghc.mk:3: libraries/binary/dist-boot/package-data.mk: No such file or directory
18libraries/text/ghc.mk:3: libraries/text/dist-boot/package-data.mk: No such file or directory
19libraries/transformers/ghc.mk:3: libraries/transformers/dist-boot/package-data.mk: No such file or directory
20libraries/mtl/ghc.mk:3: libraries/mtl/dist-boot/package-data.mk: No such file or directory
21libraries/parsec/ghc.mk:3: libraries/parsec/dist-boot/package-data.mk: No such file or directory
22libraries/Cabal/Cabal/ghc.mk:3: libraries/Cabal/Cabal/dist-boot/package-data.mk: No such file or directory
23libraries/ghc-boot-th/ghc.mk:3: libraries/ghc-boot-th/dist-boot/package-data.mk: No such file or directory
24libraries/ghc-boot/ghc.mk:3: libraries/ghc-boot/dist-boot/package-data.mk: No such file or directory
25libraries/template-haskell/ghc.mk:3: libraries/template-haskell/dist-boot/package-data.mk: No such file or directory
26libraries/ghc-heap/ghc.mk:3: libraries/ghc-heap/dist-boot/package-data.mk: No such file or directory
27libraries/terminfo/ghc.mk:3: libraries/terminfo/dist-boot/package-data.mk: No such file or directory
28libraries/ghci/ghc.mk:3: libraries/ghci/dist-boot/package-data.mk: No such file or directory
29compiler/ghc.mk:446: compiler/stage1/package-data.mk: No such file or directory
30utils/hsc2hs/ghc.mk:21: utils/hsc2hs/dist/package-data.mk: No such file or directory
31utils/ghc-pkg/ghc.mk:70: utils/ghc-pkg/dist/package-data.mk: No such file or directory
32ghc/ghc.mk:111: ghc/stage1/package-data.mk: No such file or directory
33binary-0.8.5.1: Warning: haddock-interfaces: /private/var/drydock/workingcopy-121269/repo/glasgow-haskell-compiler/libraries/binary/dist-boot/doc/html/binary/binary.haddock doesn't exist or isn't a file
34binary-0.8.5.1: Warning: haddock-html: /private/var/drydock/workingcopy-121269/repo/glasgow-haskell-compiler/libraries/binary/dist-boot/doc/html/binary doesn't exist or isn't a directory
35Warning: text.cabal:4:1: The field "bug-reports" is specified more than once
36at positions 4:1, 42:1
37text-1.2.3.0: Warning: include-dirs: /private/var/drydock/workingcopy-121269/repo/glasgow-haskell-compiler/libraries/text/dist-boot/build/include doesn't exist or isn't a directory
38text-1.2.3.0: Warning: haddock-interfaces: /private/var/drydock/workingcopy-121269/repo/glasgow-haskell-compiler/libraries/text/dist-boot/doc/html/text/text.haddock doesn't exist or isn't a file
39text-1.2.3.0: Warning: haddock-html: /private/var/drydock/workingcopy-121269/repo/glasgow-haskell-compiler/libraries/text/dist-boot/doc/html/text doesn't exist or isn't a directory
40transformers-0.5.5.0: Warning: haddock-interfaces: /private/var/drydock/workingcopy-121269/repo/glasgow-haskell-compiler/libraries/transformers/dist-boot/doc/html/transformers/transformers.haddock doesn't exist or isn't a file
41transformers-0.5.5.0: Warning: haddock-html: /private/var/drydock/workingcopy-121269/repo/glasgow-haskell-compiler/libraries/transformers/dist-boot/doc/html/transformers doesn't exist or isn't a directory
42mtl-2.2.2: Warning: haddock-interfaces: /private/var/drydock/workingcopy-121269/repo/glasgow-haskell-compiler/libraries/mtl/dist-boot/doc/html/mtl/mtl.haddock doesn't exist or isn't a file
43mtl-2.2.2: Warning: haddock-html: /private/var/drydock/workingcopy-121269/repo/glasgow-haskell-compiler/libraries/mtl/dist-boot/doc/html/mtl doesn't exist or isn't a directory
44parsec-3.1.13.0.0.0.0.0: Warning: haddock-interfaces: /private/var/drydock/workingcopy-121269/repo/glasgow-haskell-compiler/libraries/parsec/dist-boot/doc/html/parsec/parsec.haddock doesn't exist or isn't a file
45parsec-3.1.13.0.0.0.0.0: Warning: haddock-html: /private/var/drydock/workingcopy-121269/repo/glasgow-haskell-compiler/libraries/parsec/dist-boot/doc/html/parsec doesn't exist or isn't a directory
46Cabal-2.3.0.0: Warning: haddock-interfaces: /private/var/drydock/workingcopy-121269/repo/glasgow-haskell-compiler/libraries/Cabal/Cabal/dist-boot/doc/html/Cabal/Cabal.haddock doesn't exist or isn't a file
47Cabal-2.3.0.0: Warning: haddock-html: /private/var/drydock/workingcopy-121269/repo/glasgow-haskell-compiler/libraries/Cabal/Cabal/dist-boot/doc/html/Cabal doesn't exist or isn't a directory
48hpc-0.6.0.3: Warning: haddock-interfaces: /private/var/drydock/workingcopy-121269/repo/glasgow-haskell-compiler/libraries/hpc/dist-boot/doc/html/hpc/hpc.haddock doesn't exist or isn't a file
49hpc-0.6.0.3: Warning: haddock-html: /private/var/drydock/workingcopy-121269/repo/glasgow-haskell-compiler/libraries/hpc/dist-boot/doc/html/hpc doesn't exist or isn't a directory
50ghc-boot-th-8.7: Warning: haddock-interfaces: /private/var/drydock/workingcopy-121269/repo/glasgow-haskell-compiler/libraries/ghc-boot-th/dist-boot/doc/html/ghc-boot-th/ghc-boot-th.haddock doesn't exist or isn't a file
51ghc-boot-th-8.7: Warning: haddock-html: /private/var/drydock/workingcopy-121269/repo/glasgow-haskell-compiler/libraries/ghc-boot-th/dist-boot/doc/html/ghc-boot-th doesn't exist or isn't a directory
52ghc-boot-8.7: Warning: haddock-interfaces: /private/var/drydock/workingcopy-121269/repo/glasgow-haskell-compiler/libraries/ghc-boot/dist-boot/doc/html/ghc-boot/ghc-boot.haddock doesn't exist or isn't a file
53ghc-boot-8.7: Warning: haddock-html: /private/var/drydock/workingcopy-121269/repo/glasgow-haskell-compiler/libraries/ghc-boot/dist-boot/doc/html/ghc-boot doesn't exist or isn't a directory
54template-haskell-2.14.0.0: Warning: haddock-interfaces: /private/var/drydock/workingcopy-121269/repo/glasgow-haskell-compiler/libraries/template-haskell/dist-boot/doc/html/template-haskell/template-haskell.haddock doesn't exist or isn't a file
55template-haskell-2.14.0.0: Warning: haddock-html: /private/var/drydock/workingcopy-121269/repo/glasgow-haskell-compiler/libraries/template-haskell/dist-boot/doc/html/template-haskell doesn't exist or isn't a directory
56ghc-heap-8.7: Warning: haddock-interfaces: /private/var/drydock/workingcopy-121269/repo/glasgow-haskell-compiler/libraries/ghc-heap/dist-boot/doc/html/ghc-heap/ghc-heap.haddock doesn't exist or isn't a file
57ghc-heap-8.7: Warning: haddock-html: /private/var/drydock/workingcopy-121269/repo/glasgow-haskell-compiler/libraries/ghc-heap/dist-boot/doc/html/ghc-heap doesn't exist or isn't a directory
58ghci-8.7: Warning: haddock-interfaces: /private/var/drydock/workingcopy-121269/repo/glasgow-haskell-compiler/libraries/ghci/dist-boot/doc/html/ghci/ghci.haddock doesn't exist or isn't a file
59ghci-8.7: Warning: haddock-html: /private/var/drydock/workingcopy-121269/repo/glasgow-haskell-compiler/libraries/ghci/dist-boot/doc/html/ghci doesn't exist or isn't a directory
60terminfo-0.4.1.1: Warning: haddock-interfaces: /private/var/drydock/workingcopy-121269/repo/glasgow-haskell-compiler/libraries/terminfo/dist-boot/doc/html/terminfo/terminfo.haddock doesn't exist or isn't a file
61terminfo-0.4.1.1: Warning: haddock-html: /private/var/drydock/workingcopy-121269/repo/glasgow-haskell-compiler/libraries/terminfo/dist-boot/doc/html/terminfo doesn't exist or isn't a directory
62ghc-8.7: Warning: include-dirs: /private/var/drydock/workingcopy-121269/repo/glasgow-haskell-compiler/compiler/stage1/build/parser doesn't exist or isn't a directory
63ghc-8.7: Warning: include-dirs: /private/var/drydock/workingcopy-121269/repo/glasgow-haskell-compiler/compiler/stage1/build/utils doesn't exist or isn't a directory
64ghc-8.7: Warning: include-dirs: /private/var/drydock/workingcopy-121269/repo/glasgow-haskell-compiler/compiler/stage1/build/stage1 doesn't exist or isn't a directory
65ghc-8.7: Warning: haddock-interfaces: /private/var/drydock/workingcopy-121269/repo/glasgow-haskell-compiler/compiler/stage1/doc/html/ghc/ghc.haddock doesn't exist or isn't a file
66ghc-8.7: Warning: haddock-html: /private/var/drydock/workingcopy-121269/repo/glasgow-haskell-compiler/compiler/stage1/doc/html/ghc doesn't exist or isn't a directory
67utils/unlit/ghc.mk:33: utils/unlit/dist/build/.depend.c_asm: No such file or directory
68utils/hp2ps/ghc.mk:43: utils/hp2ps/dist/build/.depend.c_asm: No such file or directory
69utils/genapply/ghc.mk:23: utils/genapply/dist/build/.depend.haskell: No such file or directory
70utils/genapply/ghc.mk:23: utils/genapply/dist/build/.depend.c_asm: No such file or directory
71libraries/hpc/ghc.mk:3: libraries/hpc/dist-boot/build/.depend-v.haskell: No such file or directory
72libraries/hpc/ghc.mk:3: libraries/hpc/dist-boot/build/.depend-v.c_asm: No such file or directory
73libraries/binary/ghc.mk:3: libraries/binary/dist-boot/build/.depend-v.haskell: No such file or directory
74libraries/binary/ghc.mk:3: libraries/binary/dist-boot/build/.depend-v.c_asm: No such file or directory
75libraries/text/ghc.mk:3: libraries/text/dist-boot/build/.depend-v.haskell: No such file or directory
76libraries/text/ghc.mk:3: libraries/text/dist-boot/build/.depend-v.c_asm: No such file or directory
77libraries/transformers/ghc.mk:3: libraries/transformers/dist-boot/build/.depend-v.haskell: No such file or directory
78libraries/transformers/ghc.mk:3: libraries/transformers/dist-boot/build/.depend-v.c_asm: No such file or directory
79libraries/mtl/ghc.mk:3: libraries/mtl/dist-boot/build/.depend-v.haskell: No such file or directory
80libraries/mtl/ghc.mk:3: libraries/mtl/dist-boot/build/.depend-v.c_asm: No such file or directory
81libraries/parsec/ghc.mk:3: libraries/parsec/dist-boot/build/.depend-v.haskell: No such file or directory
82libraries/parsec/ghc.mk:3: libraries/parsec/dist-boot/build/.depend-v.c_asm: No such file or directory
83libraries/Cabal/Cabal/ghc.mk:3: libraries/Cabal/Cabal/dist-boot/build/.depend-v.haskell: No such file or directory
84libraries/Cabal/Cabal/ghc.mk:3: libraries/Cabal/Cabal/dist-boot/build/.depend-v.c_asm: No such file or directory
85libraries/ghc-boot-th/ghc.mk:3: libraries/ghc-boot-th/dist-boot/build/.depend-v.haskell: No such file or directory
86libraries/ghc-boot-th/ghc.mk:3: libraries/ghc-boot-th/dist-boot/build/.depend-v.c_asm: No such file or directory
87libraries/ghc-boot/ghc.mk:3: libraries/ghc-boot/dist-boot/build/.depend-v.haskell: No such file or directory
88libraries/ghc-boot/ghc.mk:3: libraries/ghc-boot/dist-boot/build/.depend-v.c_asm: No such file or directory
89libraries/template-haskell/ghc.mk:3: libraries/template-haskell/dist-boot/build/.depend-v.haskell: No such file or directory
90libraries/template-haskell/ghc.mk:3: libraries/template-haskell/dist-boot/build/.depend-v.c_asm: No such file or directory
91libraries/ghc-heap/ghc.mk:3: libraries/ghc-heap/dist-boot/build/.depend-v.haskell: No such file or directory
92libraries/ghc-heap/ghc.mk:3: libraries/ghc-heap/dist-boot/build/.depend-v.c_asm: No such file or directory
93libraries/terminfo/ghc.mk:3: libraries/terminfo/dist-boot/build/.depend-v.haskell: No such file or directory
94libraries/terminfo/ghc.mk:3: libraries/terminfo/dist-boot/build/.depend-v.c_asm: No such file or directory
95libraries/ghci/ghc.mk:3: libraries/ghci/dist-boot/build/.depend-v.haskell: No such file or directory
96libraries/ghci/ghc.mk:3: libraries/ghci/dist-boot/build/.depend-v.c_asm: No such file or directory
97compiler/ghc.mk:446: compiler/stage1/build/.depend-v.haskell: No such file or directory
98compiler/ghc.mk:446: compiler/stage1/build/.depend-v.c_asm: No such file or directory
99utils/ghc-pkg/ghc.mk:70: utils/ghc-pkg/dist/build/.depend.haskell: No such file or directory
100utils/ghc-pkg/ghc.mk:70: utils/ghc-pkg/dist/build/.depend.c_asm: No such file or directory
101ghc/ghc.mk:111: ghc/stage1/build/.depend.haskell: No such file or directory
102ghc/ghc.mk:111: ghc/stage1/build/.depend.c_asm: No such file or directory
103. includes/HsFFI.h
104.. includes/ghcconfig.h
105... includes/ghcautoconf.h
106... includes/ghcplatform.h
107.. includes/stg/Types.h
108... /Applications/Xcode-7.2/Xcode.app/Contents/Developer/Toolchains/XcodeDefault.xctoolchain/usr/bin/../lib/clang/8.0.0/include/inttypes.h
109.... /usr/include/inttypes.h
110..... /usr/include/sys/cdefs.h
111In file included from /dev/fd/7:22:
112In file included from includes/HsFFI.h:20:
113In file included from includes/stg/Types.h:37:
114In file included from /Applications/Xcode-7.2/Xcode.app/Contents/Developer/Toolchains/XcodeDefault.xctoolchain/usr/bin/../lib/clang/8.0.0/include/inttypes.h:26:
115In file included from /usr/include/inttypes.h:223:
116/usr/include/sys/cdefs.h:81:2: warning: "Unsupported compiler detected" [-W#warnings]
117#warning "Unsupported compiler detected"
118 ^
119...... /usr/include/sys/_symbol_aliasing.h
120...... /usr/include/sys/_posix_availability.h
121..... /usr/include/Availability.h
122...... /usr/include/AvailabilityInternal.h
123..... /usr/include/_types.h
124...... /usr/include/sys/_types.h
125....... /usr/include/machine/_types.h
126........ /usr/include/i386/_types.h
127....... /usr/include/sys/_pthread/_pthread_types.h
128..... /usr/include/sys/_types/_wchar_t.h
129..... /Applications/Xcode-7.2/Xcode.app/Contents/Developer/Toolchains/XcodeDefault.xctoolchain/usr/bin/../lib/clang/8.0.0/include/stdint.h
130...... /usr/include/stdint.h
131....... /usr/include/sys/_types/_int8_t.h
132....... /usr/include/sys/_types/_int16_t.h
133....... /usr/include/sys/_types/_int32_t.h
134....... /usr/include/sys/_types/_int64_t.h
135....... /usr/include/_types/_uint8_t.h
136....... /usr/include/_types/_uint16_t.h
137....... /usr/include/_types/_uint32_t.h
138....... /usr/include/_types/_uint64_t.h
139....... /usr/include/sys/_types/_intptr_t.h
140....... /usr/include/sys/_types/_uintptr_t.h
141....... /usr/include/_types/_intmax_t.h
142....... /usr/include/_types/_uintmax_t.h
143.. /Applications/Xcode-7.2/Xcode.app/Contents/Developer/Toolchains/XcodeDefault.xctoolchain/usr/bin/../lib/clang/8.0.0/include/float.h
144. includes/rts/EventLogFormat.h
1451 warning generated.
146unused terminals: 2
147
148libraries/ghci/GHCi/InfoTable.hsc:28:1: warning: [-Wunused-top-binds]
149 Defined but not used: ‘ghciTablesNextToCode’
150 |
15128 | ghciTablesNextToCode = True
152 | ^^^^^^^^^^^^^^^^^^^^
153
154libraries/transformers/Control/Monad/Trans/Error.hs:98:1: warning: [-Worphans]
155 Orphan instance: instance [safe] Error e => Alternative (Either e)
156 To avoid this
157 move the instance declaration to the module of the class or of the type, or
158 wrap the type with a newtype and declare the instance on the new type.
159 |
16098 | instance (Error e) => Alternative (Either e) where
161 | ^^^^^^^^^^^^^^^^^^^^^^^^^^^^^^^^^^^^^^^^^^^^^^^^^^...
162
163libraries/transformers/Control/Monad/Trans/Error.hs:103:1: warning: [-Worphans]
164 Orphan instance: instance [safe] Error e => MonadPlus (Either e)
165 To avoid this
166 move the instance declaration to the module of the class or of the type, or
167 wrap the type with a newtype and declare the instance on the new type.
168 |
169103 | instance (Error e) => MonadPlus (Either e) where
170 | ^^^^^^^^^^^^^^^^^^^^^^^^^^^^^^^^^^^^^^^^^^^^^^^^...
171Warning: -rtsopts and -with-rtsopts have no effect with -no-hs-main.
172 Call hs_init_ghc() from your main() function to set these options.
173
174compiler/main/DynFlags.hs:247:1: warning: [-Wunused-imports]
175 The import of ‘Foreign’ is redundant
176 except perhaps to import instances from ‘Foreign’
177 To import instances alone, use: import Foreign()
178 |
179247 | import Foreign (Ptr) -- needed for 2nd stage
180 | ^^^^^^^^^^^^^^^^^^^^
181rts-1.0: Warning: .:739:1: The field "hugs-options" is deprecated. hugs isn't supported anymore
182rts-1.0: cannot find any of ["libHSrts.a","libHSrts.p_a","libHSrts-ghc8.7.20180728.so","libHSrts-ghc8.7.20180728.dylib","HSrts-ghc8.7.20180728.dll"] on library path (ignoring)
183rts-1.0: cannot find any of ["libCffi.a","libCffi.p_a","libCffi-ghc8.7.20180728.so","libCffi-ghc8.7.20180728.dylib","Cffi-ghc8.7.20180728.dll"] on library path (ignoring)
184
185compiler/main/DynamicLoading.hs:79:19: warning: [-Wunused-matches]
186 Defined but not used: ‘hsc_env’
187 |
18879 | initializePlugins hsc_env df
189 | ^^^^^^^
190
191compiler/ghci/RtClosureInspect.hs:60:1: warning: [-Wunused-imports]
192 The import of ‘GHC.Exts’ is redundant
193 except perhaps to import instances from ‘GHC.Exts’
194 To import instances alone, use: import GHC.Exts()
195 |
19660 | import GHC.Exts
197 | ^^^^^^^^^^^^^^^
198
199compiler/ghci/RtClosureInspect.hs:66:1: warning: [-Wunused-imports]
200 The import of ‘Data.Array.Base’ is redundant
201 except perhaps to import instances from ‘Data.Array.Base’
202 To import instances alone, use: import Data.Array.Base()
203 |
20466 | import Data.Array.Base
205 | ^^^^^^^^^^^^^^^^^^^^^^
206
207compiler/ghci/RtClosureInspect.hs:354:4: warning: [-Wunused-local-binds]
208 Defined but not used: ‘isIntegerTy’
209 |
210354 | isIntegerTy ty = fromMaybe False $ do
211 | ^^^^^^^^^^^
212
213compiler/ghci/RtClosureInspect.hs:418:4: warning: [-Wunused-local-binds]
214 Defined but not used: ‘ppr_integer’
215 |
216418 | ppr_integer _ _ = return Nothing
217 | ^^^^^^^^^^^
218Warning: -rtsopts and -with-rtsopts have no effect with -no-hs-main.
219 Call hs_init_ghc() from your main() function to set these options.
220ghc-prim-0.5.3: Warning: haddock-interfaces: /private/var/drydock/workingcopy-121269/repo/glasgow-haskell-compiler/libraries/ghc-prim/dist-install/doc/html/ghc-prim/ghc-prim.haddock doesn't exist or isn't a file
221ghc-prim-0.5.3: Warning: haddock-html: /private/var/drydock/workingcopy-121269/repo/glasgow-haskell-compiler/libraries/ghc-prim/dist-install/doc/html/ghc-prim doesn't exist or isn't a directory
222integer-gmp-1.0.2.0: Warning: haddock-interfaces: /private/var/drydock/workingcopy-121269/repo/glasgow-haskell-compiler/libraries/integer-gmp/dist-install/doc/html/integer-gmp/integer-gmp.haddock doesn't exist or isn't a file
223integer-gmp-1.0.2.0: Warning: haddock-html: /private/var/drydock/workingcopy-121269/repo/glasgow-haskell-compiler/libraries/integer-gmp/dist-install/doc/html/integer-gmp doesn't exist or isn't a directory
224base-4.12.0.0: Warning: haddock-interfaces: /private/var/drydock/workingcopy-121269/repo/glasgow-haskell-compiler/libraries/base/dist-install/doc/html/base/base.haddock doesn't exist or isn't a file
225base-4.12.0.0: Warning: haddock-html: /private/var/drydock/workingcopy-121269/repo/glasgow-haskell-compiler/libraries/base/dist-install/doc/html/base doesn't exist or isn't a directory
226filepath-1.4.2: Warning: haddock-interfaces: /private/var/drydock/workingcopy-121269/repo/glasgow-haskell-compiler/libraries/filepath/dist-install/doc/html/filepath/filepath.haddock doesn't exist or isn't a file
227filepath-1.4.2: Warning: haddock-html: /private/var/drydock/workingcopy-121269/repo/glasgow-haskell-compiler/libraries/filepath/dist-install/doc/html/filepath doesn't exist or isn't a directory
228array-0.5.2.0: Warning: haddock-interfaces: /private/var/drydock/workingcopy-121269/repo/glasgow-haskell-compiler/libraries/array/dist-install/doc/html/array/array.haddock doesn't exist or isn't a file
229array-0.5.2.0: Warning: haddock-html: /private/var/drydock/workingcopy-121269/repo/glasgow-haskell-compiler/libraries/array/dist-install/doc/html/array doesn't exist or isn't a directory
230deepseq-1.4.4.0: Warning: haddock-interfaces: /private/var/drydock/workingcopy-121269/repo/glasgow-haskell-compiler/libraries/deepseq/dist-install/doc/html/deepseq/deepseq.haddock doesn't exist or isn't a file
231deepseq-1.4.4.0: Warning: haddock-html: /private/var/drydock/workingcopy-121269/repo/glasgow-haskell-compiler/libraries/deepseq/dist-install/doc/html/deepseq doesn't exist or isn't a directory
232bytestring-0.10.8.2: Warning: include-dirs: /private/var/drydock/workingcopy-121269/repo/glasgow-haskell-compiler/libraries/bytestring/dist-install/build/include doesn't exist or isn't a directory
233bytestring-0.10.8.2: Warning: haddock-interfaces: /private/var/drydock/workingcopy-121269/repo/glasgow-haskell-compiler/libraries/bytestring/dist-install/doc/html/bytestring/bytestring.haddock doesn't exist or isn't a file
234bytestring-0.10.8.2: Warning: haddock-html: /private/var/drydock/workingcopy-121269/repo/glasgow-haskell-compiler/libraries/bytestring/dist-install/doc/html/bytestring doesn't exist or isn't a directory
235containers-0.6.0.1: Warning: include-dirs: /private/var/drydock/workingcopy-121269/repo/glasgow-haskell-compiler/libraries/containers/dist-install/build/include doesn't exist or isn't a directory
236containers-0.6.0.1: Warning: haddock-interfaces: /private/var/drydock/workingcopy-121269/repo/glasgow-haskell-compiler/libraries/containers/dist-install/doc/html/containers/containers.haddock doesn't exist or isn't a file
237containers-0.6.0.1: Warning: haddock-html: /private/var/drydock/workingcopy-121269/repo/glasgow-haskell-compiler/libraries/containers/dist-install/doc/html/containers doesn't exist or isn't a directory
238time-1.8.0.2: Warning: haddock-interfaces: /private/var/drydock/workingcopy-121269/repo/glasgow-haskell-compiler/libraries/time/dist-install/doc/html/time/time.haddock doesn't exist or isn't a file
239time-1.8.0.2: Warning: haddock-html: /private/var/drydock/workingcopy-121269/repo/glasgow-haskell-compiler/libraries/time/dist-install/doc/html/time doesn't exist or isn't a directory
240unix-2.8.0.0: Warning: haddock-interfaces: /private/var/drydock/workingcopy-121269/repo/glasgow-haskell-compiler/libraries/unix/dist-install/doc/html/unix/unix.haddock doesn't exist or isn't a file
241unix-2.8.0.0: Warning: haddock-html: /private/var/drydock/workingcopy-121269/repo/glasgow-haskell-compiler/libraries/unix/dist-install/doc/html/unix doesn't exist or isn't a directory
242directory-1.3.3.0: Warning: haddock-interfaces: /private/var/drydock/workingcopy-121269/repo/glasgow-haskell-compiler/libraries/directory/dist-install/doc/html/directory/directory.haddock doesn't exist or isn't a file
243directory-1.3.3.0: Warning: haddock-html: /private/var/drydock/workingcopy-121269/repo/glasgow-haskell-compiler/libraries/directory/dist-install/doc/html/directory doesn't exist or isn't a directory
244process-1.6.3.0: Warning: haddock-interfaces: /private/var/drydock/workingcopy-121269/repo/glasgow-haskell-compiler/libraries/process/dist-install/doc/html/process/process.haddock doesn't exist or isn't a file
245process-1.6.3.0: Warning: haddock-html: /private/var/drydock/workingcopy-121269/repo/glasgow-haskell-compiler/libraries/process/dist-install/doc/html/process doesn't exist or isn't a directory
246hpc-0.6.0.3: Warning: haddock-interfaces: /private/var/drydock/workingcopy-121269/repo/glasgow-haskell-compiler/libraries/hpc/dist-install/doc/html/hpc/hpc.haddock doesn't exist or isn't a file
247hpc-0.6.0.3: Warning: haddock-html: /private/var/drydock/workingcopy-121269/repo/glasgow-haskell-compiler/libraries/hpc/dist-install/doc/html/hpc doesn't exist or isn't a directory
248pretty-1.1.3.6: Warning: haddock-interfaces: /private/var/drydock/workingcopy-121269/repo/glasgow-haskell-compiler/libraries/pretty/dist-install/doc/html/pretty/pretty.haddock doesn't exist or isn't a file
249pretty-1.1.3.6: Warning: haddock-html: /private/var/drydock/workingcopy-121269/repo/glasgow-haskell-compiler/libraries/pretty/dist-install/doc/html/pretty doesn't exist or isn't a directory
250binary-0.8.5.1: Warning: haddock-interfaces: /private/var/drydock/workingcopy-121269/repo/glasgow-haskell-compiler/libraries/binary/dist-install/doc/html/binary/binary.haddock doesn't exist or isn't a file
251binary-0.8.5.1: Warning: haddock-html: /private/var/drydock/workingcopy-121269/repo/glasgow-haskell-compiler/libraries/binary/dist-install/doc/html/binary doesn't exist or isn't a directory
252Warning: text.cabal:4:1: The field "bug-reports" is specified more than once
253at positions 4:1, 42:1
254Warning: text.cabal:4:1: The field "bug-reports" is specified more than once
255at positions 4:1, 42:1
256text-1.2.3.0: Warning: include-dirs: /private/var/drydock/workingcopy-121269/repo/glasgow-haskell-compiler/libraries/text/dist-install/build/include doesn't exist or isn't a directory
257text-1.2.3.0: Warning: haddock-interfaces: /private/var/drydock/workingcopy-121269/repo/glasgow-haskell-compiler/libraries/text/dist-install/doc/html/text/text.haddock doesn't exist or isn't a file
258text-1.2.3.0: Warning: haddock-html: /private/var/drydock/workingcopy-121269/repo/glasgow-haskell-compiler/libraries/text/dist-install/doc/html/text doesn't exist or isn't a directory
259transformers-0.5.5.0: Warning: haddock-interfaces: /private/var/drydock/workingcopy-121269/repo/glasgow-haskell-compiler/libraries/transformers/dist-install/doc/html/transformers/transformers.haddock doesn't exist or isn't a file
260transformers-0.5.5.0: Warning: haddock-html: /private/var/drydock/workingcopy-121269/repo/glasgow-haskell-compiler/libraries/transformers/dist-install/doc/html/transformers doesn't exist or isn't a directory
261mtl-2.2.2: Warning: haddock-interfaces: /private/var/drydock/workingcopy-121269/repo/glasgow-haskell-compiler/libraries/mtl/dist-install/doc/html/mtl/mtl.haddock doesn't exist or isn't a file
262mtl-2.2.2: Warning: haddock-html: /private/var/drydock/workingcopy-121269/repo/glasgow-haskell-compiler/libraries/mtl/dist-install/doc/html/mtl doesn't exist or isn't a directory
263parsec-3.1.13.0.0.0.0.0: Warning: haddock-interfaces: /private/var/drydock/workingcopy-121269/repo/glasgow-haskell-compiler/libraries/parsec/dist-install/doc/html/parsec/parsec.haddock doesn't exist or isn't a file
264parsec-3.1.13.0.0.0.0.0: Warning: haddock-html: /private/var/drydock/workingcopy-121269/repo/glasgow-haskell-compiler/libraries/parsec/dist-install/doc/html/parsec doesn't exist or isn't a directory
265Cabal-2.3.0.0: Warning: haddock-interfaces: /private/var/drydock/workingcopy-121269/repo/glasgow-haskell-compiler/libraries/Cabal/Cabal/dist-install/doc/html/Cabal/Cabal.haddock doesn't exist or isn't a file
266Cabal-2.3.0.0: Warning: haddock-html: /private/var/drydock/workingcopy-121269/repo/glasgow-haskell-compiler/libraries/Cabal/Cabal/dist-install/doc/html/Cabal doesn't exist or isn't a directory
267ghc-boot-th-8.7: Warning: haddock-interfaces: /private/var/drydock/workingcopy-121269/repo/glasgow-haskell-compiler/libraries/ghc-boot-th/dist-install/doc/html/ghc-boot-th/ghc-boot-th.haddock doesn't exist or isn't a file
268ghc-boot-th-8.7: Warning: haddock-html: /private/var/drydock/workingcopy-121269/repo/glasgow-haskell-compiler/libraries/ghc-boot-th/dist-install/doc/html/ghc-boot-th doesn't exist or isn't a directory
269ghc-boot-8.7: Warning: haddock-interfaces: /private/var/drydock/workingcopy-121269/repo/glasgow-haskell-compiler/libraries/ghc-boot/dist-install/doc/html/ghc-boot/ghc-boot.haddock doesn't exist or isn't a file
270ghc-boot-8.7: Warning: haddock-html: /private/var/drydock/workingcopy-121269/repo/glasgow-haskell-compiler/libraries/ghc-boot/dist-install/doc/html/ghc-boot doesn't exist or isn't a directory
271template-haskell-2.14.0.0: Warning: haddock-interfaces: /private/var/drydock/workingcopy-121269/repo/glasgow-haskell-compiler/libraries/template-haskell/dist-install/doc/html/template-haskell/template-haskell.haddock doesn't exist or isn't a file
272template-haskell-2.14.0.0: Warning: haddock-html: /private/var/drydock/workingcopy-121269/repo/glasgow-haskell-compiler/libraries/template-haskell/dist-install/doc/html/template-haskell doesn't exist or isn't a directory
273ghc-compact-0.1.0.0: Warning: haddock-interfaces: /private/var/drydock/workingcopy-121269/repo/glasgow-haskell-compiler/libraries/ghc-compact/dist-install/doc/html/ghc-compact/ghc-compact.haddock doesn't exist or isn't a file
274ghc-compact-0.1.0.0: Warning: haddock-html: /private/var/drydock/workingcopy-121269/repo/glasgow-haskell-compiler/libraries/ghc-compact/dist-install/doc/html/ghc-compact doesn't exist or isn't a directory
275ghc-heap-8.7: Warning: haddock-interfaces: /private/var/drydock/workingcopy-121269/repo/glasgow-haskell-compiler/libraries/ghc-heap/dist-install/doc/html/ghc-heap/ghc-heap.haddock doesn't exist or isn't a file
276ghc-heap-8.7: Warning: haddock-html: /private/var/drydock/workingcopy-121269/repo/glasgow-haskell-compiler/libraries/ghc-heap/dist-install/doc/html/ghc-heap doesn't exist or isn't a directory
277xhtml-3000.2.2.1: Warning: haddock-interfaces: /private/var/drydock/workingcopy-121269/repo/glasgow-haskell-compiler/libraries/xhtml/dist-install/doc/html/xhtml/xhtml.haddock doesn't exist or isn't a file
278xhtml-3000.2.2.1: Warning: haddock-html: /private/var/drydock/workingcopy-121269/repo/glasgow-haskell-compiler/libraries/xhtml/dist-install/doc/html/xhtml doesn't exist or isn't a directory
279terminfo-0.4.1.1: Warning: haddock-interfaces: /private/var/drydock/workingcopy-121269/repo/glasgow-haskell-compiler/libraries/terminfo/dist-install/doc/html/terminfo/terminfo.haddock doesn't exist or isn't a file
280terminfo-0.4.1.1: Warning: haddock-html: /private/var/drydock/workingcopy-121269/repo/glasgow-haskell-compiler/libraries/terminfo/dist-install/doc/html/terminfo doesn't exist or isn't a directory
281stm-2.5.0.0: Warning: haddock-interfaces: /private/var/drydock/workingcopy-121269/repo/glasgow-haskell-compiler/libraries/stm/dist-install/doc/html/stm/stm.haddock doesn't exist or isn't a file
282stm-2.5.0.0: Warning: haddock-html: /private/var/drydock/workingcopy-121269/repo/glasgow-haskell-compiler/libraries/stm/dist-install/doc/html/stm doesn't exist or isn't a directory
283haskeline-0.7.4.3: Warning: include-dirs: /private/var/drydock/workingcopy-121269/repo/glasgow-haskell-compiler/libraries/haskeline/dist-install/build/includes doesn't exist or isn't a directory
284haskeline-0.7.4.3: Warning: haddock-interfaces: /private/var/drydock/workingcopy-121269/repo/glasgow-haskell-compiler/libraries/haskeline/dist-install/doc/html/haskeline/haskeline.haddock doesn't exist or isn't a file
285haskeline-0.7.4.3: Warning: haddock-html: /private/var/drydock/workingcopy-121269/repo/glasgow-haskell-compiler/libraries/haskeline/dist-install/doc/html/haskeline doesn't exist or isn't a directory
286ghci-8.7: Warning: haddock-interfaces: /private/var/drydock/workingcopy-121269/repo/glasgow-haskell-compiler/libraries/ghci/dist-install/doc/html/ghci/ghci.haddock doesn't exist or isn't a file
287ghci-8.7: Warning: haddock-html: /private/var/drydock/workingcopy-121269/repo/glasgow-haskell-compiler/libraries/ghci/dist-install/doc/html/ghci doesn't exist or isn't a directory
288libiserv-8.7.1: Warning: haddock-interfaces: /private/var/drydock/workingcopy-121269/repo/glasgow-haskell-compiler/libraries/libiserv/dist-install/doc/html/libiserv/libiserv.haddock doesn't exist or isn't a file
289libiserv-8.7.1: Warning: haddock-html: /private/var/drydock/workingcopy-121269/repo/glasgow-haskell-compiler/libraries/libiserv/dist-install/doc/html/libiserv doesn't exist or isn't a directory
290Warning: hpc-bin.cabal:11:2: Tabs used as indentation at 11:2
291Warning: hpc-bin.cabal:11:2: Tabs used as indentation at 11:2
292ghc-8.7: Warning: include-dirs: /private/var/drydock/workingcopy-121269/repo/glasgow-haskell-compiler/compiler/stage2/build/parser doesn't exist or isn't a directory
293ghc-8.7: Warning: include-dirs: /private/var/drydock/workingcopy-121269/repo/glasgow-haskell-compiler/compiler/stage2/build/utils doesn't exist or isn't a directory
294ghc-8.7: Warning: include-dirs: /private/var/drydock/workingcopy-121269/repo/glasgow-haskell-compiler/compiler/stage2/build/../rts/dist/build doesn't exist or isn't a directory
295ghc-8.7: Warning: include-dirs: /private/var/drydock/workingcopy-121269/repo/glasgow-haskell-compiler/compiler/stage2/build/stage2 doesn't exist or isn't a directory
296ghc-8.7: Warning: haddock-interfaces: /private/var/drydock/workingcopy-121269/repo/glasgow-haskell-compiler/compiler/stage2/doc/html/ghc/ghc.haddock doesn't exist or isn't a file
297ghc-8.7: Warning: haddock-html: /private/var/drydock/workingcopy-121269/repo/glasgow-haskell-compiler/compiler/stage2/doc/html/ghc doesn't exist or isn't a directory
298parallel-3.2.2.0: Warning: haddock-interfaces: /private/var/drydock/workingcopy-121269/repo/glasgow-haskell-compiler/libraries/parallel/dist-install/doc/html/parallel/parallel.haddock doesn't exist or isn't a file
299parallel-3.2.2.0: Warning: haddock-html: /private/var/drydock/workingcopy-121269/repo/glasgow-haskell-compiler/libraries/parallel/dist-install/doc/html/parallel doesn't exist or isn't a directory
300utils/unlit/ghc.mk:34: utils/unlit/dist-install/build/.depend.c_asm: No such file or directory
301utils/hp2ps/ghc.mk:44: utils/hp2ps/dist-install/build/.depend.c_asm: No such file or directory
302rts/ghc.mk:570: rts/dist/build/.depend-v-dyn-l-debug-thr-thr_debug-thr_l-debug_dyn-thr_dyn-thr_debug_dyn-l_dyn-thr_l_dyn.c_asm: No such file or directory
303libraries/parallel/ghc.mk:5: libraries/parallel/dist-install/build/.depend-v-dyn.haskell: No such file or directory
304libraries/parallel/ghc.mk:5: libraries/parallel/dist-install/build/.depend-v-dyn.c_asm: No such file or directory
305libraries/ghc-prim/ghc.mk:4: libraries/ghc-prim/dist-install/build/.depend-v-dyn.haskell: No such file or directory
306libraries/ghc-prim/ghc.mk:4: libraries/ghc-prim/dist-install/build/.depend-v-dyn.c_asm: No such file or directory
307libraries/integer-gmp/ghc.mk:4: libraries/integer-gmp/dist-install/build/.depend-v-dyn.haskell: No such file or directory
308libraries/integer-gmp/ghc.mk:4: libraries/integer-gmp/dist-install/build/.depend-v-dyn.c_asm: No such file or directory
309libraries/base/ghc.mk:4: libraries/base/dist-install/build/.depend-v-dyn.haskell: No such file or directory
310libraries/base/ghc.mk:4: libraries/base/dist-install/build/.depend-v-dyn.c_asm: No such file or directory
311libraries/filepath/ghc.mk:4: libraries/filepath/dist-install/build/.depend-v-dyn.haskell: No such file or directory
312libraries/filepath/ghc.mk:4: libraries/filepath/dist-install/build/.depend-v-dyn.c_asm: No such file or directory
313libraries/array/ghc.mk:4: libraries/array/dist-install/build/.depend-v-dyn.haskell: No such file or directory
314libraries/array/ghc.mk:4: libraries/array/dist-install/build/.depend-v-dyn.c_asm: No such file or directory
315libraries/deepseq/ghc.mk:4: libraries/deepseq/dist-install/build/.depend-v-dyn.haskell: No such file or directory
316libraries/deepseq/ghc.mk:4: libraries/deepseq/dist-install/build/.depend-v-dyn.c_asm: No such file or directory
317libraries/bytestring/ghc.mk:4: libraries/bytestring/dist-install/build/.depend-v-dyn.haskell: No such file or directory
318libraries/bytestring/ghc.mk:4: libraries/bytestring/dist-install/build/.depend-v-dyn.c_asm: No such file or directory
319libraries/containers/ghc.mk:4: libraries/containers/dist-install/build/.depend-v-dyn.haskell: No such file or directory
320libraries/containers/ghc.mk:4: libraries/containers/dist-install/build/.depend-v-dyn.c_asm: No such file or directory
321libraries/time/ghc.mk:4: libraries/time/dist-install/build/.depend-v-dyn.haskell: No such file or directory
322libraries/time/ghc.mk:4: libraries/time/dist-install/build/.depend-v-dyn.c_asm: No such file or directory
323libraries/unix/ghc.mk:4: libraries/unix/dist-install/build/.depend-v-dyn.haskell: No such file or directory
324libraries/unix/ghc.mk:4: libraries/unix/dist-install/build/.depend-v-dyn.c_asm: No such file or directory
325libraries/directory/ghc.mk:4: libraries/directory/dist-install/build/.depend-v-dyn.haskell: No such file or directory
326libraries/directory/ghc.mk:4: libraries/directory/dist-install/build/.depend-v-dyn.c_asm: No such file or directory
327libraries/process/ghc.mk:4: libraries/process/dist-install/build/.depend-v-dyn.haskell: No such file or directory
328libraries/process/ghc.mk:4: libraries/process/dist-install/build/.depend-v-dyn.c_asm: No such file or directory
329libraries/hpc/ghc.mk:4: libraries/hpc/dist-install/build/.depend-v-dyn.haskell: No such file or directory
330libraries/hpc/ghc.mk:4: libraries/hpc/dist-install/build/.depend-v-dyn.c_asm: No such file or directory
331libraries/pretty/ghc.mk:4: libraries/pretty/dist-install/build/.depend-v-dyn.haskell: No such file or directory
332libraries/pretty/ghc.mk:4: libraries/pretty/dist-install/build/.depend-v-dyn.c_asm: No such file or directory
333libraries/binary/ghc.mk:4: libraries/binary/dist-install/build/.depend-v-dyn.haskell: No such file or directory
334libraries/binary/ghc.mk:4: libraries/binary/dist-install/build/.depend-v-dyn.c_asm: No such file or directory
335libraries/text/ghc.mk:4: libraries/text/dist-install/build/.depend-v-dyn.haskell: No such file or directory
336libraries/text/ghc.mk:4: libraries/text/dist-install/build/.depend-v-dyn.c_asm: No such file or directory
337libraries/transformers/ghc.mk:4: libraries/transformers/dist-install/build/.depend-v-dyn.haskell: No such file or directory
338libraries/transformers/ghc.mk:4: libraries/transformers/dist-install/build/.depend-v-dyn.c_asm: No such file or directory
339libraries/mtl/ghc.mk:4: libraries/mtl/dist-install/build/.depend-v-dyn.haskell: No such file or directory
340libraries/mtl/ghc.mk:4: libraries/mtl/dist-install/build/.depend-v-dyn.c_asm: No such file or directory
341libraries/parsec/ghc.mk:4: libraries/parsec/dist-install/build/.depend-v-dyn.haskell: No such file or directory
342libraries/parsec/ghc.mk:4: libraries/parsec/dist-install/build/.depend-v-dyn.c_asm: No such file or directory
343libraries/Cabal/Cabal/ghc.mk:4: libraries/Cabal/Cabal/dist-install/build/.depend-v-dyn.haskell: No such file or directory
344libraries/Cabal/Cabal/ghc.mk:4: libraries/Cabal/Cabal/dist-install/build/.depend-v-dyn.c_asm: No such file or directory
345libraries/ghc-boot-th/ghc.mk:4: libraries/ghc-boot-th/dist-install/build/.depend-v-dyn.haskell: No such file or directory
346libraries/ghc-boot-th/ghc.mk:4: libraries/ghc-boot-th/dist-install/build/.depend-v-dyn.c_asm: No such file or directory
347libraries/ghc-boot/ghc.mk:4: libraries/ghc-boot/dist-install/build/.depend-v-dyn.haskell: No such file or directory
348libraries/ghc-boot/ghc.mk:4: libraries/ghc-boot/dist-install/build/.depend-v-dyn.c_asm: No such file or directory
349libraries/template-haskell/ghc.mk:4: libraries/template-haskell/dist-install/build/.depend-v-dyn.haskell: No such file or directory
350libraries/template-haskell/ghc.mk:4: libraries/template-haskell/dist-install/build/.depend-v-dyn.c_asm: No such file or directory
351libraries/ghc-compact/ghc.mk:4: libraries/ghc-compact/dist-install/build/.depend-v-dyn.haskell: No such file or directory
352libraries/ghc-compact/ghc.mk:4: libraries/ghc-compact/dist-install/build/.depend-v-dyn.c_asm: No such file or directory
353libraries/ghc-heap/ghc.mk:4: libraries/ghc-heap/dist-install/build/.depend-v-dyn.haskell: No such file or directory
354libraries/ghc-heap/ghc.mk:4: libraries/ghc-heap/dist-install/build/.depend-v-dyn.c_asm: No such file or directory
355libraries/xhtml/ghc.mk:4: libraries/xhtml/dist-install/build/.depend-v-dyn.haskell: No such file or directory
356libraries/xhtml/ghc.mk:4: libraries/xhtml/dist-install/build/.depend-v-dyn.c_asm: No such file or directory
357libraries/terminfo/ghc.mk:4: libraries/terminfo/dist-install/build/.depend-v-dyn.haskell: No such file or directory
358libraries/terminfo/ghc.mk:4: libraries/terminfo/dist-install/build/.depend-v-dyn.c_asm: No such file or directory
359libraries/stm/ghc.mk:4: libraries/stm/dist-install/build/.depend-v-dyn.haskell: No such file or directory
360libraries/stm/ghc.mk:4: libraries/stm/dist-install/build/.depend-v-dyn.c_asm: No such file or directory
361libraries/haskeline/ghc.mk:4: libraries/haskeline/dist-install/build/.depend-v-dyn.haskell: No such file or directory
362libraries/haskeline/ghc.mk:4: libraries/haskeline/dist-install/build/.depend-v-dyn.c_asm: No such file or directory
363libraries/ghci/ghc.mk:4: libraries/ghci/dist-install/build/.depend-v-dyn.haskell: No such file or directory
364libraries/ghci/ghc.mk:4: libraries/ghci/dist-install/build/.depend-v-dyn.c_asm: No such file or directory
365libraries/libiserv/ghc.mk:4: libraries/libiserv/dist-install/build/.depend-v-dyn.haskell: No such file or directory
366libraries/libiserv/ghc.mk:4: libraries/libiserv/dist-install/build/.depend-v-dyn.c_asm: No such file or directory
367Configured with: --prefix=/Applications/Xcode-7.2/Xcode.app/Contents/Developer/usr --with-gxx-include-dir=/usr/include/c++/4.2.1
368utils/haddock/ghc.mk:20: utils/haddock/dist/build/.depend.haskell: No such file or directory
369utils/haddock/ghc.mk:20: utils/haddock/dist/build/.depend.c_asm: No such file or directory
370compiler/ghc.mk:447: compiler/stage2/build/.depend-v-dyn.haskell: No such file or directory
371compiler/ghc.mk:447: compiler/stage2/build/.depend-v-dyn.c_asm: No such file or directory
372utils/hsc2hs/ghc.mk:22: utils/hsc2hs/dist-install/build/.depend.haskell: No such file or directory
373utils/hsc2hs/ghc.mk:22: utils/hsc2hs/dist-install/build/.depend.c_asm: No such file or directory
374utils/ghc-pkg/ghc.mk:93: utils/ghc-pkg/dist-install/build/.depend.haskell: No such file or directory
375utils/ghc-pkg/ghc.mk:93: utils/ghc-pkg/dist-install/build/.depend.c_asm: No such file or directory
376utils/ghctags/ghc.mk:18: utils/ghctags/dist-install/build/.depend.haskell: No such file or directory
377utils/ghctags/ghc.mk:18: utils/ghctags/dist-install/build/.depend.c_asm: No such file or directory
378utils/check-api-annotations/ghc.mk:18: utils/check-api-annotations/dist-install/build/.depend.haskell: No such file or directory
379utils/check-api-annotations/ghc.mk:18: utils/check-api-annotations/dist-install/build/.depend.c_asm: No such file or directory
380utils/check-ppr/ghc.mk:18: utils/check-ppr/dist-install/build/.depend.haskell: No such file or directory
381utils/check-ppr/ghc.mk:18: utils/check-ppr/dist-install/build/.depend.c_asm: No such file or directory
382utils/ghc-cabal/ghc.mk:103: utils/ghc-cabal/dist-install/build/.depend.haskell: No such file or directory
383utils/ghc-cabal/ghc.mk:103: utils/ghc-cabal/dist-install/build/.depend.c_asm: No such file or directory
384utils/hpc/ghc.mk:21: utils/hpc/dist-install/build/.depend.haskell: No such file or directory
385utils/hpc/ghc.mk:21: utils/hpc/dist-install/build/.depend.c_asm: No such file or directory
386utils/runghc/ghc.mk:30: utils/runghc/dist-install/build/.depend.haskell: No such file or directory
387utils/runghc/ghc.mk:30: utils/runghc/dist-install/build/.depend.c_asm: No such file or directory
388ghc/ghc.mk:112: ghc/stage2/build/.depend.haskell: No such file or directory
389ghc/ghc.mk:112: ghc/stage2/build/.depend.c_asm: No such file or directory
390utils/compare_sizes/ghc.mk:8: utils/compare_sizes/dist-install/build/.depend.haskell: No such file or directory
391utils/compare_sizes/ghc.mk:8: utils/compare_sizes/dist-install/build/.depend.c_asm: No such file or directory
392utils/iserv/ghc.mk:100: utils/iserv/stage2/build/.depend.haskell: No such file or directory
393utils/iserv/ghc.mk:100: utils/iserv/stage2/build/.depend.c_asm: No such file or directory
394utils/iserv/ghc.mk:108: utils/iserv/stage2_dyn/build/.depend.haskell: No such file or directory
395utils/iserv/ghc.mk:108: utils/iserv/stage2_dyn/build/.depend.c_asm: No such file or directory
396unused terminals: 1
397clang: error: unsupported option '-print-multi-os-directory'
398clang: error: no input files
399Makefile:3406: warning: overriding commands for target `libffi.map'
400Makefile:731: warning: ignoring old commands for target `libffi.map'
401Makefile:1804: warning: overriding commands for target `libffi.map'
402Makefile:672: warning: ignoring old commands for target `libffi.map'
403Makefile:1804: warning: overriding commands for target `libffi.map'
404Makefile:672: warning: ignoring old commands for target `libffi.map'
405Makefile:1804: warning: overriding commands for target `libffi.map'
406Makefile:672: warning: ignoring old commands for target `libffi.map'
407unused terminals: 2
408ld: warning: could not create compact unwind for _ffi_call_unix64: does not use RBP or RSP based frame
409Makefile:3406: warning: overriding commands for target `libffi.map'
410Makefile:731: warning: ignoring old commands for target `libffi.map'
411Makefile:1804: warning: overriding commands for target `libffi.map'
412Makefile:672: warning: ignoring old commands for target `libffi.map'
413Makefile:1804: warning: overriding commands for target `libffi.map'
414Makefile:672: warning: ignoring old commands for target `libffi.map'
415Makefile:1804: warning: overriding commands for target `libffi.map'
416Makefile:672: warning: ignoring old commands for target `libffi.map'
417Configured with: --prefix=/Applications/Xcode-7.2/Xcode.app/Contents/Developer/usr --with-gxx-include-dir=/usr/include/c++/4.2.1
418clang: error: optimization flag '-fkeep-inline-functions' is not supported
419clang: error: optimization flag '-fkeep-inline-functions' is not supported
420`gcc' failed in phase `C Compiler'. (Exit code: 1)
421`gcc' failed in phase `C Compiler'. (Exit code: 1)
422make[1]: *** [rts/dist/build/Adjustor.debug_o] Error 1
423make[1]: *** Waiting for unfinished jobs....
424make[1]: *** [rts/dist/build/Arena.debug_o] Error 1
425clang: error: optimization flag '-fkeep-inline-functions' is not supported
426`gcc' failed in phase `C Compiler'. (Exit code: 1)
427make[1]: *** [rts/dist/build/Capability.debug_o] Error 1
428make: *** [all] Error 2
429

Build Log 290481 (remote - stdout)
25 - 50 - 100 - Unlimited Lines

1Creating libraries/array/ghc.mk
2Creating libraries/base/ghc.mk
3Creating libraries/binary/ghc.mk
4Creating libraries/bytestring/ghc.mk
5Creating libraries/Cabal/Cabal/ghc.mk
6Creating libraries/containers/ghc.mk
7Creating libraries/deepseq/ghc.mk
8Creating libraries/directory/ghc.mk
9Creating libraries/dph/dph-base/ghc.mk
10Creating libraries/dph/dph-prim-interface/ghc.mk
11Creating libraries/dph/dph-prim-seq/ghc.mk
12Creating libraries/dph/dph-prim-par/ghc.mk
13Creating libraries/dph/dph-lifted-base/ghc.mk
14Creating libraries/dph/dph-lifted-boxed/ghc.mk
15Creating libraries/dph/dph-lifted-copy/ghc.mk
16Creating libraries/dph/dph-lifted-vseg/ghc.mk
17Creating libraries/filepath/ghc.mk
18Creating libraries/ghc-boot/ghc.mk
19Creating libraries/ghc-boot-th/ghc.mk
20Creating libraries/ghc-compact/ghc.mk
21Creating libraries/ghc-heap/ghc.mk
22Creating libraries/ghc-prim/ghc.mk
23Creating libraries/ghci/ghc.mk
24Creating libraries/haskeline/ghc.mk
25Creating libraries/hpc/ghc.mk
26Creating libraries/integer-gmp/ghc.mk
27Creating libraries/integer-simple/ghc.mk
28Creating libraries/libiserv/ghc.mk
29Creating libraries/mtl/ghc.mk
30Creating libraries/parallel/ghc.mk
31Creating libraries/parsec/ghc.mk
32Creating libraries/pretty/ghc.mk
33Creating libraries/primitive/ghc.mk
34Creating libraries/process/ghc.mk
35Creating libraries/random/ghc.mk
36Creating libraries/stm/ghc.mk
37Creating libraries/template-haskell/ghc.mk
38Creating libraries/terminfo/ghc.mk
39Creating libraries/text/ghc.mk
40Creating libraries/time/ghc.mk
41Creating libraries/transformers/ghc.mk
42Creating libraries/unix/ghc.mk
43Creating libraries/vector/ghc.mk
44Creating libraries/Win32/ghc.mk
45Creating libraries/xhtml/ghc.mk
46Booting .
47Booting libraries/base/
48Booting libraries/directory/
49Booting libraries/ghc-prim/
50Booting libraries/integer-gmp/
51Booting libraries/process/
52Booting libraries/terminfo/
53Booting libraries/time/
54Booting libraries/unix/
55checking for gfind... no
56checking for find... /usr/bin/find
57checking for sort... /usr/bin/sort
58checking for GHC version date... inferred 8.7.20180728
59checking for GHC Git commit id... inferred 3539561b24b78aee2b37280ddf6bb64e2db3a67d
60checking for ghc... /opt/ghc-8.4.3/bin/ghc
61checking version of ghc... 8.4.3
62checking build system type... x86_64-apple-darwin16.0.0
63checking host system type... x86_64-apple-darwin16.0.0
64checking target system type... x86_64-apple-darwin16.0.0
65Build platform inferred as: x86_64-apple-darwin
66Host platform inferred as: x86_64-apple-darwin
67Target platform inferred as: x86_64-apple-darwin
68GHC build : x86_64-apple-darwin
69GHC host : x86_64-apple-darwin
70GHC target : x86_64-apple-darwin
71LLVM target: x86_64-apple-darwin
72checking for path to top of build tree... /var/drydock/workingcopy-121269/repo/glasgow-haskell-compiler
73checking for -windres... no
74checking for windres... no
75checking for -dllwrap... no
76checking for dllwrap... no
77checking for -objdump... no
78checking for objdump... objdump
79checking XCode version... 8.0
80configure: XCode version component 1: 8
81configure: XCode version component 2: 0
82checking for gcc... gcc
83checking whether the C compiler works... yes
84checking for C compiler default output file name... a.out
85checking for suffix of executables...
86checking whether we are cross compiling... no
87checking for suffix of object files... o
88checking whether we are using the GNU C compiler... yes
89checking whether gcc accepts -g... yes
90checking for gcc option to accept ISO C89... none needed
91checking how to run the C preprocessor... gcc -E
92checking for grep that handles long lines and -e... /usr/bin/grep
93checking for egrep... /usr/bin/grep -E
94checking for ANSI C header files... yes
95checking for sys/types.h... yes
96checking for sys/stat.h... yes
97checking for stdlib.h... yes
98checking for string.h... yes
99checking for memory.h... yes
100checking for strings.h... yes
101checking for inttypes.h... yes
102checking for stdint.h... yes
103checking for unistd.h... yes
104checking minix/config.h usability... no
105checking minix/config.h presence... no
106checking for minix/config.h... no
107checking whether it is safe to define __EXTENSIONS__... yes
108checking how to run the C preprocessor... gcc -E
109checking for gcc option to accept ISO C99... none needed
110checking for gcc option to accept ISO C99... none needed
111checking for gcc option to accept ISO C99... none needed
112checking for gcc option to accept ISO C99... none needed
113checking for -ld.lld... no
114checking for ld.lld... ld.lld
115checking whether C compiler supports -fuse-ld=lld... no
116configure: unable to convince 'gcc' to use linker 'ld.lld'
117checking for -ld.gold... no
118checking for ld.gold... no
119checking for -ld... no
120checking for ld... ld
121configure: unknown linker version
122configure: unable to convince 'gcc' to use linker 'ld'
123checking for -ld... no
124checking for ld... ld
125checking whether ld is GNU ld... NO
126checking whether ld understands --build-id... no
127checking whether ld understands -no_compact_unwind... yes
128checking whether ld understands -filelist... yes
129checking for -nm... no
130checking for nm... nm
131checking whether nm program is broken... no
132checking for ranlib... ranlib
133checking for -strip... no
134checking for strip... strip
135checking for -libtool... no
136checking for libtool... libtool
137checking for -clang... no
138checking for clang... clang
139checking for llc-6.0... no
140checking for llc... llc
141checking llc is version 6.0... no
142checking for opt-6.0... no
143checking for opt... opt
144checking opt is version 6.0... no
145configure: Creating links for in-tree file handling routines.
146utils/lndir//fs.c => utils/fs/fs.c
147utils/lndir//fs.h => utils/fs/fs.h
148utils/unlit//fs.c => utils/fs/fs.c
149utils/unlit//fs.h => utils/fs/fs.h
150rts//fs.c => utils/fs/fs.c
151rts//fs.h => utils/fs/fs.h
152libraries/base/include//fs.h => utils/fs/fs.h
153libraries/base/cbits//fs.c => utils/fs/fs.c
154configure: Routines in place. Packages can now be build normally.
155checking whether #! works in shell scripts... yes
156checking for perl... /usr/bin/perl
157checking version of gcc... 8.0.0
158checking whether GCC supports -no-pie... no
159checking for extra options to pass gcc when compiling via C... -fwrapv -fno-builtin
160checking whether C compiler is clang... yes
161checking Setting up CFLAGS, LDFLAGS, IGNORE_LINKER_LD_FLAGS and CPPFLAGS... done
162checking Setting up CONF_CC_OPTS_STAGE0, CONF_GCC_LINKER_OPTS_STAGE0, CONF_LD_LINKER_OPTS_STAGE0 and CONF_CPP_OPTS_STAGE0... done
163checking Setting up CONF_CC_OPTS_STAGE1, CONF_GCC_LINKER_OPTS_STAGE1, CONF_LD_LINKER_OPTS_STAGE1 and CONF_CPP_OPTS_STAGE1... done
164checking Setting up CONF_CC_OPTS_STAGE2, CONF_GCC_LINKER_OPTS_STAGE2, CONF_LD_LINKER_OPTS_STAGE2 and CONF_CPP_OPTS_STAGE2... done
165checking for .subsections_via_symbols... yes
166checking whether your assembler supports .ident directive... yes
167checking for GNU non-executable stack support... no
168checking for a working context diff... diff -U 1
169checking for a BSD-compatible install... /usr/local/bin/ginstall -c
170checking for -ar... no
171checking for ar... ar
172checking whether ar is GNU ar... no
173checking for ar arguments... qcls
174checking whether ar supports @file... no
175checking for ranlib... (cached) ranlib
176checking whether ln -s works... yes
177checking for gsed... no
178checking for sed... /usr/bin/sed
179checking for time... /usr/bin/time
180checking for gnutar... no
181checking for gtar... no
182checking for tar... /usr/bin/tar
183checking for bzip2... /usr/bin/bzip2
184checking for gzip... /usr/bin/gzip
185checking for pxz... no
186checking for xz... /usr/local/bin/xz
187checking for gpatch... no
188checking for patch... /usr/bin/patch
189checking for dtrace... /usr/sbin/dtrace
190checking for HsColour... no
191checking for sphinx-build... /usr/local/opt/sphinx-doc/bin/sphinx-build
192checking for version of sphinx-build... Sphinx (sphinx-build) 1.6.3
193checking for xelatex... no
194checking for ghc-pkg matching /opt/ghc-8.4.3/bin/ghc... /opt/ghc-8.4.3/bin/ghc-pkg
195checking for happy... /Users/drydock/.cabal/bin/happy
196checking for version of happy... 1.19.5
197checking for alex... /Users/drydock/.cabal/bin/alex
198checking for version of alex... 3.1.7
199checking for ANSI C header files... (cached) yes
200checking for special C compiler options needed for large files... no
201checking for _FILE_OFFSET_BITS value needed for large files... no
202checking ctype.h usability... yes
203checking ctype.h presence... yes
204checking for ctype.h... yes
205checking dirent.h usability... yes
206checking dirent.h presence... yes
207checking for dirent.h... yes
208checking dlfcn.h usability... yes
209checking dlfcn.h presence... yes
210checking for dlfcn.h... yes
211checking errno.h usability... yes
212checking errno.h presence... yes
213checking for errno.h... yes
214checking fcntl.h usability... yes
215checking fcntl.h presence... yes
216checking for fcntl.h... yes
217checking grp.h usability... yes
218checking grp.h presence... yes
219checking for grp.h... yes
220checking limits.h usability... yes
221checking limits.h presence... yes
222checking for limits.h... yes
223checking locale.h usability... yes
224checking locale.h presence... yes
225checking for locale.h... yes
226checking nlist.h usability... yes
227checking nlist.h presence... yes
228checking for nlist.h... yes
229checking pthread.h usability... yes
230checking pthread.h presence... yes
231checking for pthread.h... yes
232checking pwd.h usability... yes
233checking pwd.h presence... yes
234checking for pwd.h... yes
235checking signal.h usability... yes
236checking signal.h presence... yes
237checking for signal.h... yes
238checking sys/param.h usability... yes
239checking sys/param.h presence... yes
240checking for sys/param.h... yes
241checking sys/mman.h usability... yes
242checking sys/mman.h presence... yes
243checking for sys/mman.h... yes
244checking sys/resource.h usability... yes
245checking sys/resource.h presence... yes
246checking for sys/resource.h... yes
247checking sys/select.h usability... yes
248checking sys/select.h presence... yes
249checking for sys/select.h... yes
250checking sys/time.h usability... yes
251checking sys/time.h presence... yes
252checking for sys/time.h... yes
253checking sys/timeb.h usability... yes
254checking sys/timeb.h presence... yes
255checking for sys/timeb.h... yes
256checking sys/timerfd.h usability... no
257checking sys/timerfd.h presence... no
258checking for sys/timerfd.h... no
259checking sys/timers.h usability... no
260checking sys/timers.h presence... no
261checking for sys/timers.h... no
262checking sys/times.h usability... yes
263checking sys/times.h presence... yes
264checking for sys/times.h... yes
265checking sys/utsname.h usability... yes
266checking sys/utsname.h presence... yes
267checking for sys/utsname.h... yes
268checking sys/wait.h usability... yes
269checking sys/wait.h presence... yes
270checking for sys/wait.h... yes
271checking termios.h usability... yes
272checking termios.h presence... yes
273checking for termios.h... yes
274checking time.h usability... yes
275checking time.h presence... yes
276checking for time.h... yes
277checking utime.h usability... yes
278checking utime.h presence... yes
279checking for utime.h... yes
280checking windows.h usability... no
281checking windows.h presence... no
282checking for windows.h... no
283checking winsock.h usability... no
284checking winsock.h presence... no
285checking for winsock.h... no
286checking sched.h usability... yes
287checking sched.h presence... yes
288checking for sched.h... yes
289checking for sys/cpuset.h... no
290checking whether time.h and sys/time.h may both be included... yes
291checking for long long... yes
292checking size of char... 1
293checking for char... yes
294checking alignment of char... 1
295checking size of double... 8
296checking for double... yes
297checking alignment of double... 8
298checking size of float... 4
299checking for float... yes
300checking alignment of float... 4
301checking size of int... 4
302checking for int... yes
303checking alignment of int... 4
304checking size of long... 8
305checking for long... yes
306checking alignment of long... 8
307checking size of long long... 8
308checking for long long... (cached) yes
309checking alignment of long long... 8
310checking size of short... 2
311checking for short... yes
312checking alignment of short... 2
313checking size of unsigned char... 1
314checking for unsigned char... yes
315checking alignment of unsigned char... 1
316checking size of unsigned int... 4
317checking for unsigned int... yes
318checking alignment of unsigned int... 4
319checking size of unsigned long... 8
320checking for unsigned long... yes
321checking alignment of unsigned long... 8
322checking size of unsigned long long... 8
323checking for unsigned long long... yes
324checking alignment of unsigned long long... 8
325checking size of unsigned short... 2
326checking for unsigned short... yes
327checking alignment of unsigned short... 2
328checking size of void *... 8
329checking for void *... yes
330checking alignment of void *... 8
331checking size of int8_t... 1
332checking for int8_t... yes
333checking alignment of int8_t... 1
334checking size of uint8_t... 1
335checking for uint8_t... yes
336checking alignment of uint8_t... 1
337checking size of int16_t... 2
338checking for int16_t... yes
339checking alignment of int16_t... 2
340checking size of uint16_t... 2
341checking for uint16_t... yes
342checking alignment of uint16_t... 2
343checking size of int32_t... 4
344checking for int32_t... yes
345checking alignment of int32_t... 4
346checking size of uint32_t... 4
347checking for uint32_t... yes
348checking alignment of uint32_t... 4
349checking size of int64_t... 8
350checking for int64_t... yes
351checking alignment of int64_t... 8
352checking size of uint64_t... 8
353checking for uint64_t... yes
354checking alignment of uint64_t... 8
355checking for WinExec... no
356checking for GetModuleFileName... no
357checking for getclock... no
358checking for getrusage... yes
359checking for gettimeofday... yes
360checking for setitimer... yes
361checking for siginterrupt... yes
362checking for sysconf... yes
363checking for times... yes
364checking for ctime_r... yes
365checking for sched_setaffinity... no
366checking for setlocale... yes
367checking whether ctime_r is declared... yes
368checking for closedir in -lmingwex... no
369checking for atan in -lm... yes
370checking for dlopen in -ldl... yes
371checking for dlopen in -ldl... (cached) yes
372checking for size_t... yes
373checking for working alloca.h... yes
374checking for alloca... yes
375checking for pid_t... yes
376checking vfork.h usability... no
377checking vfork.h presence... no
378checking for vfork.h... no
379checking for fork... yes
380checking for vfork... yes
381checking for working fork... yes
382checking for working vfork... (cached) yes
383checking for an ANSI C-conforming const... yes
384checking whether byte ordering is bigendian... no
385checking whether float word order is big endian... no
386checking for nlist in -lelf... no
387checking leading underscore in symbol names... yes
388checking whether __attribute__((visibility("hidden"))) is supported... yes
389checking for clock_gettime in -lrt... no
390checking for clock_gettime in -lrt... (cached) no
391checking for clock_gettime... yes
392checking for timer_settime... no
393checking for timer_create... no
394checking for printf$LDBLStub... no
395checking whether -lpthread is needed for pthreads... checking for pthread_create... yes
396no
397checking for pthread_setname_np in -lpthread... yes
398checking for pthread_setname_np... no
399checking sys/eventfd.h usability... no
400checking sys/eventfd.h presence... no
401checking for sys/eventfd.h... no
402checking for eventfd... no
403checking for __thread support... yes
404checking numa.h usability... no
405checking numa.h presence... no
406checking for numa.h... no
407checking numaif.h usability... no
408checking numaif.h presence... no
409checking for numaif.h... no
410configure: creating ./config.status
411config.status: creating hadrian/cfg/system.config
412config.status: creating mk/config.mk
413config.status: creating mk/install.mk
414config.status: creating mk/project.mk
415config.status: creating rts/rts.cabal
416config.status: creating compiler/ghc.cabal
417config.status: creating ghc/ghc-bin.cabal
418config.status: creating utils/runghc/runghc.cabal
419config.status: creating utils/gen-dll/gen-dll.cabal
420config.status: creating libraries/ghc-boot/ghc-boot.cabal
421config.status: creating libraries/ghc-boot-th/ghc-boot-th.cabal
422config.status: creating libraries/ghci/ghci.cabal
423config.status: creating libraries/ghc-heap/ghc-heap.cabal
424config.status: creating settings
425config.status: creating docs/users_guide/ghc_config.py
426config.status: creating docs/index.html
427config.status: creating libraries/prologue.txt
428config.status: creating distrib/configure.ac
429config.status: creating mk/config.h
430
431----------------------------------------------------------------------
432Configure completed successfully.
433
434 Building GHC version : 8.7.20180728
435 Git commit id : 3539561b24b78aee2b37280ddf6bb64e2db3a67d
436
437 Build platform : x86_64-apple-darwin
438 Host platform : x86_64-apple-darwin
439 Target platform : x86_64-apple-darwin
440
441 Bootstrapping using : /opt/ghc-8.4.3/bin/ghc
442 which is version : 8.4.3
443
444 Using (for bootstrapping) : gcc
445 Using clang : gcc
446 which is version : 8.0.0
447 Building a cross compiler : NO
448 Unregisterised : NO
449 hs-cpp : gcc
450 hs-cpp-flags : -E -undef -traditional -Wno-invalid-pp-token -Wno-unicode -Wno-trigraphs
451 ar : ar
452 ld : ld
453 nm : nm
454 libtool : libtool
455 objdump : objdump
456 ranlib : ranlib
457 windres :
458 dllwrap :
459 genlib :
460 Happy : /Users/drydock/.cabal/bin/happy (1.19.5)
461 Alex : /Users/drydock/.cabal/bin/alex (3.1.7)
462 Perl : /usr/bin/perl
463 sphinx-build : /usr/local/opt/sphinx-doc/bin/sphinx-build
464 xelatex :
465
466 Using LLVM tools
467 clang : clang
468 llc :
469 opt :
470
471 HsColour was not found; documentation will not contain source links
472
473 Tools to build Sphinx HTML documentation available: YES
474 Tools to build Sphinx PDF documentation available: NO
475----------------------------------------------------------------------
476
477For a standard build of GHC (fully optimised with profiling), type (g)make.
478
479To make changes to the default build configuration, copy the file
480mk/build.mk.sample to mk/build.mk, and edit the settings in there.
481
482For more information on how to configure your GHC build, see
483 http://ghc.haskell.org/trac/ghc/wiki/Building
484
485===--- building phase 0
486Creating compiler/stage1/build/Config.hs ...
487done.
488[ 1 of 271] Compiling Control.Monad.Cont.Class ( libraries/mtl/Control/Monad/Cont/Class.hs, bootstrapping/Control/Monad/Cont/Class.o )
489[ 2 of 271] Compiling Control.Monad.Error.Class ( libraries/mtl/Control/Monad/Error/Class.hs, bootstrapping/Control/Monad/Error/Class.o )
490[ 3 of 271] Compiling Control.Monad.Identity ( libraries/mtl/Control/Monad/Identity.hs, bootstrapping/Control/Monad/Identity.o )
491[ 4 of 271] Compiling Control.Monad.Reader.Class ( libraries/mtl/Control/Monad/Reader/Class.hs, bootstrapping/Control/Monad/Reader/Class.o )
492[ 5 of 271] Compiling Control.Monad.State.Class ( libraries/mtl/Control/Monad/State/Class.hs, bootstrapping/Control/Monad/State/Class.o )
493[ 6 of 271] Compiling Control.Monad.Trans ( libraries/mtl/Control/Monad/Trans.hs, bootstrapping/Control/Monad/Trans.o )
494[ 7 of 271] Compiling Control.Monad.State.Strict ( libraries/mtl/Control/Monad/State/Strict.hs, bootstrapping/Control/Monad/State/Strict.o )
495[ 8 of 271] Compiling Data.Binary.Builder ( libraries/binary/src/Data/Binary/Builder.hs, bootstrapping/Data/Binary/Builder.o )
496[ 9 of 271] Compiling Data.Binary.FloatCast ( libraries/binary/src/Data/Binary/FloatCast.hs, bootstrapping/Data/Binary/FloatCast.o )
497[ 10 of 271] Compiling Data.Binary.Internal ( libraries/binary/src/Data/Binary/Internal.hs, bootstrapping/Data/Binary/Internal.o )
498[ 11 of 271] Compiling Data.Binary.Get.Internal ( libraries/binary/src/Data/Binary/Get/Internal.hs, bootstrapping/Data/Binary/Get/Internal.o )
499[ 12 of 271] Compiling Data.Binary.Get ( libraries/binary/src/Data/Binary/Get.hs, bootstrapping/Data/Binary/Get.o )
500[ 13 of 271] Compiling Data.Binary.Put ( libraries/binary/src/Data/Binary/Put.hs, bootstrapping/Data/Binary/Put.o )
501[ 14 of 271] Compiling Data.Binary.Class ( libraries/binary/src/Data/Binary/Class.hs, bootstrapping/Data/Binary/Class.o )
502[ 15 of 271] Compiling Data.Binary.Generic ( libraries/binary/src/Data/Binary/Generic.hs, bootstrapping/Data/Binary/Generic.o )
503[ 16 of 271] Compiling Data.Binary ( libraries/binary/src/Data/Binary.hs, bootstrapping/Data/Binary.o )
504[ 17 of 271] Compiling Data.Text.Encoding.Error ( libraries/text/Data/Text/Encoding/Error.hs, bootstrapping/Data/Text/Encoding/Error.o )
505[ 18 of 271] Compiling Data.Text.Internal.Encoding.Utf16 ( libraries/text/Data/Text/Internal/Encoding/Utf16.hs, bootstrapping/Data/Text/Internal/Encoding/Utf16.o )
506[ 19 of 271] Compiling Data.Text.Internal.Encoding.Utf32 ( libraries/text/Data/Text/Internal/Encoding/Utf32.hs, bootstrapping/Data/Text/Internal/Encoding/Utf32.o )
507[ 20 of 271] Compiling Data.Text.Internal.Functions ( libraries/text/Data/Text/Internal/Functions.hs, bootstrapping/Data/Text/Internal/Functions.o )
508[ 21 of 271] Compiling Data.Text.Internal.Unsafe ( libraries/text/Data/Text/Internal/Unsafe.hs, bootstrapping/Data/Text/Internal/Unsafe.o )
509[ 22 of 271] Compiling Data.Text.Internal.Unsafe.Shift ( libraries/text/Data/Text/Internal/Unsafe/Shift.hs, bootstrapping/Data/Text/Internal/Unsafe/Shift.o )
510[ 23 of 271] Compiling Data.Text.Array ( libraries/text/Data/Text/Array.hs, bootstrapping/Data/Text/Array.o )
511[ 24 of 271] Compiling Data.Text.Internal.Unsafe.Char ( libraries/text/Data/Text/Internal/Unsafe/Char.hs, bootstrapping/Data/Text/Internal/Unsafe/Char.o )
512[ 25 of 271] Compiling Data.Text.Internal.Encoding.Utf8 ( libraries/text/Data/Text/Internal/Encoding/Utf8.hs, bootstrapping/Data/Text/Internal/Encoding/Utf8.o )
513[ 26 of 271] Compiling Data.Text.Internal ( libraries/text/Data/Text/Internal.hs, bootstrapping/Data/Text/Internal.o )
514[ 27 of 271] Compiling Data.Text.Internal.Search ( libraries/text/Data/Text/Internal/Search.hs, bootstrapping/Data/Text/Internal/Search.o )
515[ 28 of 271] Compiling Data.Text.Internal.Fusion.Size ( libraries/text/Data/Text/Internal/Fusion/Size.hs, bootstrapping/Data/Text/Internal/Fusion/Size.o )
516[ 29 of 271] Compiling Data.Text.Internal.Fusion.Types ( libraries/text/Data/Text/Internal/Fusion/Types.hs, bootstrapping/Data/Text/Internal/Fusion/Types.o )
517[ 30 of 271] Compiling Data.Text.Internal.Fusion.CaseMapping ( libraries/text/Data/Text/Internal/Fusion/CaseMapping.hs, bootstrapping/Data/Text/Internal/Fusion/CaseMapping.o )
518[ 31 of 271] Compiling Data.Text.Internal.Fusion.Common ( libraries/text/Data/Text/Internal/Fusion/Common.hs, bootstrapping/Data/Text/Internal/Fusion/Common.o )
519[ 32 of 271] Compiling Data.Text.Unsafe ( libraries/text/Data/Text/Unsafe.hs, bootstrapping/Data/Text/Unsafe.o )
520[ 33 of 271] Compiling Data.Text.Internal.Private ( libraries/text/Data/Text/Internal/Private.hs, bootstrapping/Data/Text/Internal/Private.o )
521[ 34 of 271] Compiling Data.Text.Internal.Fusion ( libraries/text/Data/Text/Internal/Fusion.hs, bootstrapping/Data/Text/Internal/Fusion.o )
522[ 35 of 271] Compiling Data.Text.Show ( libraries/text/Data/Text/Show.hs, bootstrapping/Data/Text/Show.o )
523[ 36 of 271] Compiling Data.Text.Internal.Encoding.Fusion.Common ( libraries/text/Data/Text/Internal/Encoding/Fusion/Common.hs, bootstrapping/Data/Text/Internal/Encoding/Fusion/Common.o )
524[ 37 of 271] Compiling Data.Text.Internal.Lazy.Encoding.Fusion ( libraries/text/Data/Text/Internal/Lazy/Encoding/Fusion.hs, bootstrapping/Data/Text/Internal/Lazy/Encoding/Fusion.o )
525[ 38 of 271] Compiling Data.Text.Internal.Encoding.Fusion ( libraries/text/Data/Text/Internal/Encoding/Fusion.hs, bootstrapping/Data/Text/Internal/Encoding/Fusion.o )
526[ 39 of 271] Compiling Data.Text.Encoding ( libraries/text/Data/Text/Encoding.hs, bootstrapping/Data/Text/Encoding.o )
527[ 40 of 271] Compiling Data.Text ( libraries/text/Data/Text.hs, bootstrapping/Data/Text.o )
528[ 41 of 271] Compiling Data.Text.Internal.Lazy ( libraries/text/Data/Text/Internal/Lazy.hs, bootstrapping/Data/Text/Internal/Lazy.o )
529[ 42 of 271] Compiling Data.Text.Internal.Lazy.Search ( libraries/text/Data/Text/Internal/Lazy/Search.hs, bootstrapping/Data/Text/Internal/Lazy/Search.o )
530[ 43 of 271] Compiling Data.Text.Internal.Lazy.Fusion ( libraries/text/Data/Text/Internal/Lazy/Fusion.hs, bootstrapping/Data/Text/Internal/Lazy/Fusion.o )
531[ 44 of 271] Compiling Data.Text.Lazy.Encoding ( libraries/text/Data/Text/Lazy/Encoding.hs, bootstrapping/Data/Text/Lazy/Encoding.o )
532[ 45 of 271] Compiling Data.Text.Lazy ( libraries/text/Data/Text/Lazy.hs, bootstrapping/Data/Text/Lazy.o )
533[ 46 of 271] Compiling Distribution.Compat.Binary ( libraries/Cabal/Cabal/Distribution/Compat/Binary.hs, bootstrapping/Distribution/Compat/Binary.o )
534[ 47 of 271] Compiling Distribution.Compat.Directory ( libraries/Cabal/Cabal/Distribution/Compat/Directory.hs, bootstrapping/Distribution/Compat/Directory.o )
535[ 48 of 271] Compiling Distribution.Compat.Exception ( libraries/Cabal/Cabal/Distribution/Compat/Exception.hs, bootstrapping/Distribution/Compat/Exception.o )
536[ 49 of 271] Compiling Distribution.Compat.Map.Lazy ( libraries/Cabal/Cabal/Distribution/Compat/Map/Lazy.hs, bootstrapping/Distribution/Compat/Map/Lazy.o )
537[ 50 of 271] Compiling Distribution.Compat.Map.Strict ( libraries/Cabal/Cabal/Distribution/Compat/Map/Strict.hs, bootstrapping/Distribution/Compat/Map/Strict.o )
538[ 51 of 271] Compiling Distribution.Compat.MonadFail ( libraries/Cabal/Cabal/Distribution/Compat/MonadFail.hs, bootstrapping/Distribution/Compat/MonadFail.o )
539[ 52 of 271] Compiling Distribution.Compat.Newtype ( libraries/Cabal/Cabal/Distribution/Compat/Newtype.hs, bootstrapping/Distribution/Compat/Newtype.o )
540[ 53 of 271] Compiling Distribution.Compat.Semigroup ( libraries/Cabal/Cabal/Distribution/Compat/Semigroup.hs, bootstrapping/Distribution/Compat/Semigroup.o )
541[ 54 of 271] Compiling Distribution.Compat.Stack ( libraries/Cabal/Cabal/Distribution/Compat/Stack.hs, bootstrapping/Distribution/Compat/Stack.o )
542[ 55 of 271] Compiling Distribution.Compat.Prelude ( libraries/Cabal/Cabal/Distribution/Compat/Prelude.hs, bootstrapping/Distribution/Compat/Prelude.o )
543[ 56 of 271] Compiling Distribution.Compat.ReadP ( libraries/Cabal/Cabal/Distribution/Compat/ReadP.hs, bootstrapping/Distribution/Compat/ReadP.o )
544[ 57 of 271] Compiling Distribution.Compat.Graph ( libraries/Cabal/Cabal/Distribution/Compat/Graph.hs, bootstrapping/Distribution/Compat/Graph.o )
545[ 58 of 271] Compiling Distribution.Compat.GetShortPathName ( libraries/Cabal/Cabal/Distribution/Compat/GetShortPathName.hs, bootstrapping/Distribution/Compat/GetShortPathName.o )
546[ 59 of 271] Compiling Distribution.Compat.DList ( libraries/Cabal/Cabal/Distribution/Compat/DList.hs, bootstrapping/Distribution/Compat/DList.o )
547[ 60 of 271] Compiling Distribution.Compat.Lens ( libraries/Cabal/Cabal/Distribution/Compat/Lens.hs, bootstrapping/Distribution/Compat/Lens.o )
548[ 61 of 271] Compiling Distribution.CabalSpecVersion ( libraries/Cabal/Cabal/Distribution/CabalSpecVersion.hs, bootstrapping/Distribution/CabalSpecVersion.o )
549[ 62 of 271] Compiling Distribution.Compat.Environment ( libraries/Cabal/Cabal/Distribution/Compat/Environment.hs, bootstrapping/Distribution/Compat/Environment.o )
550[ 63 of 271] Compiling Distribution.Compat.CreatePipe ( libraries/Cabal/Cabal/Distribution/Compat/CreatePipe.hs, bootstrapping/Distribution/Compat/CreatePipe.o )
551[ 64 of 271] Compiling Distribution.GetOpt ( libraries/Cabal/Cabal/Distribution/GetOpt.hs, bootstrapping/Distribution/GetOpt.o )
552[ 65 of 271] Compiling Distribution.Lex ( libraries/Cabal/Cabal/Distribution/Lex.hs, bootstrapping/Distribution/Lex.o )
553[ 66 of 271] Compiling Distribution.PackageDescription.Quirks ( libraries/Cabal/Cabal/Distribution/PackageDescription/Quirks.hs, bootstrapping/Distribution/PackageDescription/Quirks.o )
554[ 67 of 271] Compiling Distribution.PackageDescription.Utils ( libraries/Cabal/Cabal/Distribution/PackageDescription/Utils.hs, bootstrapping/Distribution/PackageDescription/Utils.o )
555[ 68 of 271] Compiling Distribution.Parsec.Field ( libraries/Cabal/Cabal/Distribution/Parsec/Field.hs, bootstrapping/Distribution/Parsec/Field.o )
556[ 69 of 271] Compiling Distribution.Pretty ( libraries/Cabal/Cabal/Distribution/Pretty.hs, bootstrapping/Distribution/Pretty.o )
557[ 70 of 271] Compiling Distribution.Simple.Flag ( libraries/Cabal/Cabal/Distribution/Simple/Flag.hs, bootstrapping/Distribution/Simple/Flag.o )
558[ 71 of 271] Compiling Distribution.Simple.PreProcess.Unlit ( libraries/Cabal/Cabal/Distribution/Simple/PreProcess/Unlit.hs, bootstrapping/Distribution/Simple/PreProcess/Unlit.o )
559[ 72 of 271] Compiling Distribution.Simple.Program.Internal ( libraries/Cabal/Cabal/Distribution/Simple/Program/Internal.hs, bootstrapping/Distribution/Simple/Program/Internal.o )
560[ 73 of 271] Compiling Distribution.TestSuite ( libraries/Cabal/Cabal/Distribution/TestSuite.hs, bootstrapping/Distribution/TestSuite.o )
561[ 74 of 271] Compiling Distribution.Types.Condition ( libraries/Cabal/Cabal/Distribution/Types/Condition.hs, bootstrapping/Distribution/Types/Condition.o )
562[ 75 of 271] Compiling Distribution.Types.CondTree ( libraries/Cabal/Cabal/Distribution/Types/CondTree.hs, bootstrapping/Distribution/Types/CondTree.o )
563[ 76 of 271] Compiling Distribution.Utils.Base62 ( libraries/Cabal/Cabal/Distribution/Utils/Base62.hs, bootstrapping/Distribution/Utils/Base62.o )
564[ 77 of 271] Compiling Distribution.Utils.IOData ( libraries/Cabal/Cabal/Distribution/Utils/IOData.hs, bootstrapping/Distribution/Utils/IOData.o )
565[ 78 of 271] Compiling Distribution.Utils.MapAccum ( libraries/Cabal/Cabal/Distribution/Utils/MapAccum.hs, bootstrapping/Distribution/Utils/MapAccum.o )
566[ 79 of 271] Compiling Distribution.Utils.Progress ( libraries/Cabal/Cabal/Distribution/Utils/Progress.hs, bootstrapping/Distribution/Utils/Progress.o )
567[ 80 of 271] Compiling Distribution.Utils.String ( libraries/Cabal/Cabal/Distribution/Utils/String.hs, bootstrapping/Distribution/Utils/String.o )
568[ 81 of 271] Compiling Distribution.Utils.ShortText ( libraries/Cabal/Cabal/Distribution/Utils/ShortText.hs, bootstrapping/Distribution/Utils/ShortText.o )
569[ 82 of 271] Compiling Distribution.Utils.UnionFind ( libraries/Cabal/Cabal/Distribution/Utils/UnionFind.hs, bootstrapping/Distribution/Utils/UnionFind.o )
570[ 83 of 271] Compiling System.FilePath.Posix ( libraries/filepath/System/FilePath/Posix.hs, bootstrapping/System/FilePath/Posix.o )
571[ 84 of 271] Compiling System.FilePath ( libraries/filepath/System/FilePath.hs, bootstrapping/System/FilePath.o )
572[ 85 of 271] Compiling Distribution.Utils.Generic ( libraries/Cabal/Cabal/Distribution/Utils/Generic.hs, bootstrapping/Distribution/Utils/Generic.o )
573[ 86 of 271] Compiling Distribution.Simple.CCompiler ( libraries/Cabal/Cabal/Distribution/Simple/CCompiler.hs, bootstrapping/Distribution/Simple/CCompiler.o )
574[ 87 of 271] Compiling Distribution.Parsec.Common ( libraries/Cabal/Cabal/Distribution/Parsec/Common.hs, bootstrapping/Distribution/Parsec/Common.o )
575[ 88 of 271] Compiling Distribution.Parsec.LexerMonad ( libraries/Cabal/Cabal/Distribution/Parsec/LexerMonad.hs, bootstrapping/Distribution/Parsec/LexerMonad.o )
576[ 89 of 271] Compiling Distribution.Parsec.Lexer ( libraries/Cabal/Cabal/Distribution/Parsec/Lexer.hs, bootstrapping/Distribution/Parsec/Lexer.o )
577[ 90 of 271] Compiling Distribution.Compat.Internal.TempFile ( libraries/Cabal/Cabal/Distribution/Compat/Internal/TempFile.hs, bootstrapping/Distribution/Compat/Internal/TempFile.o )
578[ 91 of 271] Compiling Distribution.Compat.CopyFile ( libraries/Cabal/Cabal/Distribution/Compat/CopyFile.hs, bootstrapping/Distribution/Compat/CopyFile.o )
579[ 92 of 271] Compiling System.FilePath.Windows ( libraries/filepath/System/FilePath/Windows.hs, bootstrapping/System/FilePath/Windows.o )
580[ 93 of 271] Compiling Text.Parsec.Pos ( libraries/parsec/src/Text/Parsec/Pos.hs, bootstrapping/Text/Parsec/Pos.o )
581[ 94 of 271] Compiling Text.Parsec.Error ( libraries/parsec/src/Text/Parsec/Error.hs, bootstrapping/Text/Parsec/Error.o )
582[ 95 of 271] Compiling Text.Parsec.Prim ( libraries/parsec/src/Text/Parsec/Prim.hs, bootstrapping/Text/Parsec/Prim.o )
583[ 96 of 271] Compiling Text.Parsec.Combinator ( libraries/parsec/src/Text/Parsec/Combinator.hs, bootstrapping/Text/Parsec/Combinator.o )
584[ 97 of 271] Compiling Text.Parsec.Char ( libraries/parsec/src/Text/Parsec/Char.hs, bootstrapping/Text/Parsec/Char.o )
585[ 98 of 271] Compiling Text.Parsec ( libraries/parsec/src/Text/Parsec.hs, bootstrapping/Text/Parsec.o )
586[ 99 of 271] Compiling Distribution.Parsec.FieldLineStream ( libraries/Cabal/Cabal/Distribution/Parsec/FieldLineStream.hs, bootstrapping/Distribution/Parsec/FieldLineStream.o )
587[100 of 271] Compiling Distribution.Compat.Parsing ( libraries/Cabal/Cabal/Distribution/Compat/Parsing.hs, bootstrapping/Distribution/Compat/Parsing.o )
588[101 of 271] Compiling Distribution.Compat.CharParsing ( libraries/Cabal/Cabal/Distribution/Compat/CharParsing.hs, bootstrapping/Distribution/Compat/CharParsing.o )
589[102 of 271] Compiling Distribution.Parsec.Class ( libraries/Cabal/Cabal/Distribution/Parsec/Class.hs, bootstrapping/Distribution/Parsec/Class.o )
590[103 of 271] Compiling Distribution.Text ( libraries/Cabal/Cabal/Distribution/Text.hs, bootstrapping/Distribution/Text.o )
591[104 of 271] Compiling Language.Haskell.Extension ( libraries/Cabal/Cabal/Language/Haskell/Extension.hs, bootstrapping/Language/Haskell/Extension.o )
592[105 of 271] Compiling Distribution.Types.Version ( libraries/Cabal/Cabal/Distribution/Types/Version.hs, bootstrapping/Distribution/Types/Version.o )
593[106 of 271] Compiling Distribution.Types.VersionRange ( libraries/Cabal/Cabal/Distribution/Types/VersionRange.hs, bootstrapping/Distribution/Types/VersionRange.o )
594[107 of 271] Compiling Distribution.Types.VersionInterval ( libraries/Cabal/Cabal/Distribution/Types/VersionInterval.hs, bootstrapping/Distribution/Types/VersionInterval.o )
595[108 of 271] Compiling Distribution.Version ( libraries/Cabal/Cabal/Distribution/Version.hs, bootstrapping/Distribution/Version.o )
596[109 of 271] Compiling Distribution.Parsec.ParseResult ( libraries/Cabal/Cabal/Distribution/Parsec/ParseResult.hs, bootstrapping/Distribution/Parsec/ParseResult.o )
597[110 of 271] Compiling Distribution.Types.TestType ( libraries/Cabal/Cabal/Distribution/Types/TestType.hs, bootstrapping/Distribution/Types/TestType.o )
598[111 of 271] Compiling Distribution.Types.SourceRepo ( libraries/Cabal/Cabal/Distribution/Types/SourceRepo.hs, bootstrapping/Distribution/Types/SourceRepo.o )
599[112 of 271] Compiling Distribution.Types.SourceRepo.Lens ( libraries/Cabal/Cabal/Distribution/Types/SourceRepo/Lens.hs, bootstrapping/Distribution/Types/SourceRepo/Lens.o )
600[113 of 271] Compiling Distribution.Types.PkgconfigName ( libraries/Cabal/Cabal/Distribution/Types/PkgconfigName.hs, bootstrapping/Distribution/Types/PkgconfigName.o )
601[114 of 271] Compiling Distribution.Types.PkgconfigDependency ( libraries/Cabal/Cabal/Distribution/Types/PkgconfigDependency.hs, bootstrapping/Distribution/Types/PkgconfigDependency.o )
602[115 of 271] Compiling Distribution.Types.ForeignLibType ( libraries/Cabal/Cabal/Distribution/Types/ForeignLibType.hs, bootstrapping/Distribution/Types/ForeignLibType.o )
603[116 of 271] Compiling Distribution.Types.ForeignLibOption ( libraries/Cabal/Cabal/Distribution/Types/ForeignLibOption.hs, bootstrapping/Distribution/Types/ForeignLibOption.o )
604[117 of 271] Compiling Distribution.Types.ExecutableScope ( libraries/Cabal/Cabal/Distribution/Types/ExecutableScope.hs, bootstrapping/Distribution/Types/ExecutableScope.o )
605[118 of 271] Compiling Distribution.Types.ComponentId ( libraries/Cabal/Cabal/Distribution/Types/ComponentId.hs, bootstrapping/Distribution/Types/ComponentId.o )
606[119 of 271] Compiling Distribution.Types.BuildType ( libraries/Cabal/Cabal/Distribution/Types/BuildType.hs, bootstrapping/Distribution/Types/BuildType.o )
607[120 of 271] Compiling Distribution.Types.BenchmarkType ( libraries/Cabal/Cabal/Distribution/Types/BenchmarkType.hs, bootstrapping/Distribution/Types/BenchmarkType.o )
608[121 of 271] Compiling Distribution.Types.BenchmarkInterface ( libraries/Cabal/Cabal/Distribution/Types/BenchmarkInterface.hs, bootstrapping/Distribution/Types/BenchmarkInterface.o )
609[122 of 271] Compiling Distribution.Types.AbiHash ( libraries/Cabal/Cabal/Distribution/Types/AbiHash.hs, bootstrapping/Distribution/Types/AbiHash.o )
610[123 of 271] Compiling Distribution.System ( libraries/Cabal/Cabal/Distribution/System.hs, bootstrapping/Distribution/System.o )
611[124 of 271] Compiling Distribution.SPDX.LicenseReference ( libraries/Cabal/Cabal/Distribution/SPDX/LicenseReference.hs, bootstrapping/Distribution/SPDX/LicenseReference.o )
612[125 of 271] Compiling Distribution.SPDX.LicenseId ( libraries/Cabal/Cabal/Distribution/SPDX/LicenseId.hs, bootstrapping/Distribution/SPDX/LicenseId.o )
613[126 of 271] Compiling Distribution.SPDX.LicenseExceptionId ( libraries/Cabal/Cabal/Distribution/SPDX/LicenseExceptionId.hs, bootstrapping/Distribution/SPDX/LicenseExceptionId.o )
614[127 of 271] Compiling Distribution.SPDX.LicenseExpression ( libraries/Cabal/Cabal/Distribution/SPDX/LicenseExpression.hs, bootstrapping/Distribution/SPDX/LicenseExpression.o )
615[128 of 271] Compiling Distribution.SPDX.License ( libraries/Cabal/Cabal/Distribution/SPDX/License.hs, bootstrapping/Distribution/SPDX/License.o )
616[129 of 271] Compiling Distribution.SPDX ( libraries/Cabal/Cabal/Distribution/SPDX.hs, bootstrapping/Distribution/SPDX.o )
617[130 of 271] Compiling Distribution.ReadE ( libraries/Cabal/Cabal/Distribution/ReadE.hs, bootstrapping/Distribution/ReadE.o )
618[131 of 271] Compiling Distribution.Verbosity ( libraries/Cabal/Cabal/Distribution/Verbosity.hs, bootstrapping/Distribution/Verbosity.o )
619[132 of 271] Compiling Distribution.FieldGrammar.Class ( libraries/Cabal/Cabal/Distribution/FieldGrammar/Class.hs, bootstrapping/Distribution/FieldGrammar/Class.o )
620[133 of 271] Compiling Distribution.ModuleName ( libraries/Cabal/Cabal/Distribution/ModuleName.hs, bootstrapping/Distribution/ModuleName.o )
621[134 of 271] Compiling Distribution.Types.TestSuiteInterface ( libraries/Cabal/Cabal/Distribution/Types/TestSuiteInterface.hs, bootstrapping/Distribution/Types/TestSuiteInterface.o )
622[135 of 271] Compiling Distribution.Types.ModuleRenaming ( libraries/Cabal/Cabal/Distribution/Types/ModuleRenaming.hs, bootstrapping/Distribution/Types/ModuleRenaming.o )
623[136 of 271] Compiling Distribution.Types.IncludeRenaming ( libraries/Cabal/Cabal/Distribution/Types/IncludeRenaming.hs, bootstrapping/Distribution/Types/IncludeRenaming.o )
624[137 of 271] Compiling Distribution.License ( libraries/Cabal/Cabal/Distribution/License.hs, bootstrapping/Distribution/License.o )
625[138 of 271] Compiling Distribution.Compiler ( libraries/Cabal/Cabal/Distribution/Compiler.hs, bootstrapping/Distribution/Compiler.o )
626[139 of 271] Compiling Distribution.Parsec.Newtypes ( libraries/Cabal/Cabal/Distribution/Parsec/Newtypes.hs, bootstrapping/Distribution/Parsec/Newtypes.o )
627[140 of 271] Compiling Distribution.ParseUtils ( libraries/Cabal/Cabal/Distribution/ParseUtils.hs, bootstrapping/Distribution/ParseUtils.o )
628[141 of 271] Compiling Distribution.Types.PackageName ( libraries/Cabal/Cabal/Distribution/Types/PackageName.hs, bootstrapping/Distribution/Types/PackageName.o )
629[142 of 271] Compiling Distribution.Types.UnqualComponentName ( libraries/Cabal/Cabal/Distribution/Types/UnqualComponentName.hs, bootstrapping/Distribution/Types/UnqualComponentName.o )
630[143 of 271] Compiling Distribution.Types.ComponentName ( libraries/Cabal/Cabal/Distribution/Types/ComponentName.hs, bootstrapping/Distribution/Types/ComponentName.o )
631[144 of 271] Compiling Distribution.Types.PackageId ( libraries/Cabal/Cabal/Distribution/Types/PackageId.hs, bootstrapping/Distribution/Types/PackageId.o )
632[145 of 271] Compiling Distribution.Types.UnitId ( libraries/Cabal/Cabal/Distribution/Types/UnitId.hs, bootstrapping/Distribution/Types/UnitId.o )
633[146 of 271] Compiling Distribution.Types.Module ( libraries/Cabal/Cabal/Distribution/Types/Module.hs, bootstrapping/Distribution/Types/Module.o )
634[147 of 271] Compiling Distribution.Types.PackageId.Lens ( libraries/Cabal/Cabal/Distribution/Types/PackageId/Lens.hs, bootstrapping/Distribution/Types/PackageId/Lens.o )
635[148 of 271] Compiling Distribution.Simple.Utils ( libraries/Cabal/Cabal/Distribution/Simple/Utils.hs, bootstrapping/Distribution/Simple/Utils.o )
636[149 of 271] Compiling Distribution.Utils.NubList ( libraries/Cabal/Cabal/Distribution/Utils/NubList.hs, bootstrapping/Distribution/Utils/NubList.o )
637[150 of 271] Compiling Distribution.Utils.LogProgress ( libraries/Cabal/Cabal/Distribution/Utils/LogProgress.hs, bootstrapping/Distribution/Utils/LogProgress.o )
638[151 of 271] Compiling Distribution.Simple.Program.ResponseFile ( libraries/Cabal/Cabal/Distribution/Simple/Program/ResponseFile.hs, bootstrapping/Distribution/Simple/Program/ResponseFile.o )
639[152 of 271] Compiling Distribution.Simple.Program.Find ( libraries/Cabal/Cabal/Distribution/Simple/Program/Find.hs, bootstrapping/Distribution/Simple/Program/Find.o )
640[153 of 271] Compiling Distribution.Simple.Glob ( libraries/Cabal/Cabal/Distribution/Simple/Glob.hs, bootstrapping/Distribution/Simple/Glob.o )
641[154 of 271] Compiling Distribution.Simple.Compiler ( libraries/Cabal/Cabal/Distribution/Simple/Compiler.hs, bootstrapping/Distribution/Simple/Compiler.o )
642[155 of 271] Compiling Distribution.Simple.GHC.ImplInfo ( libraries/Cabal/Cabal/Distribution/Simple/GHC/ImplInfo.hs, bootstrapping/Distribution/Simple/GHC/ImplInfo.o )
643[156 of 271] Compiling Distribution.FieldGrammar.Parsec ( libraries/Cabal/Cabal/Distribution/FieldGrammar/Parsec.hs, bootstrapping/Distribution/FieldGrammar/Parsec.o )
644[157 of 271] Compiling Distribution.Backpack.DescribeUnitId ( libraries/Cabal/Cabal/Distribution/Backpack/DescribeUnitId.hs, bootstrapping/Distribution/Backpack/DescribeUnitId.o )
645[158 of 271] Compiling Distribution.Types.ModuleReexport ( libraries/Cabal/Cabal/Distribution/Types/ModuleReexport.hs, bootstrapping/Distribution/Types/ModuleReexport.o )
646[159 of 271] Compiling Distribution.Types.Mixin ( libraries/Cabal/Cabal/Distribution/Types/Mixin.hs, bootstrapping/Distribution/Types/Mixin.o )
647[160 of 271] Compiling Distribution.Types.ExeDependency ( libraries/Cabal/Cabal/Distribution/Types/ExeDependency.hs, bootstrapping/Distribution/Types/ExeDependency.o )
648[161 of 271] Compiling Distribution.Types.Dependency ( libraries/Cabal/Cabal/Distribution/Types/Dependency.hs, bootstrapping/Distribution/Types/Dependency.o )
649[162 of 271] Compiling Distribution.Types.SetupBuildInfo ( libraries/Cabal/Cabal/Distribution/Types/SetupBuildInfo.hs, bootstrapping/Distribution/Types/SetupBuildInfo.o )
650[163 of 271] Compiling Distribution.Types.SetupBuildInfo.Lens ( libraries/Cabal/Cabal/Distribution/Types/SetupBuildInfo/Lens.hs, bootstrapping/Distribution/Types/SetupBuildInfo/Lens.o )
651[164 of 271] Compiling Distribution.Types.DependencyMap ( libraries/Cabal/Cabal/Distribution/Types/DependencyMap.hs, bootstrapping/Distribution/Types/DependencyMap.o )
652[165 of 271] Compiling Distribution.Simple.GHC.IPIConvert ( libraries/Cabal/Cabal/Distribution/Simple/GHC/IPIConvert.hs, bootstrapping/Distribution/Simple/GHC/IPIConvert.o )
653[166 of 271] Compiling Distribution.Types.MungedPackageName ( libraries/Cabal/Cabal/Distribution/Types/MungedPackageName.hs, bootstrapping/Distribution/Types/MungedPackageName.o )
654[167 of 271] Compiling Distribution.Types.MungedPackageId ( libraries/Cabal/Cabal/Distribution/Types/MungedPackageId.hs, bootstrapping/Distribution/Types/MungedPackageId.o )
655[168 of 271] Compiling Distribution.Package ( libraries/Cabal/Cabal/Distribution/Package.hs, bootstrapping/Distribution/Package.o )
656[169 of 271] Compiling Distribution.Types.AnnotatedId ( libraries/Cabal/Cabal/Distribution/Types/AnnotatedId.hs, bootstrapping/Distribution/Types/AnnotatedId.o )
657[170 of 271] Compiling Distribution.Types.ComponentInclude ( libraries/Cabal/Cabal/Distribution/Types/ComponentInclude.hs, bootstrapping/Distribution/Types/ComponentInclude.o )
658[171 of 271] Compiling Distribution.Types.AbiDependency ( libraries/Cabal/Cabal/Distribution/Types/AbiDependency.hs, bootstrapping/Distribution/Types/AbiDependency.o )
659[172 of 271] Compiling Distribution.Simple.InstallDirs ( libraries/Cabal/Cabal/Distribution/Simple/InstallDirs.hs, bootstrapping/Distribution/Simple/InstallDirs.o )
660[173 of 271] Compiling Distribution.Types.LegacyExeDependency ( libraries/Cabal/Cabal/Distribution/Types/LegacyExeDependency.hs, bootstrapping/Distribution/Types/LegacyExeDependency.o )
661[174 of 271] Compiling Distribution.Types.BuildInfo ( libraries/Cabal/Cabal/Distribution/Types/BuildInfo.hs, bootstrapping/Distribution/Types/BuildInfo.o )
662[175 of 271] Compiling Distribution.Types.HookedBuildInfo ( libraries/Cabal/Cabal/Distribution/Types/HookedBuildInfo.hs, bootstrapping/Distribution/Types/HookedBuildInfo.o )
663[176 of 271] Compiling Distribution.Types.BuildInfo.Lens ( libraries/Cabal/Cabal/Distribution/Types/BuildInfo/Lens.hs, bootstrapping/Distribution/Types/BuildInfo/Lens.o )
664[177 of 271] Compiling Distribution.Types.TestSuite ( libraries/Cabal/Cabal/Distribution/Types/TestSuite.hs, bootstrapping/Distribution/Types/TestSuite.o )
665[178 of 271] Compiling Distribution.Types.TestSuite.Lens ( libraries/Cabal/Cabal/Distribution/Types/TestSuite/Lens.hs, bootstrapping/Distribution/Types/TestSuite/Lens.o )
666[179 of 271] Compiling Distribution.Types.Library ( libraries/Cabal/Cabal/Distribution/Types/Library.hs, bootstrapping/Distribution/Types/Library.o )
667[180 of 271] Compiling Distribution.Types.Library.Lens ( libraries/Cabal/Cabal/Distribution/Types/Library/Lens.hs, bootstrapping/Distribution/Types/Library/Lens.o )
668[181 of 271] Compiling Distribution.Types.ForeignLib ( libraries/Cabal/Cabal/Distribution/Types/ForeignLib.hs, bootstrapping/Distribution/Types/ForeignLib.o )
669[182 of 271] Compiling Distribution.Types.ForeignLib.Lens ( libraries/Cabal/Cabal/Distribution/Types/ForeignLib/Lens.hs, bootstrapping/Distribution/Types/ForeignLib/Lens.o )
670[183 of 271] Compiling Distribution.Types.Executable ( libraries/Cabal/Cabal/Distribution/Types/Executable.hs, bootstrapping/Distribution/Types/Executable.o )
671[184 of 271] Compiling Distribution.Types.Executable.Lens ( libraries/Cabal/Cabal/Distribution/Types/Executable/Lens.hs, bootstrapping/Distribution/Types/Executable/Lens.o )
672[185 of 271] Compiling Distribution.Types.Benchmark ( libraries/Cabal/Cabal/Distribution/Types/Benchmark.hs, bootstrapping/Distribution/Types/Benchmark.o )
673[186 of 271] Compiling Distribution.Types.Component ( libraries/Cabal/Cabal/Distribution/Types/Component.hs, bootstrapping/Distribution/Types/Component.o )
674[187 of 271] Compiling Distribution.Types.ComponentRequestedSpec ( libraries/Cabal/Cabal/Distribution/Types/ComponentRequestedSpec.hs, bootstrapping/Distribution/Types/ComponentRequestedSpec.o )
675[188 of 271] Compiling Distribution.Types.PackageDescription ( libraries/Cabal/Cabal/Distribution/Types/PackageDescription.hs, bootstrapping/Distribution/Types/PackageDescription.o )
676[189 of 271] Compiling Distribution.Types.PackageDescription.Lens ( libraries/Cabal/Cabal/Distribution/Types/PackageDescription/Lens.hs, bootstrapping/Distribution/Types/PackageDescription/Lens.o )
677[190 of 271] Compiling Distribution.Types.GenericPackageDescription ( libraries/Cabal/Cabal/Distribution/Types/GenericPackageDescription.hs, bootstrapping/Distribution/Types/GenericPackageDescription.o )
678[191 of 271] Compiling Distribution.Types.GenericPackageDescription.Lens ( libraries/Cabal/Cabal/Distribution/Types/GenericPackageDescription/Lens.hs, bootstrapping/Distribution/Types/GenericPackageDescription/Lens.o )
679[192 of 271] Compiling Distribution.Parsec.ConfVar ( libraries/Cabal/Cabal/Distribution/Parsec/ConfVar.hs, bootstrapping/Distribution/Parsec/ConfVar.o )
680[193 of 271] Compiling Distribution.Types.Benchmark.Lens ( libraries/Cabal/Cabal/Distribution/Types/Benchmark/Lens.hs, bootstrapping/Distribution/Types/Benchmark/Lens.o )
681[194 of 271] Compiling Distribution.Types.Lens ( libraries/Cabal/Cabal/Distribution/Types/Lens.hs, bootstrapping/Distribution/Types/Lens.o )
682[195 of 271] Compiling Distribution.PackageDescription ( libraries/Cabal/Cabal/Distribution/PackageDescription.hs, bootstrapping/Distribution/PackageDescription.o )
683[196 of 271] Compiling Distribution.Simple.Program.Types ( libraries/Cabal/Cabal/Distribution/Simple/Program/Types.hs, bootstrapping/Distribution/Simple/Program/Types.o )
684[197 of 271] Compiling Distribution.Simple.Program.Run ( libraries/Cabal/Cabal/Distribution/Simple/Program/Run.hs, bootstrapping/Distribution/Simple/Program/Run.o )
685[198 of 271] Compiling Distribution.Simple.Program.Script ( libraries/Cabal/Cabal/Distribution/Simple/Program/Script.hs, bootstrapping/Distribution/Simple/Program/Script.o )
686[199 of 271] Compiling Distribution.Simple.Program.Hpc ( libraries/Cabal/Cabal/Distribution/Simple/Program/Hpc.hs, bootstrapping/Distribution/Simple/Program/Hpc.o )
687[200 of 271] Compiling Distribution.Simple.BuildToolDepends ( libraries/Cabal/Cabal/Distribution/Simple/BuildToolDepends.hs, bootstrapping/Distribution/Simple/BuildToolDepends.o )
688[201 of 271] Compiling Distribution.Simple.Command ( libraries/Cabal/Cabal/Distribution/Simple/Command.hs, bootstrapping/Distribution/Simple/Command.o )
689[202 of 271] Compiling Distribution.FieldGrammar.Pretty ( libraries/Cabal/Cabal/Distribution/FieldGrammar/Pretty.hs, bootstrapping/Distribution/FieldGrammar/Pretty.o )
690[203 of 271] Compiling Distribution.FieldGrammar ( libraries/Cabal/Cabal/Distribution/FieldGrammar.hs, bootstrapping/Distribution/FieldGrammar.o )
691[204 of 271] Compiling Distribution.FieldGrammar.FieldDescrs ( libraries/Cabal/Cabal/Distribution/FieldGrammar/FieldDescrs.hs, bootstrapping/Distribution/FieldGrammar/FieldDescrs.o )
692[205 of 271] Compiling Distribution.PackageDescription.FieldGrammar ( libraries/Cabal/Cabal/Distribution/PackageDescription/FieldGrammar.hs, bootstrapping/Distribution/PackageDescription/FieldGrammar.o )
693[206 of 271] Compiling Distribution.PackageDescription.PrettyPrint ( libraries/Cabal/Cabal/Distribution/PackageDescription/PrettyPrint.hs, bootstrapping/Distribution/PackageDescription/PrettyPrint.o )
694[207 of 271] Compiling Distribution.PackageDescription.Configuration ( libraries/Cabal/Cabal/Distribution/PackageDescription/Configuration.hs, bootstrapping/Distribution/PackageDescription/Configuration.o )
695[208 of 271] Compiling Distribution.Backpack ( libraries/Cabal/Cabal/Distribution/Backpack.hs, bootstrapping/Distribution/Backpack.o )
696[209 of 271] Compiling Distribution.Types.ExposedModule ( libraries/Cabal/Cabal/Distribution/Types/ExposedModule.hs, bootstrapping/Distribution/Types/ExposedModule.o )
697[210 of 271] Compiling Distribution.Types.InstalledPackageInfo ( libraries/Cabal/Cabal/Distribution/Types/InstalledPackageInfo.hs, bootstrapping/Distribution/Types/InstalledPackageInfo.o )
698[211 of 271] Compiling Distribution.Types.InstalledPackageInfo.Lens ( libraries/Cabal/Cabal/Distribution/Types/InstalledPackageInfo/Lens.hs, bootstrapping/Distribution/Types/InstalledPackageInfo/Lens.o )
699[212 of 271] Compiling Distribution.Types.InstalledPackageInfo.FieldGrammar ( libraries/Cabal/Cabal/Distribution/Types/InstalledPackageInfo/FieldGrammar.hs, bootstrapping/Distribution/Types/InstalledPackageInfo/FieldGrammar.o )
700[213 of 271] Compiling Distribution.Simple.Program.GHC ( libraries/Cabal/Cabal/Distribution/Simple/Program/GHC.hs, bootstrapping/Distribution/Simple/Program/GHC.o )
701[214 of 271] Compiling Distribution.Simple.Program.Builtin ( libraries/Cabal/Cabal/Distribution/Simple/Program/Builtin.hs, bootstrapping/Distribution/Simple/Program/Builtin.o )
702[215 of 271] Compiling Distribution.Simple.Program.Db ( libraries/Cabal/Cabal/Distribution/Simple/Program/Db.hs, bootstrapping/Distribution/Simple/Program/Db.o )
703[216 of 271] Compiling Distribution.Simple.Program ( libraries/Cabal/Cabal/Distribution/Simple/Program.hs, bootstrapping/Distribution/Simple/Program.o )
704[217 of 271] Compiling Distribution.Simple.Setup ( libraries/Cabal/Cabal/Distribution/Simple/Setup.hs, bootstrapping/Distribution/Simple/Setup.o )
705[218 of 271] Compiling Distribution.Simple.Program.Strip ( libraries/Cabal/Cabal/Distribution/Simple/Program/Strip.hs, bootstrapping/Distribution/Simple/Program/Strip.o )
706[219 of 271] Compiling Distribution.Backpack.ModSubst ( libraries/Cabal/Cabal/Distribution/Backpack/ModSubst.hs, bootstrapping/Distribution/Backpack/ModSubst.o )
707[220 of 271] Compiling Distribution.Backpack.ModuleScope ( libraries/Cabal/Cabal/Distribution/Backpack/ModuleScope.hs, bootstrapping/Distribution/Backpack/ModuleScope.o )
708[221 of 271] Compiling Distribution.Backpack.FullUnitId ( libraries/Cabal/Cabal/Distribution/Backpack/FullUnitId.hs, bootstrapping/Distribution/Backpack/FullUnitId.o )
709[222 of 271] Compiling Distribution.Parsec.Parser ( libraries/Cabal/Cabal/Distribution/Parsec/Parser.hs, bootstrapping/Distribution/Parsec/Parser.o )
710[223 of 271] Compiling Distribution.PackageDescription.Parsec ( libraries/Cabal/Cabal/Distribution/PackageDescription/Parsec.hs, bootstrapping/Distribution/PackageDescription/Parsec.o )
711[224 of 271] Compiling Distribution.InstalledPackageInfo ( libraries/Cabal/Cabal/Distribution/InstalledPackageInfo.hs, bootstrapping/Distribution/InstalledPackageInfo.o )
712[225 of 271] Compiling Distribution.Types.ComponentLocalBuildInfo ( libraries/Cabal/Cabal/Distribution/Types/ComponentLocalBuildInfo.hs, bootstrapping/Distribution/Types/ComponentLocalBuildInfo.o )
713[226 of 271] Compiling Distribution.Types.TargetInfo ( libraries/Cabal/Cabal/Distribution/Types/TargetInfo.hs, bootstrapping/Distribution/Types/TargetInfo.o )
714[227 of 271] Compiling Distribution.Simple.Program.HcPkg ( libraries/Cabal/Cabal/Distribution/Simple/Program/HcPkg.hs, bootstrapping/Distribution/Simple/Program/HcPkg.o )
715[228 of 271] Compiling Distribution.Simple.PackageIndex ( libraries/Cabal/Cabal/Distribution/Simple/PackageIndex.hs, bootstrapping/Distribution/Simple/PackageIndex.o )
716[229 of 271] Compiling Distribution.Types.LocalBuildInfo ( libraries/Cabal/Cabal/Distribution/Types/LocalBuildInfo.hs, bootstrapping/Distribution/Types/LocalBuildInfo.o )
717[230 of 271] Compiling Distribution.Simple.LocalBuildInfo ( libraries/Cabal/Cabal/Distribution/Simple/LocalBuildInfo.hs, bootstrapping/Distribution/Simple/LocalBuildInfo.o )
718[231 of 271] Compiling Distribution.Simple.Test.Log ( libraries/Cabal/Cabal/Distribution/Simple/Test/Log.hs, bootstrapping/Distribution/Simple/Test/Log.o )
719[232 of 271] Compiling Distribution.Simple.Program.Ld ( libraries/Cabal/Cabal/Distribution/Simple/Program/Ld.hs, bootstrapping/Distribution/Simple/Program/Ld.o )
720[233 of 271] Compiling Distribution.Simple.Program.Ar ( libraries/Cabal/Cabal/Distribution/Simple/Program/Ar.hs, bootstrapping/Distribution/Simple/Program/Ar.o )
721[234 of 271] Compiling Distribution.Simple.Hpc ( libraries/Cabal/Cabal/Distribution/Simple/Hpc.hs, bootstrapping/Distribution/Simple/Hpc.o )
722[235 of 271] Compiling Distribution.Simple.BuildTarget ( libraries/Cabal/Cabal/Distribution/Simple/BuildTarget.hs, bootstrapping/Distribution/Simple/BuildTarget.o )
723[236 of 271] Compiling Distribution.Simple.BuildPaths ( libraries/Cabal/Cabal/Distribution/Simple/BuildPaths.hs, bootstrapping/Distribution/Simple/BuildPaths.o )
724[237 of 271] Compiling Distribution.Simple.UHC ( libraries/Cabal/Cabal/Distribution/Simple/UHC.hs, bootstrapping/Distribution/Simple/UHC.o )
725[238 of 271] Compiling Distribution.PackageDescription.Check ( libraries/Cabal/Cabal/Distribution/PackageDescription/Check.hs, bootstrapping/Distribution/PackageDescription/Check.o )
726[239 of 271] Compiling Distribution.Simple.Build.PathsModule ( libraries/Cabal/Cabal/Distribution/Simple/Build/PathsModule.hs, bootstrapping/Distribution/Simple/Build/PathsModule.o )
727[240 of 271] Compiling Distribution.Simple.Test.LibV09 ( libraries/Cabal/Cabal/Distribution/Simple/Test/LibV09.hs, bootstrapping/Distribution/Simple/Test/LibV09.o )
728[241 of 271] Compiling Distribution.Simple.PreProcess ( libraries/Cabal/Cabal/Distribution/Simple/PreProcess.hs, bootstrapping/Distribution/Simple/PreProcess.o )
729[242 of 271] Compiling Distribution.Simple.UserHooks ( libraries/Cabal/Cabal/Distribution/Simple/UserHooks.hs, bootstrapping/Distribution/Simple/UserHooks.o )
730[243 of 271] Compiling Distribution.Simple.SrcDist ( libraries/Cabal/Cabal/Distribution/Simple/SrcDist.hs, bootstrapping/Distribution/Simple/SrcDist.o )
731[244 of 271] Compiling Distribution.Simple.Test.ExeV10 ( libraries/Cabal/Cabal/Distribution/Simple/Test/ExeV10.hs, bootstrapping/Distribution/Simple/Test/ExeV10.o )
732[245 of 271] Compiling Distribution.Simple.Test ( libraries/Cabal/Cabal/Distribution/Simple/Test.hs, bootstrapping/Distribution/Simple/Test.o )
733[246 of 271] Compiling Distribution.Simple.Build.Macros ( libraries/Cabal/Cabal/Distribution/Simple/Build/Macros.hs, bootstrapping/Distribution/Simple/Build/Macros.o )
734[247 of 271] Compiling Distribution.Simple.Bench ( libraries/Cabal/Cabal/Distribution/Simple/Bench.hs, bootstrapping/Distribution/Simple/Bench.o )
735[248 of 271] Compiling Distribution.Backpack.Id ( libraries/Cabal/Cabal/Distribution/Backpack/Id.hs, bootstrapping/Distribution/Backpack/Id.o )
736[249 of 271] Compiling Distribution.Backpack.ConfiguredComponent ( libraries/Cabal/Cabal/Distribution/Backpack/ConfiguredComponent.hs, bootstrapping/Distribution/Backpack/ConfiguredComponent.o )
737[250 of 271] Compiling Distribution.Backpack.ComponentsGraph ( libraries/Cabal/Cabal/Distribution/Backpack/ComponentsGraph.hs, bootstrapping/Distribution/Backpack/ComponentsGraph.o )
738[251 of 271] Compiling Distribution.Simple.HaskellSuite ( libraries/Cabal/Cabal/Distribution/Simple/HaskellSuite.hs, bootstrapping/Distribution/Simple/HaskellSuite.o )
739[252 of 271] Compiling Distribution.Simple.GHC.Internal ( libraries/Cabal/Cabal/Distribution/Simple/GHC/Internal.hs, bootstrapping/Distribution/Simple/GHC/Internal.o )
740[253 of 271] Compiling Distribution.Simple.GHCJS ( libraries/Cabal/Cabal/Distribution/Simple/GHCJS.hs, bootstrapping/Distribution/Simple/GHCJS.o )
741[254 of 271] Compiling Distribution.Simple.GHC.IPI642 ( libraries/Cabal/Cabal/Distribution/Simple/GHC/IPI642.hs, bootstrapping/Distribution/Simple/GHC/IPI642.o )
742[255 of 271] Compiling Distribution.Simple.GHC ( libraries/Cabal/Cabal/Distribution/Simple/GHC.hs, bootstrapping/Distribution/Simple/GHC.o )
743[256 of 271] Compiling Distribution.Simple.Register ( libraries/Cabal/Cabal/Distribution/Simple/Register.hs, bootstrapping/Distribution/Simple/Register.o )
744[257 of 271] Compiling Distribution.Simple.Install ( libraries/Cabal/Cabal/Distribution/Simple/Install.hs, bootstrapping/Distribution/Simple/Install.o )
745[258 of 271] Compiling Distribution.Backpack.ModuleShape ( libraries/Cabal/Cabal/Distribution/Backpack/ModuleShape.hs, bootstrapping/Distribution/Backpack/ModuleShape.o )
746[259 of 271] Compiling Distribution.Backpack.UnifyM ( libraries/Cabal/Cabal/Distribution/Backpack/UnifyM.hs, bootstrapping/Distribution/Backpack/UnifyM.o )
747[260 of 271] Compiling Distribution.Backpack.MixLink ( libraries/Cabal/Cabal/Distribution/Backpack/MixLink.hs, bootstrapping/Distribution/Backpack/MixLink.o )
748[261 of 271] Compiling Distribution.Backpack.PreModuleShape ( libraries/Cabal/Cabal/Distribution/Backpack/PreModuleShape.hs, bootstrapping/Distribution/Backpack/PreModuleShape.o )
749[262 of 271] Compiling Distribution.Backpack.PreExistingComponent ( libraries/Cabal/Cabal/Distribution/Backpack/PreExistingComponent.hs, bootstrapping/Distribution/Backpack/PreExistingComponent.o )
750[263 of 271] Compiling Distribution.Backpack.LinkedComponent ( libraries/Cabal/Cabal/Distribution/Backpack/LinkedComponent.hs, bootstrapping/Distribution/Backpack/LinkedComponent.o )
751[264 of 271] Compiling Distribution.Backpack.ReadyComponent ( libraries/Cabal/Cabal/Distribution/Backpack/ReadyComponent.hs, bootstrapping/Distribution/Backpack/ReadyComponent.o )
752[265 of 271] Compiling Distribution.Backpack.Configure ( libraries/Cabal/Cabal/Distribution/Backpack/Configure.hs, bootstrapping/Distribution/Backpack/Configure.o )
753[266 of 271] Compiling Distribution.Simple.Configure ( libraries/Cabal/Cabal/Distribution/Simple/Configure.hs, bootstrapping/Distribution/Simple/Configure.o )
754[267 of 271] Compiling Distribution.Simple.Build ( libraries/Cabal/Cabal/Distribution/Simple/Build.hs, bootstrapping/Distribution/Simple/Build.o )
755[268 of 271] Compiling Distribution.Simple.Haddock ( libraries/Cabal/Cabal/Distribution/Simple/Haddock.hs, bootstrapping/Distribution/Simple/Haddock.o )
756[269 of 271] Compiling Distribution.Simple.Doctest ( libraries/Cabal/Cabal/Distribution/Simple/Doctest.hs, bootstrapping/Distribution/Simple/Doctest.o )
757[270 of 271] Compiling Distribution.Simple ( libraries/Cabal/Cabal/Distribution/Simple.hs, bootstrapping/Distribution/Simple.o )
758[271 of 271] Compiling Main ( utils/ghc-cabal/Main.hs, bootstrapping/Main.o )
759Linking utils/ghc-cabal/dist/build/tmp/ghc-cabal ...
760 GHC PKG libraries/binary/dist-boot/package-data.mk
761ignoring (possibly broken) abi-depends field for packages
762 GHC PKG libraries/text/dist-boot/package-data.mk
763ignoring (possibly broken) abi-depends field for packages
764 GHC PKG libraries/transformers/dist-boot/package-data.mk
765ignoring (possibly broken) abi-depends field for packages
766 GHC PKG libraries/mtl/dist-boot/package-data.mk
767ignoring (possibly broken) abi-depends field for packages
768 GHC PKG libraries/parsec/dist-boot/package-data.mk
769ignoring (possibly broken) abi-depends field for packages
770 GHC PKG libraries/Cabal/Cabal/dist-boot/package-data.mk
771ignoring (possibly broken) abi-depends field for packages
772 GHC PKG libraries/hpc/dist-boot/package-data.mk
773ignoring (possibly broken) abi-depends field for packages
774 GHC PKG libraries/ghc-boot-th/dist-boot/package-data.mk
775ignoring (possibly broken) abi-depends field for packages
776 GHC PKG libraries/ghc-boot/dist-boot/package-data.mk
777ignoring (possibly broken) abi-depends field for packages
778 GHC PKG libraries/template-haskell/dist-boot/package-data.mk
779ignoring (possibly broken) abi-depends field for packages
780 GHC PKG libraries/ghc-heap/dist-boot/package-data.mk
781ignoring (possibly broken) abi-depends field for packages
782 GHC PKG libraries/ghci/dist-boot/package-data.mk
783ignoring (possibly broken) abi-depends field for packages
784 GHC PKG libraries/terminfo/dist-boot/package-data.mk
785ignoring (possibly broken) abi-depends field for packages
786 GHC PKG compiler/stage1/package-data.mk
787ignoring (possibly broken) abi-depends field for packages
788Creating includes/ghcautoconf.h...
789 ALEX utils/genprimopcode/dist/build/Lexer.hs
790Creating includes/ghcplatform.h...
791 HAPPY utils/genprimopcode/dist/build/Parser.hs
792Done.
793Done.
794===--- building phase 1
795Creating compiler/stage1/ghc_boot_platform.h...
796 ALEX compiler/stage1/build/CmmLex.hs
797 HAPPY compiler/stage1/build/CmmParse.hs
798 ALEX compiler/stage1/build/Lexer.hs
799 HAPPY compiler/stage1/build/Parser.hs
800Done.
801 HC [stage 0] utils/hsc2hs/dist/build/HSCParser.o
802 HC [stage 0] utils/hsc2hs/dist/build/Flags.o
803 HC [stage 0] utils/hsc2hs/dist/build/Common.o
804 HC [stage 0] utils/hsc2hs/dist/build/ATTParser.o
805 HC [stage 0] utils/hsc2hs/dist/build/Paths_hsc2hs.o
806 HC [stage 0] utils/deriveConstants/dist/build/Main.o
807Creating includes/ghcversion.h...
808Done.
809 HC [stage 0] utils/genprimopcode/dist/build/Syntax.o
810 HC [stage 0] utils/genprimopcode/dist/build/ParserM.o
811 HC [stage 0] utils/hsc2hs/dist/build/C.o
812 HC [stage 0] utils/genprimopcode/dist/build/Lexer.o
813 HC [stage 0] utils/deriveConstants/dist/build/tmp/deriveConstants
814 HC [stage 0] utils/hsc2hs/dist/build/UtilsCodegen.o
815 HC [stage 0] utils/hsc2hs/dist/build/CrossCodegen.o
816 HC [stage 0] utils/genprimopcode/dist/build/Parser.o
817 HC [stage 0] utils/hsc2hs/dist/build/DirectCodegen.o
818 HC [stage 0] utils/genprimopcode/dist/build/Main.o
819 HC [stage 0] utils/hsc2hs/dist/build/Main.o
820 HC [stage 0] utils/hsc2hs/dist/build/tmp/hsc2hs
821 HC [stage 0] utils/genprimopcode/dist/build/tmp/genprimopcode
822 HSC2HS compiler/stage1/build/Fingerprint.hs
823 HSC2HS libraries/ghci/dist-boot/build/GHCi/FFI.hs
824 HSC2HS libraries/ghci/dist-boot/build/GHCi/InfoTable.hs
825 HSC2HS libraries/ghc-heap/dist-boot/build/GHC/Exts/Heap/Constants.hs
826 HSC2HS libraries/ghc-heap/dist-boot/build/GHC/Exts/Heap/InfoTable.hs
827 HSC2HS libraries/ghc-heap/dist-boot/build/GHC/Exts/Heap/InfoTable/Types.hs
828 HSC2HS libraries/ghc-heap/dist-boot/build/GHC/Exts/Heap/InfoTableProf.hs
829 HSC2HS libraries/ghc-heap/dist-boot/build/GHC/Exts/Heap/Utils.hs
830 HSC2HS libraries/hpc/dist-boot/build/Trace/Hpc/Reflect.hs
831 HC [stage 0] libraries/terminfo/dist-boot/build/System/Console/Terminfo/Base.o
832 HC [stage 0] libraries/Cabal/Cabal/dist-boot/build/Paths_Cabal.o
833 HC [stage 0] libraries/parsec/dist-boot/build/Text/Parsec/Pos.o
834 HC [stage 0] libraries/transformers/dist-boot/build/Control/Monad/Trans/Class.o
835 HC [stage 0] libraries/transformers/dist-boot/build/Control/Monad/Signatures.o
836 HC [stage 0] libraries/text/dist-boot/build/Data/Text/Internal/Unsafe/Shift.o
837 HC [stage 0] libraries/text/dist-boot/build/Data/Text/Internal/Unsafe.o
838 HC [stage 0] libraries/text/dist-boot/build/Data/Text/Internal/Encoding/Utf16.o
839 HC [stage 0] libraries/text/dist-boot/build/Data/Text/Internal/Functions.o
840 HC [stage 0] libraries/text/dist-boot/build/Data/Text/Internal/Encoding/Utf32.o
841 HC [stage 0] libraries/text/dist-boot/build/Data/Text/Encoding/Error.o
842 HC [stage 0] libraries/binary/dist-boot/build/Data/Binary/FloatCast.o
843 HC [stage 0] libraries/binary/dist-boot/build/Data/Binary/Builder.o
844 HC [stage 0] libraries/binary/dist-boot/build/Data/Binary/Internal.o
845 HC [stage 0] libraries/Cabal/Cabal/dist-boot/build/Distribution/Compat/MonadFail.o
846 HC [stage 0] libraries/Cabal/Cabal/dist-boot/build/Distribution/Compat/Stack.o
847 HC [stage 0] libraries/Cabal/Cabal/dist-boot/build/Distribution/Utils/String.o
848 HC [stage 0] libraries/Cabal/Cabal/dist-boot/build/Distribution/Compat/Map/Strict.o
849 HC [stage 0] libraries/Cabal/Cabal/dist-boot/build/Distribution/Compat/Newtype.o
850 HC [stage 0] libraries/Cabal/Cabal/dist-boot/build/Distribution/Compat/Exception.o
851 HC [stage 0] libraries/Cabal/Cabal/dist-boot/build/Distribution/Utils/Base62.o
852 HC [stage 0] libraries/ghc-boot/dist-boot/build/GHC/HandleEncoding.o
853 HC [stage 0] utils/ghc-pkg/dist/build/Version.o
854 HC [stage 0] libraries/ghc-boot-th/dist-boot/build/GHC/LanguageExtensions/Type.o
855 HC [stage 0] libraries/ghc-boot/dist-boot/build/GHC/Serialized.o
856 HC [stage 0] libraries/ghc-boot-th/dist-boot/build/GHC/ForeignSrcLang/Type.o
857 HC [stage 0] libraries/ghc-boot-th/dist-boot/build/GHC/Lexeme.o
858 HC [stage 0] libraries/Cabal/Cabal/dist-boot/build/Distribution/PackageDescription/Utils.o
859 HC [stage 0] libraries/Cabal/Cabal/dist-boot/build/Distribution/Utils/UnionFind.o
860 HC [stage 0] libraries/Cabal/Cabal/dist-boot/build/Distribution/Compat/Directory.o
861 HC [stage 0] libraries/Cabal/Cabal/dist-boot/build/Distribution/Compat/Map/Lazy.o
862 HC [stage 0] libraries/text/dist-boot/build/Data/Text/Internal/Builder/Int/Digits.o
863 HC [stage 0] libraries/text/dist-boot/build/Data/Text/Internal/Builder/RealFloat/Functions.o
864 HC [stage 0] libraries/text/dist-boot/build/Data/Text/Internal/Read.o
865 HC [stage 0] libraries/transformers/dist-boot/build/Control/Applicative/Backwards.o
866 HC [stage 0] libraries/transformers/dist-boot/build/Data/Functor/Constant.o
867 HC [stage 0] compiler/stage1/build/GhcPrelude.o
868 HC [stage 0] libraries/template-haskell/dist-boot/build/Language/Haskell/TH/Lib/Map.o
869 HC [stage 0] libraries/ghc-heap/dist-boot/build/GHC/Exts/Heap/ClosureTypes.o
870 HC [stage 0] libraries/ghc-heap/dist-boot/build/GHC/Exts/Heap/Constants.o
871 HC [stage 0] libraries/ghci/dist-boot/build/GHCi/BreakArray.o
872 HC [stage 0] libraries/hpc/dist-boot/build/Trace/Hpc/Util.o
873 HC [stage 0] ghc/stage1/build/hschooks.o
874 HC [stage 0] libraries/ghci/dist-boot/build/GHCi/InfoTable.o
875 HC [stage 0] utils/unlit/dist/build/unlit.o
876 HC [stage 0] utils/unlit/dist/build/fs.o
877 HC [stage 0] libraries/terminfo/dist-boot/build/System/Console/Terminfo/Color.o
878 HC [stage 0] libraries/terminfo/dist-boot/build/System/Console/Terminfo/Effects.o
879 HC [stage 0] libraries/terminfo/dist-boot/build/System/Console/Terminfo/Edit.o
880 HC [stage 0] libraries/terminfo/dist-boot/build/System/Console/Terminfo/Cursor.o
881 HC [stage 0] libraries/terminfo/dist-boot/build/System/Console/Terminfo/Keys.o
882 HC [stage 0] libraries/parsec/dist-boot/build/Text/Parsec/Error.o
883 HC [stage 0] libraries/transformers/dist-boot/build/Control/Monad/Trans/Writer/Strict.o
884 HC [stage 0] libraries/transformers/dist-boot/build/Control/Monad/Trans/Writer/Lazy.o
885 HC [stage 0] libraries/transformers/dist-boot/build/Control/Monad/Trans/State/Strict.o
886 HC [stage 0] libraries/transformers/dist-boot/build/Control/Monad/Trans/State/Lazy.o
887 HC [stage 0] libraries/transformers/dist-boot/build/Control/Monad/Trans/RWS/Strict.o
888 HC [stage 0] libraries/transformers/dist-boot/build/Control/Monad/Trans/RWS/Lazy.o
889 HC [stage 0] libraries/transformers/dist-boot/build/Control/Monad/Trans/Reader.o
890 HC [stage 0] libraries/transformers/dist-boot/build/Control/Monad/Trans/Except.o
891 HC [stage 0] libraries/transformers/dist-boot/build/Control/Monad/Trans/List.o
892 HC [stage 0] libraries/transformers/dist-boot/build/Control/Monad/Trans/Identity.o
893 HC [stage 0] libraries/transformers/dist-boot/build/Control/Monad/Trans/Error.o
894 HC [stage 0] libraries/transformers/dist-boot/build/Control/Monad/Trans/Cont.o
895 HC [stage 0] libraries/mtl/dist-boot/build/Control/Monad/Trans.o
896 HC [stage 0] libraries/text/dist-boot/build/Data/Text/Array.o
897 HC [stage 0] libraries/binary/dist-boot/build/Data/Binary/Put.o
898 HC [stage 0] libraries/binary/dist-boot/build/Data/Binary/Get/Internal.o
899 HC [stage 0] libraries/Cabal/Cabal/dist-boot/build/Distribution/Compat/Internal/TempFile.o
900 HC [stage 0] libraries/parsec/dist-boot/build/Text/ParserCombinators/Parsec/Pos.o
901 HC [stage 0] libraries/text/dist-boot/build/cbits/cbits.o
902 HC [stage 0] libraries/transformers/dist-boot/build/Control/Applicative/Lift.o
903 HC [stage 0] libraries/transformers/dist-boot/build/Data/Functor/Reverse.o
904 HC [stage 0] compiler/stage1/build/Outputable.o-boot
905 HC [stage 0] compiler/stage1/build/Exception.o
906 HC [stage 0] compiler/stage1/build/Config.o
907 HC [stage 0] compiler/stage1/build/OccName.o-boot
908 HC [stage 0] compiler/stage1/build/FastFunctions.o
909 HC [stage 0] compiler/stage1/build/Encoding.o
910 HC [stage 0] compiler/stage1/build/Platform.o
911 HC [stage 0] compiler/stage1/build/FastMutInt.o
912 HC [stage 0] compiler/stage1/build/FiniteMap.o
913 HC [stage 0] compiler/stage1/build/Fingerprint.o
914 HC [stage 0] compiler/stage1/build/Name.o-boot
915 HC [stage 0] compiler/stage1/build/Hooks.o-boot
916 HC [stage 0] compiler/stage1/build/Plugins.o-boot
917 HC [stage 0] compiler/stage1/build/EnumSet.o
918 HC [stage 0] compiler/stage1/build/PlatformConstants.o
919 HC [stage 0] libraries/template-haskell/dist-boot/build/Language/Haskell/TH/LanguageExtensions.o
920 HC [stage 0] libraries/ghc-heap/dist-boot/build/GHC/Exts/Heap/InfoTable/Types.o
921 HC [stage 0] compiler/stage1/build/TyCon.o-boot
922 HC [stage 0] compiler/stage1/build/PrimOp.o-boot
923 HC [stage 0] compiler/stage1/build/Stream.o
924 HC [stage 0] compiler/stage1/build/Hoopl/Collections.o
925 HC [stage 0] compiler/stage1/build/Hoopl/Block.o
926 HC [stage 0] compiler/stage1/build/X86/Cond.o
927 HC [stage 0] compiler/stage1/build/State.o
928 HC [stage 0] compiler/stage1/build/SPARC/Cond.o
929 HC [stage 0] libraries/hpc/dist-boot/build/Trace/Hpc/Tix.o
930 HC [stage 0] compiler/stage1/build/ListT.o
931 HC [stage 0] compiler/stage1/build/TcPluginM.o
932 HC [stage 0] compiler/stage1/build/parser/cutils.o
933 HC [stage 0] compiler/stage1/build/ghci/keepCAFsForGHCi.o
934 HC [stage 0] compiler/stage1/build/cbits/genSym.o
935 HC [stage 0] libraries/ghc-heap/dist-boot/build/cbits/HeapPrim.o
936 HC [stage 0] utils/unlit/dist/build/tmp/unlit
937Creating compiler/stage2/build/Config.hs ...
938 HC [stage 0] libraries/terminfo/dist-boot/build/System/Console/Terminfo.o
939 HC [stage 0] libraries/transformers/dist-boot/build/Control/Monad/Trans/Maybe.o
940 HC [stage 0] libraries/mtl/dist-boot/build/Control/Monad/Identity.o
941done.
942 HC [stage 0] libraries/text/dist-boot/build/Data/Text/Internal/Unsafe/Char.o
943 HC [stage 0] libraries/binary/dist-boot/build/Data/Binary/Get.o
944 HC [stage 0] libraries/parsec/dist-boot/build/Text/ParserCombinators/Parsec/Error.o
945 HC [stage 0] libraries/mtl/dist-boot/build/Control/Monad/List.o
946 HC [stage 0] libraries/transformers/dist-boot/build/Control/Monad/Trans/State.o
947 HC [stage 0] libraries/transformers/dist-boot/build/Control/Monad/Trans/Writer.o
948 HC [stage 0] libraries/transformers/dist-boot/build/Control/Monad/Trans/RWS.o
949 HC [stage 0] libraries/transformers/dist-boot/build/Control/Monad/Trans/Select.o
950 HC [stage 0] compiler/stage1/build/Panic.o
951 HC [stage 0] compiler/stage1/build/DynFlags.o-boot
952 HC [stage 0] compiler/stage1/build/Constants.o
953 HC [stage 0] libraries/template-haskell/dist-boot/build/Language/Haskell/TH/Syntax.o
954 HC [stage 0] libraries/ghc-heap/dist-boot/build/GHC/Exts/Heap/InfoTable.o
955 HC [stage 0] libraries/ghc-heap/dist-boot/build/GHC/Exts/Heap/InfoTableProf.o
956 HC [stage 0] libraries/hpc/dist-boot/build/Trace/Hpc/Mix.o
957 HC [stage 0] libraries/hpc/dist-boot/build/Trace/Hpc/Reflect.o
958 HC [stage 0] libraries/mtl/dist-boot/build/Control/Monad/Error/Class.o
959 HC [stage 0] libraries/mtl/dist-boot/build/Control/Monad/Cont/Class.o
960 HC [stage 0] libraries/mtl/dist-boot/build/Control/Monad/State/Class.o
961 HC [stage 0] libraries/mtl/dist-boot/build/Control/Monad/Reader/Class.o
962 HC [stage 0] libraries/text/dist-boot/build/Data/Text/Internal.o
963 HC [stage 0] libraries/text/dist-boot/build/Data/Text/Internal/Encoding/Utf8.o
964 HC [stage 0] libraries/binary/dist-boot/build/Data/Binary/Class.o
965 HC [stage 0] libraries/mtl/dist-boot/build/Control/Monad/Writer/Class.o
966 HC [stage 0] libraries/transformers/dist-boot/build/Control/Monad/Trans/Accum.o
967 HC [stage 0] compiler/stage1/build/Util.o
968 HC [stage 0] compiler/stage1/build/SysTools/BaseDir.o
969 HC [stage 0] compiler/stage1/build/SysTools/Terminal.o
970 HC [stage 0] libraries/ghc-heap/dist-boot/build/GHC/Exts/Heap/Utils.o
971 HC [stage 0] libraries/ghc-heap/dist-boot/build/GHC/Exts/Heap/Closures.o
972 HC [stage 0] compiler/stage1/build/Ctype.o
973 HC [stage 0] compiler/stage1/build/PPC/Cond.o
974 HC [stage 0] compiler/stage1/build/Ar.o
975 HC [stage 0] libraries/text/dist-boot/build/Data/Text/Internal/Search.o
976 HC [stage 0] libraries/text/dist-boot/build/Data/Text/Unsafe.o
977 HC [stage 0] libraries/text/dist-boot/build/Data/Text/Internal/Fusion/Size.o
978 HC [stage 0] libraries/mtl/dist-boot/build/Control/Monad/State/Strict.o
979 HC [stage 0] libraries/mtl/dist-boot/build/Control/Monad/Cont.o
980 HC [stage 0] libraries/mtl/dist-boot/build/Control/Monad/Error.o
981 HC [stage 0] libraries/mtl/dist-boot/build/Control/Monad/Except.o
982 HC [stage 0] libraries/mtl/dist-boot/build/Control/Monad/RWS/Class.o
983 HC [stage 0] libraries/mtl/dist-boot/build/Control/Monad/Reader.o
984 HC [stage 0] libraries/mtl/dist-boot/build/Control/Monad/State/Lazy.o
985 HC [stage 0] libraries/mtl/dist-boot/build/Control/Monad/Writer/Lazy.o
986 HC [stage 0] libraries/mtl/dist-boot/build/Control/Monad/Writer/Strict.o
987 HC [stage 0] compiler/stage1/build/FastString.o
988 HC [stage 0] compiler/stage1/build/PprColour.o
989 HC [stage 0] compiler/stage1/build/Maybes.o
990 HC [stage 0] libraries/ghc-heap/dist-boot/build/GHC/Exts/Heap.o
991 HC [stage 0] libraries/text/dist-boot/build/Data/Text/Internal/Fusion/Types.o
992 HC [stage 0] libraries/text/dist-boot/build/Data/Text/Internal/Private.o
993 HC [stage 0] libraries/mtl/dist-boot/build/Control/Monad/RWS/Lazy.o
994 HC [stage 0] libraries/mtl/dist-boot/build/Control/Monad/RWS/Strict.o
995 HC [stage 0] libraries/mtl/dist-boot/build/Control/Monad/State.o
996 HC [stage 0] libraries/mtl/dist-boot/build/Control/Monad/Writer.o
997 HC [stage 0] compiler/stage1/build/Module.o-boot
998 HC [stage 0] compiler/stage1/build/BufWrite.o
999 HC [stage 0] compiler/stage1/build/MonadUtils.o
1000 HC [stage 0] compiler/stage1/build/Lexeme.o
1001 HC [stage 0] libraries/text/dist-boot/build/Data/Text/Internal/Fusion/CaseMapping.o
1002 HC [stage 0] libraries/mtl/dist-boot/build/Control/Monad/RWS.o
1003 HC [stage 0] compiler/stage1/build/Packages.o-boot
1004 HC [stage 0] libraries/template-haskell/dist-boot/build/Language/Haskell/TH/PprLib.o
1005 HC [stage 0] libraries/template-haskell/dist-boot/build/Language/Haskell/TH/Lib/Internal.o
1006 HC [stage 0] libraries/template-haskell/dist-boot/build/Language/Haskell/TH/Quote.o
1007 HC [stage 0] compiler/stage1/build/Pretty.o
1008 HC [stage 0] libraries/template-haskell/dist-boot/build/Language/Haskell/TH/Ppr.o
1009 HC [stage 0] libraries/template-haskell/dist-boot/build/Language/Haskell/TH/Lib.o
1010 HC [stage 0] libraries/text/dist-boot/build/Data/Text/Internal/Fusion/Common.o
1011 HC [stage 0] libraries/template-haskell/dist-boot/build/Language/Haskell/TH.o
1012 HC [stage 0] libraries/binary/dist-boot/build/Data/Binary/Generic.o
1013 HC [stage 0] libraries/binary/dist-boot/build/Data/Binary.o
1014 HC [stage 0] libraries/Cabal/Cabal/dist-boot/build/Distribution/Compat/Binary.o
1015 HC [stage 0] libraries/ghc-boot/dist-boot/build/GHC/PackageDb.o
1016 HC [stage 0] libraries/ghc-boot/dist-boot/build/GHC/LanguageExtensions.o
1017 HC [stage 0] libraries/ghc-boot/dist-boot/build/GHC/ForeignSrcLang.o
1018 HC [stage 0] libraries/ghci/dist-boot/build/GHCi/RemoteTypes.o
1019 HC [stage 0] libraries/ghci/dist-boot/build/GHCi/TH/Binary.o
1020 HC [stage 0] libraries/ghci/dist-boot/build/GHCi/FFI.o
1021 HC [stage 0] libraries/ghci/dist-boot/build/SizedSeq.o
1022 HC [stage 0] libraries/ghci/dist-boot/build/GHCi/BinaryArray.o
1023 HC [stage 0] libraries/text/dist-boot/build/Data/Text/Internal/Fusion.o
1024 HC [stage 0] libraries/Cabal/Cabal/dist-boot/build/Distribution/Compat/Semigroup.o
1025 HC [stage 0] compiler/stage1/build/Outputable.o
1026 HC [stage 0] libraries/ghci/dist-boot/build/GHCi/StaticPtrTable.o
1027 HC [stage 0] libraries/ghci/dist-boot/build/GHCi/ResolvedBCO.o
1028 HC [stage 0] libraries/Cabal/Cabal/dist-boot/build/Distribution/Compat/Prelude.o
1029 HC [stage 0] libraries/Cabal/Cabal/dist-boot/build/Distribution/Compat/ReadP.o
1030 HC [stage 0] libraries/Cabal/Cabal/dist-boot/build/Distribution/Parsec/Common.o
1031 HC [stage 0] libraries/Cabal/Cabal/dist-boot/build/Distribution/Utils/Generic.o
1032 HC [stage 0] libraries/Cabal/Cabal/dist-boot/build/Distribution/Parsec/Field.o
1033 HC [stage 0] libraries/Cabal/Cabal/dist-boot/build/Distribution/CabalSpecVersion.o
1034 HC [stage 0] libraries/Cabal/Cabal/dist-boot/build/Distribution/Pretty.o
1035 HC [stage 0] libraries/Cabal/Cabal/dist-boot/build/Distribution/Compat/DList.o
1036 HC [stage 0] libraries/Cabal/Cabal/dist-boot/build/Distribution/Utils/ShortText.o
1037 HC [stage 0] libraries/Cabal/Cabal/dist-boot/build/Distribution/Compat/CopyFile.o
1038 HC [stage 0] libraries/Cabal/Cabal/dist-boot/build/Distribution/Utils/IOData.o
1039 HC [stage 0] libraries/Cabal/Cabal/dist-boot/build/Distribution/Compat/Graph.o
1040 HC [stage 0] libraries/Cabal/Cabal/dist-boot/build/Distribution/Utils/Progress.o
1041 HC [stage 0] libraries/Cabal/Cabal/dist-boot/build/Distribution/Types/Condition.o
1042 HC [stage 0] libraries/Cabal/Cabal/dist-boot/build/Distribution/Compat/Environment.o
1043 HC [stage 0] libraries/Cabal/Cabal/dist-boot/build/Distribution/Simple/Program/Internal.o
1044 HC [stage 0] libraries/Cabal/Cabal/dist-boot/build/Distribution/Simple/Flag.o
1045 HC [stage 0] libraries/Cabal/Cabal/dist-boot/build/Distribution/GetOpt.o
1046 HC [stage 0] libraries/Cabal/Cabal/dist-boot/build/Distribution/Utils/MapAccum.o
1047 HC [stage 0] libraries/Cabal/Cabal/dist-boot/build/Distribution/Compat/CreatePipe.o
1048 HC [stage 0] libraries/Cabal/Cabal/dist-boot/build/Distribution/Compat/Prelude/Internal.o
1049 HC [stage 0] libraries/Cabal/Cabal/dist-boot/build/Distribution/Simple/CCompiler.o
1050 HC [stage 0] libraries/Cabal/Cabal/dist-boot/build/Distribution/PackageDescription/Quirks.o
1051 HC [stage 0] libraries/Cabal/Cabal/dist-boot/build/Distribution/Compat/GetShortPathName.o
1052 HC [stage 0] libraries/Cabal/Cabal/dist-boot/build/Distribution/TestSuite.o
1053 HC [stage 0] libraries/Cabal/Cabal/dist-boot/build/Distribution/Simple/PreProcess/Unlit.o
1054 HC [stage 0] libraries/Cabal/Cabal/dist-boot/build/Distribution/Compat/SnocList.o
1055 HC [stage 0] compiler/stage1/build/TyCoRep.o-boot
1056 HC [stage 0] compiler/stage1/build/Json.o
1057 HC [stage 0] compiler/stage1/build/Bag.o
1058 HC [stage 0] compiler/stage1/build/IdInfo.o-boot
1059 HC [stage 0] compiler/stage1/build/TcType.o-boot
1060 HC [stage 0] libraries/ghci/dist-boot/build/GHCi/Message.o
1061 HC [stage 0] compiler/stage1/build/ListSetOps.o
1062 HC [stage 0] compiler/stage1/build/StringBuffer.o
1063 HC [stage 0] compiler/stage1/build/Pair.o
1064 HC [stage 0] compiler/stage1/build/OrdList.o
1065 HC [stage 0] compiler/stage1/build/AsmUtils.o
1066 HC [stage 0] libraries/text/dist-boot/build/Data/Text/Show.o
1067 HC [stage 0] libraries/text/dist-boot/build/Data/Text/Internal/Encoding/Fusion/Common.o
1068 HC [stage 0] libraries/Cabal/Cabal/dist-boot/build/Distribution/Compat/Lens.o
1069 HC [stage 0] libraries/Cabal/Cabal/dist-boot/build/Distribution/Parsec/LexerMonad.o
1070 HC [stage 0] libraries/Cabal/Cabal/dist-boot/build/Distribution/Lex.o
1071 HC [stage 0] compiler/stage1/build/SrcLoc.o
1072 HC [stage 0] libraries/Cabal/Cabal/dist-boot/build/Distribution/Types/CondTree.o
1073 HC [stage 0] libraries/Cabal/Cabal/dist-boot/build/Distribution/Parsec/Lexer.o
1074 HC [stage 0] libraries/text/dist-boot/build/Data/Text/Internal/Encoding/Fusion.o
1075 HC [stage 0] libraries/text/dist-boot/build/Data/Text/Internal/Lazy/Encoding/Fusion.o
1076 HC [stage 0] compiler/stage1/build/ErrUtils.o-boot
1077 HC [stage 0] compiler/stage1/build/BasicTypes.o
1078 HC [stage 0] compiler/stage1/build/CmdLineParser.o
1079 HC [stage 0] libraries/text/dist-boot/build/Data/Text/Encoding.o
1080 HC [stage 0] libraries/text/dist-boot/build/Data/Text.o
1081 HC [stage 0] libraries/text/dist-boot/build/Data/Text/Foreign.o
1082 HC [stage 0] compiler/stage1/build/Unique.o
1083 HC [stage 0] compiler/stage1/build/UniqFM.o
1084 HC [stage 0] compiler/stage1/build/UniqSupply.o
1085 HC [stage 0] compiler/stage1/build/RegClass.o
1086 HC [stage 0] compiler/stage1/build/Reg.o
1087 HC [stage 0] compiler/stage1/build/Binary.o
1088 HC [stage 0] compiler/stage1/build/UniqSet.o
1089 HC [stage 0] compiler/stage1/build/UniqDFM.o
1090 HC [stage 0] compiler/stage1/build/Digraph.o
1091 HC [stage 0] compiler/stage1/build/UniqMap.o
1092 HC [stage 0] compiler/stage1/build/GraphBase.o
1093 HC [stage 0] compiler/stage1/build/RegAlloc/Graph/ArchBase.o
1094 HC [stage 0] compiler/stage1/build/UniqDSet.o
1095 HC [stage 0] compiler/stage1/build/FastStringEnv.o
1096 HC [stage 0] compiler/stage1/build/RegAlloc/Graph/TrivColorable.o
1097 HC [stage 0] compiler/stage1/build/GraphPpr.o
1098 HC [stage 0] compiler/stage1/build/GraphOps.o
1099 HC [stage 0] compiler/stage1/build/RegAlloc/Graph/ArchX86.o
1100 HC [stage 0] compiler/stage1/build/GraphColor.o
1101 HC [stage 0] libraries/text/dist-boot/build/Data/Text/Internal/Lazy.o
1102 HC [stage 0] libraries/text/dist-boot/build/Data/Text/Internal/IO.o
1103 HC [stage 0] libraries/text/dist-boot/build/Data/Text/Read.o
1104 HC [stage 0] libraries/text/dist-boot/build/Data/Text/Internal/Lazy/Search.o
1105 HC [stage 0] libraries/text/dist-boot/build/Data/Text/Internal/Lazy/Fusion.o
1106 HC [stage 0] libraries/text/dist-boot/build/Data/Text/Lazy/Internal.o
1107 HC [stage 0] libraries/text/dist-boot/build/Data/Text/Lazy/Encoding.o
1108 HC [stage 0] libraries/text/dist-boot/build/Data/Text/IO.o
1109 HC [stage 0] compiler/stage1/build/Module.o
1110 HC [stage 0] compiler/stage1/build/DriverPhases.o
1111 HC [stage 0] compiler/stage1/build/CostCentreState.o
1112 HC [stage 0] compiler/stage1/build/BooleanFormula.o
1113 HC [stage 0] libraries/text/dist-boot/build/Data/Text/Lazy.o
1114 HC [stage 0] compiler/stage1/build/PrelNames.o-boot
1115 HC [stage 0] compiler/stage1/build/PackageConfig.o
1116 HC [stage 0] compiler/stage1/build/ForeignCall.o
1117 HC [stage 0] compiler/stage1/build/DynFlags.o
1118 HC [stage 0] libraries/parsec/dist-boot/build/Text/Parsec/Prim.o
1119 HC [stage 0] libraries/text/dist-boot/build/Data/Text/Internal/Builder.o
1120 HC [stage 0] libraries/text/dist-boot/build/Data/Text/Lazy/IO.o
1121 HC [stage 0] libraries/text/dist-boot/build/Data/Text/Lazy/Read.o
1122 HC [stage 0] libraries/text/dist-boot/build/Data/Text/Lazy/Builder.o
1123 HC [stage 0] libraries/parsec/dist-boot/build/Text/Parsec/Combinator.o
1124 HC [stage 0] libraries/parsec/dist-boot/build/Text/Parsec/Char.o
1125 HC [stage 0] libraries/parsec/dist-boot/build/Text/Parsec/String.o
1126 HC [stage 0] libraries/parsec/dist-boot/build/Text/Parsec/ByteString.o
1127 HC [stage 0] libraries/parsec/dist-boot/build/Text/Parsec/ByteString/Lazy.o
1128 HC [stage 0] libraries/parsec/dist-boot/build/Text/Parsec/Text.o
1129 HC [stage 0] libraries/parsec/dist-boot/build/Text/Parsec/Text/Lazy.o
1130 HC [stage 0] libraries/parsec/dist-boot/build/Text/ParserCombinators/Parsec/Prim.o
1131 HC [stage 0] libraries/text/dist-boot/build/Data/Text/Internal/Builder/Functions.o
1132 HC [stage 0] libraries/parsec/dist-boot/build/Text/Parsec.o
1133 HC [stage 0] libraries/Cabal/Cabal/dist-boot/build/Distribution/Parsec/Parser.o
1134 HC [stage 0] libraries/parsec/dist-boot/build/Text/Parsec/Token.o
1135 HC [stage 0] libraries/parsec/dist-boot/build/Text/Parsec/Expr.o
1136 HC [stage 0] libraries/parsec/dist-boot/build/Text/ParserCombinators/Parsec/Char.o
1137 HC [stage 0] libraries/parsec/dist-boot/build/Text/ParserCombinators/Parsec/Combinator.o
1138 HC [stage 0] libraries/text/dist-boot/build/Data/Text/Lazy/Builder/Int.o
1139 HC [stage 0] libraries/Cabal/Cabal/dist-boot/build/Distribution/Compat/Parsing.o
1140 HC [stage 0] libraries/Cabal/Cabal/dist-boot/build/Distribution/Parsec/FieldLineStream.o
1141 HC [stage 0] libraries/parsec/dist-boot/build/Text/Parsec/Perm.o
1142 HC [stage 0] libraries/parsec/dist-boot/build/Text/ParserCombinators/Parsec.o
1143 HC [stage 0] libraries/parsec/dist-boot/build/Text/Parsec/Language.o
1144 HC [stage 0] libraries/parsec/dist-boot/build/Text/ParserCombinators/Parsec/Perm.o
1145 HC [stage 0] libraries/parsec/dist-boot/build/Text/ParserCombinators/Parsec/Token.o
1146 HC [stage 0] libraries/Cabal/Cabal/dist-boot/build/Distribution/Compat/CharParsing.o
1147 HC [stage 0] libraries/parsec/dist-boot/build/Text/ParserCombinators/Parsec/Expr.o
1148 HC [stage 0] libraries/parsec/dist-boot/build/Text/ParserCombinators/Parsec/Language.o
1149 HC [stage 0] libraries/Cabal/Cabal/dist-boot/build/Distribution/Parsec/Class.o
1150 HC [stage 0] libraries/Cabal/Cabal/dist-boot/build/Distribution/Text.o
1151 HC [stage 0] libraries/Cabal/Cabal/dist-boot/build/Distribution/SPDX/LicenseReference.o
1152 HC [stage 0] libraries/Cabal/Cabal/dist-boot/build/Distribution/SPDX/LicenseId.o
1153 HC [stage 0] libraries/Cabal/Cabal/dist-boot/build/Distribution/SPDX/LicenseExceptionId.o
1154 HC [stage 0] libraries/Cabal/Cabal/dist-boot/build/Distribution/ReadE.o
1155 HC [stage 0] libraries/Cabal/Cabal/dist-boot/build/Distribution/FieldGrammar/Class.o
1156 HC [stage 0] libraries/Cabal/Cabal/dist-boot/build/Language/Haskell/Extension.o
1157 HC [stage 0] libraries/Cabal/Cabal/dist-boot/build/Distribution/Types/Version.o
1158 HC [stage 0] libraries/Cabal/Cabal/dist-boot/build/Distribution/ModuleName.o
1159 HC [stage 0] libraries/Cabal/Cabal/dist-boot/build/Distribution/Verbosity.o
1160 HC [stage 0] libraries/Cabal/Cabal/dist-boot/build/Distribution/System.o
1161 HC [stage 0] libraries/Cabal/Cabal/dist-boot/build/Distribution/Types/ComponentId.o
1162 HC [stage 0] libraries/Cabal/Cabal/dist-boot/build/Distribution/Types/PkgconfigName.o
1163 HC [stage 0] libraries/Cabal/Cabal/dist-boot/build/Distribution/Types/AbiHash.o
1164 HC [stage 0] libraries/Cabal/Cabal/dist-boot/build/Distribution/Types/ExecutableScope.o
1165 HC [stage 0] libraries/Cabal/Cabal/dist-boot/build/Distribution/Types/ForeignLibType.o
1166 HC [stage 0] libraries/Cabal/Cabal/dist-boot/build/Distribution/Types/ForeignLibOption.o
1167 HC [stage 0] libraries/Cabal/Cabal/dist-boot/build/Distribution/Types/SourceRepo.o
1168 HC [stage 0] libraries/Cabal/Cabal/dist-boot/build/Distribution/Types/BuildType.o
1169 HC [stage 0] libraries/text/dist-boot/build/Data/Text/Lazy/Builder/RealFloat.o
1170 HC [stage 0] libraries/Cabal/Cabal/dist-boot/build/Distribution/Types/VersionRange.o
1171 HC [stage 0] libraries/Cabal/Cabal/dist-boot/build/Distribution/Types/ModuleRenaming.o
1172 HC [stage 0] libraries/Cabal/Cabal/dist-boot/build/Distribution/Types/SourceRepo/Lens.o
1173 HC [stage 0] libraries/Cabal/Cabal/dist-boot/build/Distribution/Types/IncludeRenaming.o
1174 HC [stage 0] libraries/Cabal/Cabal/dist-boot/build/Distribution/Types/VersionInterval.o
1175 HC [stage 0] libraries/Cabal/Cabal/dist-boot/build/Distribution/Version.o
1176 HC [stage 0] libraries/Cabal/Cabal/dist-boot/build/Distribution/Compiler.o
1177 HC [stage 0] libraries/Cabal/Cabal/dist-boot/build/Distribution/Parsec/ParseResult.o
1178 HC [stage 0] libraries/Cabal/Cabal/dist-boot/build/Distribution/Types/PkgconfigDependency.o
1179 HC [stage 0] libraries/Cabal/Cabal/dist-boot/build/Distribution/Types/BenchmarkType.o
1180 HC [stage 0] libraries/Cabal/Cabal/dist-boot/build/Distribution/Types/TestType.o
1181 HC [stage 0] libraries/Cabal/Cabal/dist-boot/build/Distribution/Types/BenchmarkInterface.o
1182 HC [stage 0] libraries/Cabal/Cabal/dist-boot/build/Distribution/Types/TestSuiteInterface.o
1183 HC [stage 0] libraries/Cabal/Cabal/dist-boot/build/Distribution/SPDX/LicenseExpression.o
1184 HC [stage 0] libraries/Cabal/Cabal/dist-boot/build/Distribution/SPDX/License.o
1185 HC [stage 0] libraries/Cabal/Cabal/dist-boot/build/Distribution/SPDX.o
1186 HC [stage 0] libraries/Cabal/Cabal/dist-boot/build/Distribution/License.o
1187 HC [stage 0] libraries/Cabal/Cabal/dist-boot/build/Distribution/Parsec/Newtypes.o
1188 HC [stage 0] libraries/Cabal/Cabal/dist-boot/build/Distribution/ParseUtils.o
1189 HC [stage 0] libraries/Cabal/Cabal/dist-boot/build/Distribution/Types/PackageName.o
1190 HC [stage 0] libraries/Cabal/Cabal/dist-boot/build/Distribution/Types/LegacyExeDependency.o
1191 HC [stage 0] libraries/Cabal/Cabal/dist-boot/build/Distribution/PrettyUtils.o
1192 HC [stage 0] libraries/Cabal/Cabal/dist-boot/build/Distribution/Types/PackageId.o
1193 HC [stage 0] libraries/Cabal/Cabal/dist-boot/build/Distribution/Types/UnqualComponentName.o
1194 HC [stage 0] libraries/Cabal/Cabal/dist-boot/build/Distribution/Types/Mixin.o
1195 HC [stage 0] libraries/Cabal/Cabal/dist-boot/build/Distribution/Types/ModuleReexport.o
1196 HC [stage 0] libraries/Cabal/Cabal/dist-boot/build/Distribution/Types/MungedPackageName.o
1197 HC [stage 0] libraries/Cabal/Cabal/dist-boot/build/Distribution/Types/ComponentName.o
1198 HC [stage 0] libraries/Cabal/Cabal/dist-boot/build/Distribution/Simple/Utils.o
1199 HC [stage 0] libraries/Cabal/Cabal/dist-boot/build/Distribution/Types/UnitId.o
1200 HC [stage 0] libraries/Cabal/Cabal/dist-boot/build/Distribution/Types/Dependency.o
1201 HC [stage 0] libraries/Cabal/Cabal/dist-boot/build/Distribution/Types/PackageId/Lens.o
1202 HC [stage 0] libraries/Cabal/Cabal/dist-boot/build/Distribution/Types/ExeDependency.o
1203 HC [stage 0] libraries/Cabal/Cabal/dist-boot/build/Distribution/Simple/GHC/IPIConvert.o
1204 HC [stage 0] libraries/Cabal/Cabal/dist-boot/build/Distribution/Types/MungedPackageId.o
1205 HC [stage 0] libraries/Cabal/Cabal/dist-boot/build/Distribution/Types/Module.o
1206 HC [stage 0] libraries/Cabal/Cabal/dist-boot/build/Distribution/Types/SetupBuildInfo.o
1207 HC [stage 0] libraries/Cabal/Cabal/dist-boot/build/Distribution/Types/DependencyMap.o
1208 HC [stage 0] libraries/Cabal/Cabal/dist-boot/build/Distribution/Backpack.o
1209 HC [stage 0] libraries/Cabal/Cabal/dist-boot/build/Distribution/Package.o
1210 HC [stage 0] libraries/Cabal/Cabal/dist-boot/build/Distribution/Types/BuildInfo.o
1211 HC [stage 0] libraries/Cabal/Cabal/dist-boot/build/Distribution/Types/SetupBuildInfo/Lens.o
1212 HC [stage 0] libraries/Cabal/Cabal/dist-boot/build/Distribution/Types/AbiDependency.o
1213 HC [stage 0] libraries/Cabal/Cabal/dist-boot/build/Distribution/FieldGrammar/Pretty.o
1214 HC [stage 0] libraries/Cabal/Cabal/dist-boot/build/Distribution/FieldGrammar/Parsec.o
1215 HC [stage 0] libraries/Cabal/Cabal/dist-boot/build/Distribution/Utils/LogProgress.o
1216 HC [stage 0] libraries/Cabal/Cabal/dist-boot/build/Distribution/Types/AnnotatedId.o
1217 HC [stage 0] libraries/Cabal/Cabal/dist-boot/build/Distribution/Simple/Compiler.o
1218 HC [stage 0] libraries/Cabal/Cabal/dist-boot/build/Distribution/Simple/InstallDirs.o
1219 HC [stage 0] libraries/Cabal/Cabal/dist-boot/build/Distribution/Utils/NubList.o
1220 HC [stage 0] libraries/Cabal/Cabal/dist-boot/build/Distribution/Simple/Program/Find.o
1221 HC [stage 0] libraries/Cabal/Cabal/dist-boot/build/Distribution/Simple/Command.o
1222 HC [stage 0] libraries/Cabal/Cabal/dist-boot/build/Distribution/Backpack/DescribeUnitId.o
1223 HC [stage 0] libraries/Cabal/Cabal/dist-boot/build/Distribution/Compat/Time.o
1224 HC [stage 0] libraries/Cabal/Cabal/dist-boot/build/Distribution/Simple/Glob.o
1225 HC [stage 0] libraries/Cabal/Cabal/dist-boot/build/Distribution/Simple/Program/ResponseFile.o
1226 HC [stage 0] libraries/Cabal/Cabal/dist-boot/build/Distribution/Types/ExposedModule.o
1227 HC [stage 0] libraries/Cabal/Cabal/dist-boot/build/Distribution/FieldGrammar.o
1228 HC [stage 0] libraries/Cabal/Cabal/dist-boot/build/Distribution/Types/ComponentInclude.o
1229 HC [stage 0] libraries/Cabal/Cabal/dist-boot/build/Distribution/Types/BuildInfo/Lens.o
1230 HC [stage 0] libraries/Cabal/Cabal/dist-boot/build/Distribution/Types/HookedBuildInfo.o
1231 HC [stage 0] libraries/Cabal/Cabal/dist-boot/build/Distribution/Simple/GHC/ImplInfo.o
1232 HC [stage 0] libraries/Cabal/Cabal/dist-boot/build/Distribution/Backpack/ModSubst.o
1233 HC [stage 0] libraries/Cabal/Cabal/dist-boot/build/Distribution/Backpack/FullUnitId.o
1234 HC [stage 0] libraries/Cabal/Cabal/dist-boot/build/Distribution/Types/InstalledPackageInfo.o
1235 HC [stage 0] libraries/Cabal/Cabal/dist-boot/build/Distribution/FieldGrammar/FieldDescrs.o
1236 HC [stage 0] libraries/Cabal/Cabal/dist-boot/build/Distribution/Backpack/ModuleScope.o
1237 HC [stage 0] libraries/Cabal/Cabal/dist-boot/build/Distribution/Types/Benchmark.o
1238 HC [stage 0] libraries/Cabal/Cabal/dist-boot/build/Distribution/Types/TestSuite.o
1239 HC [stage 0] libraries/Cabal/Cabal/dist-boot/build/Distribution/Types/Executable.o
1240 HC [stage 0] libraries/Cabal/Cabal/dist-boot/build/Distribution/Types/ForeignLib.o
1241 HC [stage 0] libraries/Cabal/Cabal/dist-boot/build/Distribution/Types/Library.o
1242 HC [stage 0] libraries/Cabal/Cabal/dist-boot/build/Distribution/Types/TestSuite/Lens.o
1243 HC [stage 0] libraries/Cabal/Cabal/dist-boot/build/Distribution/Types/Executable/Lens.o
1244 HC [stage 0] libraries/Cabal/Cabal/dist-boot/build/Distribution/Types/Benchmark/Lens.o
1245 HC [stage 0] libraries/Cabal/Cabal/dist-boot/build/Distribution/Types/InstalledPackageInfo/Lens.o
1246 HC [stage 0] libraries/Cabal/Cabal/dist-boot/build/Distribution/Types/Library/Lens.o
1247 HC [stage 0] libraries/Cabal/Cabal/dist-boot/build/Distribution/Types/Component.o
1248 HC [stage 0] libraries/Cabal/Cabal/dist-boot/build/Distribution/Types/ForeignLib/Lens.o
1249 HC [stage 0] libraries/Cabal/Cabal/dist-boot/build/Distribution/Types/InstalledPackageInfo/FieldGrammar.o
1250 HC [stage 0] libraries/Cabal/Cabal/dist-boot/build/Distribution/Types/ComponentRequestedSpec.o
1251 HC [stage 0] libraries/Cabal/Cabal/dist-boot/build/Distribution/InstalledPackageInfo.o
1252 HC [stage 0] libraries/Cabal/Cabal/dist-boot/build/Distribution/Types/PackageDescription.o
1253 HC [stage 0] libraries/Cabal/Cabal/dist-boot/build/Distribution/Simple/PackageIndex.o
1254 HC [stage 0] libraries/Cabal/Cabal/dist-boot/build/Distribution/Backpack/ModuleShape.o
1255 HC [stage 0] libraries/Cabal/Cabal/dist-boot/build/Distribution/Simple/GHC/IPI642.o
1256 HC [stage 0] libraries/Cabal/Cabal/dist-boot/build/Distribution/Backpack/PreModuleShape.o
1257 HC [stage 0] libraries/Cabal/Cabal/dist-boot/build/Distribution/Backpack/PreExistingComponent.o
1258 HC [stage 0] utils/ghc-pkg/dist/build/Main.o
1259 HC [stage 0] libraries/Cabal/Cabal/dist-boot/build/Distribution/Types/GenericPackageDescription.o
1260 HC [stage 0] libraries/Cabal/Cabal/dist-boot/build/Distribution/Types/PackageDescription/Lens.o
1261 HC [stage 0] libraries/Cabal/Cabal/dist-boot/build/Distribution/PackageDescription.o
1262 HC [stage 0] libraries/Cabal/Cabal/dist-boot/build/Distribution/Types/GenericPackageDescription/Lens.o
1263 HC [stage 0] libraries/Cabal/Cabal/dist-boot/build/Distribution/Parsec/ConfVar.o
1264 HC [stage 0] libraries/Cabal/Cabal/dist-boot/build/Distribution/Types/ComponentLocalBuildInfo.o
1265 HC [stage 0] libraries/Cabal/Cabal/dist-boot/build/Distribution/Simple/Program/Types.o
1266 HC [stage 0] libraries/Cabal/Cabal/dist-boot/build/Distribution/Simple/BuildToolDepends.o
1267 HC [stage 0] libraries/Cabal/Cabal/dist-boot/build/Distribution/Backpack/UnifyM.o
1268 HC [stage 0] libraries/Cabal/Cabal/dist-boot/build/Distribution/PackageDescription/Configuration.o
1269 HC [stage 0] libraries/Cabal/Cabal/dist-boot/build/Distribution/Types/Lens.o
1270 HC [stage 0] libraries/Cabal/Cabal/dist-boot/build/Distribution/Simple/Program/Run.o
1271 HC [stage 0] libraries/Cabal/Cabal/dist-boot/build/Distribution/PackageDescription/FieldGrammar.o
1272 HC [stage 0] libraries/Cabal/Cabal/dist-boot/build/Distribution/Types/TargetInfo.o
1273 HC [stage 0] libraries/Cabal/Cabal/dist-boot/build/Distribution/Backpack/MixLink.o
1274 HC [stage 0] libraries/Cabal/Cabal/dist-boot/build/Distribution/Simple/Program/GHC.o
1275 HC [stage 0] libraries/Cabal/Cabal/dist-boot/build/Distribution/Simple/Program/HcPkg.o
1276 HC [stage 0] libraries/Cabal/Cabal/dist-boot/build/Distribution/Simple/Program/Script.o
1277 HC [stage 0] libraries/Cabal/Cabal/dist-boot/build/Distribution/Simple/Program/Hpc.o
1278 HC [stage 0] libraries/Cabal/Cabal/dist-boot/build/Distribution/PackageDescription/Parsec.o
1279 HC [stage 0] libraries/Cabal/Cabal/dist-boot/build/Distribution/PackageDescription/PrettyPrint.o
1280 HC [stage 0] libraries/Cabal/Cabal/dist-boot/build/Distribution/Simple/Program/Builtin.o
1281 HC [stage 0] libraries/Cabal/Cabal/dist-boot/build/Distribution/Simple/Program/Db.o
1282 HC [stage 0] libraries/Cabal/Cabal/dist-boot/build/Distribution/Simple/Program.o
1283 HC [stage 0] libraries/Cabal/Cabal/dist-boot/build/Distribution/Simple/Setup.o
1284 HC [stage 0] libraries/Cabal/Cabal/dist-boot/build/Distribution/Simple/Program/Strip.o
1285 HC [stage 0] libraries/Cabal/Cabal/dist-boot/build/Distribution/Types/LocalBuildInfo.o
1286 HC [stage 0] libraries/Cabal/Cabal/dist-boot/build/Distribution/Make.o
1287 HC [stage 0] libraries/Cabal/Cabal/dist-boot/build/Distribution/Simple/LocalBuildInfo.o
1288 HC [stage 0] libraries/Cabal/Cabal/dist-boot/build/Distribution/Backpack/Id.o
1289 HC [stage 0] libraries/Cabal/Cabal/dist-boot/build/Distribution/Backpack/ComponentsGraph.o
1290 HC [stage 0] libraries/Cabal/Cabal/dist-boot/build/Distribution/Simple/BuildPaths.o
1291 HC [stage 0] libraries/Cabal/Cabal/dist-boot/build/Distribution/Simple/Program/Ld.o
1292 HC [stage 0] libraries/Cabal/Cabal/dist-boot/build/Distribution/Simple/Program/Ar.o
1293 HC [stage 0] libraries/Cabal/Cabal/dist-boot/build/Distribution/Simple/Hpc.o
1294 HC [stage 0] libraries/Cabal/Cabal/dist-boot/build/Distribution/Simple/BuildTarget.o
1295 HC [stage 0] libraries/Cabal/Cabal/dist-boot/build/Distribution/Simple/Test/Log.o
1296 HC [stage 0] libraries/Cabal/Cabal/dist-boot/build/Distribution/Simple/Build/Macros.o
1297 HC [stage 0] libraries/Cabal/Cabal/dist-boot/build/Distribution/Backpack/ConfiguredComponent.o
1298 HC [stage 0] libraries/Cabal/Cabal/dist-boot/build/Distribution/PackageDescription/Check.o
1299 HC [stage 0] libraries/Cabal/Cabal/dist-boot/build/Distribution/Simple/HaskellSuite.o
1300 HC [stage 0] libraries/Cabal/Cabal/dist-boot/build/Distribution/Simple/UHC.o
1301 HC [stage 0] libraries/Cabal/Cabal/dist-boot/build/Distribution/Simple/GHC/Internal.o
1302 HC [stage 0] libraries/Cabal/Cabal/dist-boot/build/Distribution/Simple/Build/PathsModule.o
1303 HC [stage 0] libraries/Cabal/Cabal/dist-boot/build/Distribution/Backpack/LinkedComponent.o
1304 HC [stage 0] libraries/Cabal/Cabal/dist-boot/build/Distribution/Simple/Test/LibV09.o
1305 HC [stage 0] libraries/Cabal/Cabal/dist-boot/build/Distribution/Simple/Test/ExeV10.o
1306 HC [stage 0] libraries/Cabal/Cabal/dist-boot/build/Distribution/Backpack/ReadyComponent.o
1307 HC [stage 0] libraries/Cabal/Cabal/dist-boot/build/Distribution/Simple/GHCJS.o
1308 HC [stage 0] libraries/Cabal/Cabal/dist-boot/build/Distribution/Simple/GHC.o
1309 HC [stage 0] libraries/Cabal/Cabal/dist-boot/build/Distribution/Simple/PreProcess.o
1310 HC [stage 0] libraries/Cabal/Cabal/dist-boot/build/Distribution/Backpack/Configure.o
1311 HC [stage 0] libraries/Cabal/Cabal/dist-boot/build/Distribution/Simple/UserHooks.o
1312 HC [stage 0] libraries/Cabal/Cabal/dist-boot/build/Distribution/Simple/SrcDist.o
1313 HC [stage 0] libraries/Cabal/Cabal/dist-boot/build/Distribution/Simple/Test.o
1314 HC [stage 0] libraries/Cabal/Cabal/dist-boot/build/Distribution/Simple/Bench.o
1315 HC [stage 0] libraries/Cabal/Cabal/dist-boot/build/Distribution/Simple/Register.o
1316 HC [stage 0] libraries/Cabal/Cabal/dist-boot/build/Distribution/Simple/Configure.o
1317 HC [stage 0] libraries/Cabal/Cabal/dist-boot/build/Distribution/Simple/Install.o
1318 HC [stage 0] libraries/Cabal/Cabal/dist-boot/build/Distribution/Simple/Build.o
1319 HC [stage 0] libraries/Cabal/Cabal/dist-boot/build/Distribution/Simple/Doctest.o
1320 HC [stage 0] libraries/Cabal/Cabal/dist-boot/build/Distribution/Simple/Haddock.o
1321 HC [stage 0] libraries/Cabal/Cabal/dist-boot/build/Distribution/Simple.o
1322 HC [stage 0] compiler/stage1/build/OccName.o
1323 HC [stage 0] compiler/stage1/build/ErrUtils.o
1324 HC [stage 0] compiler/stage1/build/IOEnv.o
1325 HC [stage 0] compiler/stage1/build/CmmType.o
1326 HC [stage 0] compiler/stage1/build/SMRep.o
1327 HC [stage 0] compiler/stage1/build/SPARC/Base.o
1328 HC [stage 0] compiler/stage1/build/RegAlloc/Linear/StackMap.o
1329 HC [stage 0] utils/ghc-pkg/dist/build/tmp/ghc-pkg
1330 HC [stage 0] compiler/stage1/build/CoreMonad.o-boot
1331 HC [stage 0] compiler/stage1/build/CmmMachOp.o
1332 HC [stage 0] compiler/stage1/build/Name.o
1333Reading package info from "rts/dist/package.conf.inplace" ... done.
1334 HC [stage 0] compiler/stage1/build/Bitmap.o
1335 HC [stage 0] compiler/stage1/build/CPrim.o
1336 HC [stage 0] compiler/stage1/build/FileCleanup.o
1337 HC [stage 0] compiler/stage1/build/Elf.o
1338 HC [stage 0] compiler/stage1/build/LlvmMangler.o
1339 HC [stage 0] compiler/stage1/build/BinFingerprint.o
1340 HC [stage 0] compiler/stage1/build/Var.o
1341 HC [stage 0] compiler/stage1/build/NameEnv.o
1342 HC [stage 0] compiler/stage1/build/FieldLabel.o
1343 HC [stage 0] compiler/stage1/build/NameSet.o
1344 HC [stage 0] compiler/stage1/build/KnownUniques.o-boot
1345 HC [stage 0] compiler/stage1/build/HsDoc.o
1346 HC [stage 0] compiler/stage1/build/Annotations.o
1347 HC [stage 0] compiler/stage1/build/Packages.o
1348 HC [stage 0] compiler/stage1/build/SysTools/Process.o
1349 HC [stage 0] compiler/stage1/build/VarSet.o
1350 HC [stage 0] compiler/stage1/build/Avail.o
1351 HC [stage 0] compiler/stage1/build/PatSyn.o-boot
1352 HC [stage 0] compiler/stage1/build/DataCon.o-boot
1353 HC [stage 0] compiler/stage1/build/Class.o
1354 HC [stage 0] compiler/stage1/build/TysWiredIn.o-boot
1355 HC [stage 0] compiler/stage1/build/CoAxiom.o
1356 HC [stage 0] compiler/stage1/build/IfaceType.o-boot
1357 HC [stage 0] compiler/stage1/build/CostCentre.o
1358 HC [stage 0] compiler/stage1/build/SysTools/Info.o
1359 HC [stage 0] compiler/stage1/build/VarEnv.o
1360 HC [stage 0] compiler/stage1/build/RdrName.o
1361 HC [stage 0] compiler/stage1/build/FV.o
1362 HC [stage 0] compiler/stage1/build/ConLike.o-boot
1363 HC [stage 0] compiler/stage1/build/MkId.o-boot
1364 HC [stage 0] compiler/stage1/build/Coercion.o-boot
1365 HC [stage 0] compiler/stage1/build/PrelNames.o
1366 HC [stage 0] compiler/stage1/build/PlaceHolder.o
1367 HC [stage 0] compiler/stage1/build/ApiAnnotation.o
1368 HC [stage 0] compiler/stage1/build/HsExtension.o
1369 HC [stage 0] compiler/stage1/build/HsImpExp.o
1370 HC [stage 0] compiler/stage1/build/HsPat.o-boot
1371 HC [stage 0] compiler/stage1/build/HsExpr.o-boot
1372 HC [stage 0] compiler/stage1/build/Lexer.o
1373 HC [stage 0] compiler/stage1/build/TyCon.o
1374 HC [stage 0] compiler/stage1/build/THNames.o
1375 HC [stage 0] compiler/stage1/build/ToIface.o-boot
1376 HC [stage 0] compiler/stage1/build/Type.o-boot
1377 HC [stage 0] compiler/stage1/build/IfaceType.o
1378 HC [stage 0] compiler/stage1/build/TcTypeNats.o-boot
1379 HC [stage 0] compiler/stage1/build/TyCoRep.o
1380 HC [stage 0] compiler/stage1/build/CmmMonad.o
1381 HC [stage 0] compiler/stage1/build/TysPrim.o
1382 HC [stage 0] compiler/stage1/build/Kind.o
1383 HC [stage 0] compiler/stage1/build/Type.o
1384 HC [stage 0] compiler/stage1/build/Coercion.o
1385 HC [stage 0] compiler/stage1/build/PatSyn.o
1386 HC [stage 0] compiler/stage1/build/Literal.o
1387 HC [stage 0] compiler/stage1/build/HsLit.o
1388 HC [stage 0] compiler/stage1/build/TrieMap.o
1389 HC [stage 0] compiler/stage1/build/Hoopl/Label.o
1390 HC [stage 0] compiler/stage1/build/Unify.o
1391 HC [stage 0] compiler/stage1/build/Hoopl/Graph.o
1392 HC [stage 0] compiler/stage1/build/BlockId.o-boot
1393 HC [stage 0] compiler/stage1/build/CmmSwitch.o
1394 HC [stage 0] compiler/stage1/build/DataCon.o
1395 HC [stage 0] compiler/stage1/build/RepType.o
1396 HC [stage 0] compiler/stage1/build/Demand.o
1397 HC [stage 0] compiler/stage1/build/CoreSyn.o
1398 HC [stage 0] compiler/stage1/build/ConLike.o
1399 HC [stage 0] compiler/stage1/build/IdInfo.o
1400 HC [stage 0] compiler/stage1/build/CoreMap.o
1401 HC [stage 0] compiler/stage1/build/Id.o
1402 HC [stage 0] compiler/stage1/build/TysWiredIn.o
1403 HC [stage 0] compiler/stage1/build/CoreStats.o
1404 HC [stage 0] compiler/stage1/build/HsTypes.o
1405 HC [stage 0] compiler/stage1/build/InteractiveEvalTypes.o
1406 HC [stage 0] compiler/stage1/build/CoreSeq.o
1407 HC [stage 0] compiler/stage1/build/UnVarGraph.o
1408 HC [stage 0] compiler/stage1/build/FamInstEnv.o
1409 HC [stage 0] compiler/stage1/build/PprCore.o
1410 HC [stage 0] compiler/stage1/build/IfaceSyn.o
1411 HC [stage 0] compiler/stage1/build/CoreFVs.o
1412 HC [stage 0] compiler/stage1/build/NameCache.o
1413 HC [stage 0] compiler/stage1/build/PrimOp.o
1414 HC [stage 0] compiler/stage1/build/KnownUniques.o
1415 HC [stage 0] compiler/stage1/build/TcType.o
1416 HC [stage 0] compiler/stage1/build/TcEvidence.o
1417 HC [stage 0] compiler/stage1/build/InstEnv.o
1418 HC [stage 0] compiler/stage1/build/OptCoercion.o
1419 HC [stage 0] compiler/stage1/build/HsBinds.o
1420 HC [stage 0] compiler/stage1/build/HsPat.o
1421 HC [stage 0] compiler/stage1/build/HsDecls.o
1422 HC [stage 0] compiler/stage1/build/ByteCodeTypes.o
1423 HC [stage 0] compiler/stage1/build/CoreUtils.o
1424 HC [stage 0] compiler/stage1/build/CLabel.o
1425 HC [stage 0] compiler/stage1/build/StgSyn.o
1426 HC [stage 0] compiler/stage1/build/HsExpr.o
1427 HC [stage 0] compiler/stage1/build/StgCse.o
1428 HC [stage 0] compiler/stage1/build/StgStats.o
1429 HC [stage 0] compiler/stage1/build/StgLint.o
1430 HC [stage 0] compiler/stage1/build/BlockId.o
1431 HC [stage 0] compiler/stage1/build/ProfInit.o
1432 HC [stage 0] compiler/stage1/build/CmmExpr.o
1433 HC [stage 0] compiler/stage1/build/CoreSubst.o
1434 HC [stage 0] compiler/stage1/build/Exitify.o
1435 HC [stage 0] compiler/stage1/build/SAT.o
1436 HC [stage 0] compiler/stage1/build/CodeGen/Platform/NoRegs.o
1437 HC [stage 0] compiler/stage1/build/CodeGen/Platform/X86_64.o
1438 HC [stage 0] compiler/stage1/build/CodeGen/Platform/X86.o
1439 HC [stage 0] compiler/stage1/build/CodeGen/Platform/SPARC.o
1440 HC [stage 0] compiler/stage1/build/CodeGen/Platform/PPC_Darwin.o
1441 HC [stage 0] compiler/stage1/build/CodeGen/Platform/PPC.o
1442 HC [stage 0] compiler/stage1/build/CodeGen/Platform/ARM64.o
1443 HC [stage 0] compiler/stage1/build/CodeGen/Platform/ARM.o
1444 HC [stage 0] compiler/stage1/build/PprCmmExpr.o
1445 HC [stage 0] compiler/stage1/build/CmmLex.o
1446 HC [stage 0] compiler/stage1/build/CoreArity.o
1447 HC [stage 0] compiler/stage1/build/CSE.o
1448 HC [stage 0] compiler/stage1/build/CodeGen/Platform.o
1449 HC [stage 0] compiler/stage1/build/CmmNode.o
1450 HC [stage 0] compiler/stage1/build/OccurAnal.o
1451 HC [stage 0] compiler/stage1/build/CoreTidy.o
1452 HC [stage 0] compiler/stage1/build/CallArity.o
1453 HC [stage 0] compiler/stage1/build/Cmm.o
1454 HC [stage 0] compiler/stage1/build/PprCmmDecl.o
1455 HC [stage 0] compiler/stage1/build/CmmUtils.o
1456 HC [stage 0] compiler/stage1/build/Hoopl/Dataflow.o
1457 HC [stage 0] compiler/stage1/build/PprBase.o
1458 HC [stage 0] compiler/stage1/build/X86/Regs.o
1459 HC [stage 0] compiler/stage1/build/Format.o
1460 HC [stage 0] compiler/stage1/build/Instruction.o
1461 HC [stage 0] compiler/stage1/build/SPARC/Imm.o
1462 HC [stage 0] compiler/stage1/build/StgCmmClosure.o
1463 HC [stage 0] compiler/stage1/build/HsInstances.o
1464 HC [stage 0] compiler/stage1/build/HsUtils.o
1465 HC [stage 0] compiler/stage1/build/CoreOpt.o
1466 HC [stage 0] compiler/stage1/build/CmmLive.o
1467 HC [stage 0] compiler/stage1/build/Llvm/Types.o
1468 HC [stage 0] compiler/stage1/build/Dwarf/Constants.o
1469 HC [stage 0] compiler/stage1/build/SPARC/Regs.o
1470 HC [stage 0] compiler/stage1/build/PPC/Regs.o
1471 HC [stage 0] compiler/stage1/build/X86/RegInfo.o
1472 HC [stage 0] compiler/stage1/build/RegAlloc/Linear/X86_64/FreeRegs.o
1473 HC [stage 0] compiler/stage1/build/RegAlloc/Linear/X86/FreeRegs.o
1474 HC [stage 0] compiler/stage1/build/SPARC/AddrMode.o
1475 HC [stage 0] compiler/stage1/build/StgCmmArgRep.o
1476 HC [stage 0] compiler/stage1/build/CoreUnfold.o
1477 HC [stage 0] compiler/stage1/build/Rules.o
1478 HC [stage 0] compiler/stage1/build/PprCmm.o
1479 HC [stage 0] compiler/stage1/build/CgUtils.o
1480 HC [stage 0] compiler/stage1/build/CmmOpt.o
1481 HC [stage 0] compiler/stage1/build/Debug.o
1482 HC [stage 0] compiler/stage1/build/TargetReg.o
1483 HC [stage 0] compiler/stage1/build/CmmInfo.o
1484 HC [stage 0] compiler/stage1/build/RegAlloc/Linear/SPARC/FreeRegs.o
1485 HC [stage 0] compiler/stage1/build/RegAlloc/Linear/PPC/FreeRegs.o
1486 HC [stage 0] compiler/stage1/build/SPARC/Stack.o
1487 HC [stage 0] compiler/stage1/build/CmmContFlowOpt.o
1488 HC [stage 0] compiler/stage1/build/CmmImplementSwitchPlans.o
1489 HC [stage 0] compiler/stage1/build/CmmLint.o
1490 HC [stage 0] compiler/stage1/build/PprC.o
1491 HC [stage 0] compiler/stage1/build/Llvm/MetaData.o
1492 HC [stage 0] compiler/stage1/build/Dwarf/Types.o
1493 HC [stage 0] compiler/stage1/build/NCGMonad.o
1494 HC [stage 0] compiler/stage1/build/X86/Instr.o
1495 HC [stage 0] compiler/stage1/build/PPC/Instr.o
1496 HC [stage 0] compiler/stage1/build/RegAlloc/Liveness.o
1497 HC [stage 0] compiler/stage1/build/SPARC/Instr.o
1498 HC [stage 0] compiler/stage1/build/CmmSink.o
1499 HC [stage 0] compiler/stage1/build/CmmCallConv.o
1500 HC [stage 0] compiler/stage1/build/CmmProcPoint.o
1501 HC [stage 0] compiler/stage1/build/CmmCommonBlockElim.o
1502 HC [stage 0] compiler/stage1/build/LiberateCase.o
1503 HC [stage 0] compiler/stage1/build/Llvm/AbsSyn.o
1504 HC [stage 0] compiler/stage1/build/PIC.o
1505 HC [stage 0] compiler/stage1/build/RegAlloc/Graph/SpillCost.o
1506 HC [stage 0] compiler/stage1/build/RegAlloc/Graph/Spill.o
1507 HC [stage 0] compiler/stage1/build/RegAlloc/Graph/SpillClean.o
1508 HC [stage 0] compiler/stage1/build/RegAlloc/Linear/FreeRegs.o
1509 HC [stage 0] compiler/stage1/build/RegAlloc/Linear/Base.o
1510 HC [stage 0] compiler/stage1/build/PPC/Ppr.o
1511 HC [stage 0] compiler/stage1/build/PPC/RegInfo.o
1512 HC [stage 0] compiler/stage1/build/SPARC/Ppr.o
1513 HC [stage 0] compiler/stage1/build/SPARC/ShortcutJump.o
1514 HC [stage 0] compiler/stage1/build/SPARC/CodeGen/Base.o
1515 HC [stage 0] compiler/stage1/build/X86/Ppr.o
1516 HC [stage 0] compiler/stage1/build/MkGraph.o
1517 HC [stage 0] compiler/stage1/build/RegAlloc/Graph/Coalesce.o
1518 HC [stage 0] compiler/stage1/build/Llvm/PpLlvm.o
1519 HC [stage 0] compiler/stage1/build/Dwarf.o
1520 HC [stage 0] compiler/stage1/build/RegAlloc/Graph/Stats.o
1521 HC [stage 0] compiler/stage1/build/RegAlloc/Linear/Stats.o
1522 HC [stage 0] compiler/stage1/build/PPC/CodeGen.o
1523 HC [stage 0] compiler/stage1/build/SPARC/CodeGen/Expand.o
1524 HC [stage 0] compiler/stage1/build/SPARC/CodeGen/Gen32.o-boot
1525 HC [stage 0] compiler/stage1/build/SPARC/CodeGen/Sanity.o
1526 HC [stage 0] compiler/stage1/build/X86/CodeGen.o
1527 HC [stage 0] compiler/stage1/build/StgCmmMonad.o
1528 HC [stage 0] compiler/stage1/build/Llvm.o
1529 HC [stage 0] compiler/stage1/build/RegAlloc/Graph/Main.o
1530 HC [stage 0] compiler/stage1/build/RegAlloc/Linear/State.o
1531 HC [stage 0] compiler/stage1/build/SPARC/CodeGen/Amode.o
1532 HC [stage 0] compiler/stage1/build/SPARC/CodeGen/CondCode.o
1533 HC [stage 0] compiler/stage1/build/StgCmmUtils.o
1534 HC [stage 0] compiler/stage1/build/StgCmmBind.o-boot
1535 HC [stage 0] compiler/stage1/build/StgCmmExtCode.o
1536 HC [stage 0] compiler/stage1/build/LlvmCodeGen/Regs.o
1537 HC [stage 0] compiler/stage1/build/RegAlloc/Linear/JoinToTargets.o
1538 HC [stage 0] compiler/stage1/build/SPARC/CodeGen/Gen64.o
1539 HC [stage 0] compiler/stage1/build/StgCmmTicky.o
1540 HC [stage 0] compiler/stage1/build/StgCmmEnv.o
1541 HC [stage 0] compiler/stage1/build/StgCmmProf.o
1542 HC [stage 0] compiler/stage1/build/LlvmCodeGen/Base.o
1543 HC [stage 0] compiler/stage1/build/RegAlloc/Linear/Main.o
1544 HC [stage 0] compiler/stage1/build/SPARC/CodeGen/Gen32.o
1545 HC [stage 0] compiler/stage1/build/StgCmmLayout.o
1546 HC [stage 0] compiler/stage1/build/SysTools/Tasks.o
1547 HC [stage 0] compiler/stage1/build/LlvmCodeGen/Data.o
1548 HC [stage 0] compiler/stage1/build/LlvmCodeGen/CodeGen.o
1549 HC [stage 0] compiler/stage1/build/SPARC/CodeGen.o
1550 HC [stage 0] compiler/stage1/build/SysTools/ExtraObj.o
1551 HC [stage 0] compiler/stage1/build/LlvmCodeGen/Ppr.o
1552 HC [stage 0] compiler/stage1/build/StgCmmForeign.o
1553 HC [stage 0] compiler/stage1/build/StgCmmHeap.o
1554 HC [stage 0] compiler/stage1/build/ByteCodeInstr.o
1555 HC [stage 0] compiler/stage1/build/SysTools.o
1556 HC [stage 0] compiler/stage1/build/CmmBuildInfoTables.o
1557 HC [stage 0] compiler/stage1/build/CmmLayoutStack.o
1558 HC [stage 0] compiler/stage1/build/StgCmmPrim.o
1559 HC [stage 0] compiler/stage1/build/LlvmCodeGen.o
1560 HC [stage 0] compiler/stage1/build/AsmCodeGen.o
1561 HC [stage 0] compiler/stage1/build/HsSyn.o
1562 HC [stage 0] compiler/stage1/build/PmExpr.o
1563 HC [stage 0] compiler/stage1/build/HscTypes.o
1564 HC [stage 0] compiler/stage1/build/RdrHsSyn.o
1565 HC [stage 0] compiler/stage1/build/HscStats.o
1566 HC [stage 0] compiler/stage1/build/HsDumpAst.o
1567 HC [stage 0] compiler/stage1/build/HaddockUtils.o
1568 HC [stage 0] compiler/stage1/build/BkpSyn.o
1569 HC [stage 0] compiler/stage1/build/Convert.o
1570 HC [stage 0] compiler/stage1/build/TcRnTypes.o
1571 HC [stage 0] compiler/stage1/build/Finder.o
1572 HC [stage 0] compiler/stage1/build/GhcMonad.o
1573 HC [stage 0] compiler/stage1/build/PipelineMonad.o
1574 HC [stage 0] compiler/stage1/build/MkCore.o
1575 HC [stage 0] compiler/stage1/build/DynamicLoading.o
1576 HC [stage 0] compiler/stage1/build/CmmPipeline.o
1577 HC [stage 0] compiler/stage1/build/StgCmmHpc.o
1578 HC [stage 0] compiler/stage1/build/Parser.o
1579 HC [stage 0] compiler/stage1/build/PrelRules.o
1580 HC [stage 0] compiler/stage1/build/TcEvTerm.o
1581 HC [stage 0] compiler/stage1/build/CodeOutput.o
1582 HC [stage 0] compiler/stage1/build/TcEnv.o-boot
1583 HC [stage 0] compiler/stage1/build/TcSplice.o-boot
1584 HC [stage 0] compiler/stage1/build/TcIface.o-boot
1585 HC [stage 0] compiler/stage1/build/Plugins.o
1586 HC [stage 0] compiler/stage1/build/Hooks.o
1587 HC [stage 0] compiler/stage1/build/TcRnDriver.o-boot
1588 HC [stage 0] compiler/stage1/build/TcUnify.o-boot
1589 HC [stage 0] compiler/stage1/build/TcExpr.o-boot
1590 HC [stage 0] compiler/stage1/build/TcHoleErrors.o-boot
1591 HC [stage 0] compiler/stage1/build/TcTypeNats.o
1592 HC [stage 0] compiler/stage1/build/TcMatches.o-boot
1593 HC [stage 0] compiler/stage1/build/RnHsDoc.o
1594 HC [stage 0] compiler/stage1/build/ExtractDocs.o
1595 HC [stage 0] compiler/stage1/build/RnExpr.o-boot
1596 HC [stage 0] compiler/stage1/build/DsUsage.o
1597 HC [stage 0] compiler/stage1/build/TcRnMonad.o
1598 HC [stage 0] compiler/stage1/build/MkId.o
1599 HC [stage 0] compiler/stage1/build/GHCi.o
1600 HC [stage 0] compiler/stage1/build/HeaderInfo.o
1601 HC [stage 0] compiler/stage1/build/Coverage.o
1602 HC [stage 0] compiler/stage1/build/ByteCodeItbls.o
1603 HC [stage 0] compiler/stage1/build/ByteCodeLink.o
1604 HC [stage 0] compiler/stage1/build/PrelInfo.o
1605 HC [stage 0] compiler/stage1/build/UnariseStg.o
1606 HC [stage 0] compiler/stage1/build/CoreToStg.o
1607 HC [stage 0] compiler/stage1/build/WwLib.o
1608 HC [stage 0] compiler/stage1/build/ToIface.o
1609 HC [stage 0] compiler/stage1/build/ByteCodeAsm.o
1610 HC [stage 0] compiler/stage1/build/LoadIface.o-boot
1611 HC [stage 0] compiler/stage1/build/IfaceEnv.o
1612 HC [stage 0] compiler/stage1/build/TcMType.o
1613 HC [stage 0] compiler/stage1/build/RnUnbound.o
1614 HC [stage 0] compiler/stage1/build/TcPatSyn.o-boot
1615 HC [stage 0] compiler/stage1/build/StgCmmCon.o
1616 HC [stage 0] compiler/stage1/build/SimplStg.o
1617 HC [stage 0] compiler/stage1/build/WorkWrap.o
1618 HC [stage 0] compiler/stage1/build/DmdAnal.o
1619 HC [stage 0] compiler/stage1/build/RnSplice.o-boot
1620 HC [stage 0] compiler/stage1/build/TcAnnotations.o
1621 HC [stage 0] compiler/stage1/build/ByteCodeGen.o
1622 HC [stage 0] compiler/stage1/build/NameShape.o
1623 HC [stage 0] compiler/stage1/build/BinIface.o
1624 HC [stage 0] compiler/stage1/build/BuildTyCl.o
1625 HC [stage 0] compiler/stage1/build/StgCmmExpr.o
1626 HC [stage 0] compiler/stage1/build/RnModIface.o
1627 HC [stage 0] compiler/stage1/build/TcHsSyn.o
1628 HC [stage 0] compiler/stage1/build/FlagChecker.o
1629 HC [stage 0] compiler/stage1/build/StgCmmBind.o
1630 HC [stage 0] compiler/stage1/build/LoadIface.o
1631 HC [stage 0] compiler/stage1/build/CmmParse.o
1632 HC [stage 0] compiler/stage1/build/StgCmm.o
1633 HC [stage 0] compiler/stage1/build/TmOracle.o
1634 HC [stage 0] compiler/stage1/build/TcEnv.o
1635 HC [stage 0] compiler/stage1/build/RnFixity.o
1636 HC [stage 0] compiler/stage1/build/MkIface.o
1637 HC [stage 0] compiler/stage1/build/Linker.o
1638 HC [stage 0] compiler/stage1/build/CoreMonad.o
1639 HC [stage 0] compiler/stage1/build/RnUtils.o
1640 HC [stage 0] compiler/stage1/build/StaticPtrTable.o
1641 HC [stage 0] compiler/stage1/build/RnEnv.o
1642 HC [stage 0] compiler/stage1/build/PprTyThing.o
1643 HC [stage 0] compiler/stage1/build/CoreLint.o
1644 HC [stage 0] compiler/stage1/build/SpecConstr.o
1645 HC [stage 0] compiler/stage1/build/Specialise.o
1646 HC [stage 0] compiler/stage1/build/SetLevels.o
1647 HC [stage 0] compiler/stage1/build/FloatIn.o
1648 HC [stage 0] compiler/stage1/build/SimplMonad.o
1649 HC [stage 0] compiler/stage1/build/GhcPlugins.o
1650 HC [stage 0] compiler/stage1/build/RnNames.o
1651 HC [stage 0] compiler/stage1/build/FloatOut.o
1652 HC [stage 0] compiler/stage1/build/RnTypes.o
1653 HC [stage 0] compiler/stage1/build/SimplEnv.o
1654 HC [stage 0] compiler/stage1/build/SimplUtils.o
1655 HC [stage 0] compiler/stage1/build/FamInst.o
1656 HC [stage 0] compiler/stage1/build/TcIface.o
1657 HC [stage 0] compiler/stage1/build/CorePrep.o
1658 HC [stage 0] compiler/stage1/build/Simplify.o
1659 HC [stage 0] compiler/stage1/build/RnPat.o
1660 HC [stage 0] compiler/stage1/build/FunDeps.o
1661 HC [stage 0] compiler/stage1/build/TcRnExports.o
1662 HC [stage 0] compiler/stage1/build/TidyPgm.o
1663 HC [stage 0] compiler/stage1/build/Inst.o
1664 HC [stage 0] compiler/stage1/build/RnBinds.o
1665 HC [stage 0] compiler/stage1/build/DsMonad.o
1666 HC [stage 0] compiler/stage1/build/SimplCore.o
1667 HC [stage 0] compiler/stage1/build/TcUnify.o
1668 HC [stage 0] compiler/stage1/build/ClsInst.o
1669 HC [stage 0] compiler/stage1/build/RnSource.o
1670 HC [stage 0] compiler/stage1/build/DsExpr.o-boot
1671 HC [stage 0] compiler/stage1/build/Match.o-boot
1672 HC [stage 0] compiler/stage1/build/DsUtils.o
1673 HC [stage 0] compiler/stage1/build/DsCCall.o
1674 HC [stage 0] compiler/stage1/build/DsGRHSs.o
1675 HC [stage 0] compiler/stage1/build/MatchLit.o
1676 HC [stage 0] compiler/stage1/build/TcErrors.o
1677 HC [stage 0] compiler/stage1/build/RtClosureInspect.o
1678 HC [stage 0] compiler/stage1/build/DsForeign.o
1679 HC [stage 0] compiler/stage1/build/DsMeta.o
1680 HC [stage 0] compiler/stage1/build/RnSplice.o
1681 HC [stage 0] compiler/stage1/build/RnExpr.o
1682 HC [stage 0] compiler/stage1/build/TcSMonad.o
1683 HC [stage 0] compiler/stage1/build/TcFlatten.o
1684 HC [stage 0] compiler/stage1/build/TcCanonical.o
1685 HC [stage 0] compiler/stage1/build/TcInteract.o
1686 HC [stage 0] compiler/stage1/build/TcSimplify.o
1687 HC [stage 0] compiler/stage1/build/TcValidity.o
1688 HC [stage 0] compiler/stage1/build/Check.o
1689 HC [stage 0] compiler/stage1/build/TcHoleErrors.o
1690 HC [stage 0] compiler/stage1/build/TcHsType.o
1691 HC [stage 0] compiler/stage1/build/TcGenDeriv.o
1692 HC [stage 0] compiler/stage1/build/DsBinds.o
1693 HC [stage 0] compiler/stage1/build/MatchCon.o
1694 HC [stage 0] compiler/stage1/build/Match.o
1695 HC [stage 0] compiler/stage1/build/TcGenFunctor.o
1696 HC [stage 0] compiler/stage1/build/TcSigs.o
1697 HC [stage 0] compiler/stage1/build/TcDefaults.o
1698 HC [stage 0] compiler/stage1/build/TcGenGenerics.o
1699 HC [stage 0] compiler/stage1/build/DsArrows.o
1700 HC [stage 0] compiler/stage1/build/DsListComp.o
1701 HC [stage 0] compiler/stage1/build/TcPat.o
1702 HC [stage 0] compiler/stage1/build/TcDerivUtils.o
1703 HC [stage 0] compiler/stage1/build/DsExpr.o
1704 HC [stage 0] compiler/stage1/build/TcBinds.o
1705 HC [stage 0] compiler/stage1/build/TcDerivInfer.o
1706 HC [stage 0] compiler/stage1/build/TcTyDecls.o
1707 HC [stage 0] compiler/stage1/build/TcTypeable.o
1708 HC [stage 0] compiler/stage1/build/TcClassDcl.o
1709 HC [stage 0] compiler/stage1/build/TcMatches.o
1710 HC [stage 0] compiler/stage1/build/TcDeriv.o
1711 HC [stage 0] compiler/stage1/build/TcBackpack.o
1712 HC [stage 0] compiler/stage1/build/TcPatSyn.o
1713 HC [stage 0] compiler/stage1/build/TcArrows.o
1714 HC [stage 0] compiler/stage1/build/TcExpr.o
1715 HC [stage 0] compiler/stage1/build/TcInstDcls.o-boot
1716 HC [stage 0] compiler/stage1/build/TcTyClsDecls.o
1717 HC [stage 0] compiler/stage1/build/TcForeign.o
1718 HC [stage 0] compiler/stage1/build/TcRules.o
1719 HC [stage 0] compiler/stage1/build/TcInstDcls.o
1720 HC [stage 0] compiler/stage1/build/TcRnDriver.o
1721 HC [stage 0] compiler/stage1/build/Desugar.o
1722 HC [stage 0] compiler/stage1/build/HscMain.o
1723 HC [stage 0] compiler/stage1/build/DriverPipeline.o
1724 HC [stage 0] compiler/stage1/build/InteractiveEval.o
1725 HC [stage 0] compiler/stage1/build/TcSplice.o
1726 HC [stage 0] compiler/stage1/build/GhcMake.o
1727 HC [stage 0] compiler/stage1/build/GHC.o
1728 HC [stage 0] compiler/stage1/build/DriverBkp.o
1729 HC [stage 0] compiler/stage1/build/DriverMkDepend.o
1730 HC [stage 0] compiler/stage1/build/Debugger.o
1731 HC [stage 0] ghc/stage1/build/Main.o
1732 HC [stage 0] ghc/stage1/build/tmp/ghc-stage1
1733 GHC PKG libraries/ghc-prim/dist-install/package-data.mk
1734 GHC PKG libraries/integer-gmp/dist-install/package-data.mk
1735 GHC PKG libraries/base/dist-install/package-data.mk
1736 GHC PKG libraries/filepath/dist-install/package-data.mk
1737 GHC PKG libraries/array/dist-install/package-data.mk
1738 GHC PKG libraries/deepseq/dist-install/package-data.mk
1739 GHC PKG libraries/bytestring/dist-install/package-data.mk
1740 GHC PKG libraries/containers/dist-install/package-data.mk
1741 GHC PKG libraries/time/dist-install/package-data.mk
1742 GHC PKG libraries/unix/dist-install/package-data.mk
1743 GHC PKG libraries/directory/dist-install/package-data.mk
1744 GHC PKG libraries/process/dist-install/package-data.mk
1745 GHC PKG libraries/hpc/dist-install/package-data.mk
1746 GHC PKG libraries/pretty/dist-install/package-data.mk
1747 GHC PKG libraries/binary/dist-install/package-data.mk
1748 GHC PKG libraries/text/dist-install/package-data.mk
1749 GHC PKG libraries/transformers/dist-install/package-data.mk
1750 GHC PKG libraries/mtl/dist-install/package-data.mk
1751 GHC PKG libraries/parsec/dist-install/package-data.mk
1752 GHC PKG libraries/Cabal/Cabal/dist-install/package-data.mk
1753 GHC PKG libraries/ghc-boot-th/dist-install/package-data.mk
1754 GHC PKG libraries/ghc-boot/dist-install/package-data.mk
1755 GHC PKG libraries/template-haskell/dist-install/package-data.mk
1756 GHC PKG libraries/ghc-compact/dist-install/package-data.mk
1757 GHC PKG libraries/ghc-heap/dist-install/package-data.mk
1758 GHC PKG libraries/xhtml/dist-install/package-data.mk
1759 GHC PKG libraries/terminfo/dist-install/package-data.mk
1760 GHC PKG libraries/stm/dist-install/package-data.mk
1761 GHC PKG libraries/haskeline/dist-install/package-data.mk
1762 GHC PKG libraries/ghci/dist-install/package-data.mk
1763 GHC PKG libraries/libiserv/dist-install/package-data.mk
1764 GHC PKG compiler/stage2/package-data.mk
1765 GHC PKG libraries/parallel/dist-install/package-data.mk
1766===--- building final phase
1767Creating compiler/stage2/ghc_boot_platform.h...
1768 HAPPY utils/hpc/dist-install/build/HpcParser.hs
1769Done.
1770 ALEX compiler/stage2/build/CmmLex.hs
1771 HAPPY compiler/stage2/build/CmmParse.hs
1772 ALEX compiler/stage2/build/Lexer.hs
1773 HAPPY compiler/stage2/build/Parser.hs
1774 HSC2HS compiler/stage2/build/Fingerprint.hs
1775checking build system type... x86_64-apple-darwin16.0.0
1776checking host system type... x86_64-apple-darwin
1777checking target system type... x86_64-apple-darwin
1778continue configure in default builddir "./x86_64-apple-darwin"
1779 HSC2HS libraries/ghc-heap/dist-install/build/GHC/Exts/Heap/InfoTableProf.hs
1780 HSC2HS libraries/ghc-heap/dist-install/build/GHC/Exts/Heap/Utils.hs
1781....exec /bin/sh .././configure "--srcdir=.." "--enable-builddir=x86_64-apple-darwin" "darwin"
1782checking build system type... x86_64-apple-darwin16.0.0
1783checking host system type... x86_64-apple-darwin
1784checking target system type... x86_64-apple-darwin
1785checking for gsed... sed
1786checking for a BSD-compatible install... /usr/local/bin/ginstall -c
1787checking whether build environment is sane... yes
1788checking for x86_64-apple-darwin-strip... no
1789checking for strip... strip
1790checking for a thread-safe mkdir -p... /usr/local/bin/gmkdir -p
1791checking for gawk... no
1792checking for mawk... no
1793checking for nawk... no
1794checking for awk... awk
1795checking whether make sets $(MAKE)... yes
1796checking whether make supports nested variables... yes
1797checking for x86_64-apple-darwin-gcc... gcc
1798checking whether the C compiler works... yes
1799checking for C compiler default output file name... a.out
1800checking for suffix of executables...
1801checking whether we are cross compiling... no
1802checking for suffix of object files... o
1803checking whether we are using the GNU C compiler... yes
1804checking whether gcc accepts -g... yes
1805checking for gcc option to accept ISO C89... none needed
1806checking whether gcc understands -c and -o together... yes
1807checking for style of include used by make... GNU
1808checking dependency style of gcc... gcc3
1809checking whether we are using the GNU C++ compiler... yes
1810checking whether gcc accepts -g... yes
1811checking dependency style of gcc... gcc3
1812checking dependency style of gcc... gcc3
1813checking how to print strings... printf
1814checking for a sed that does not truncate output... /usr/bin/sed
1815checking for grep that handles long lines and -e... /usr/bin/grep
1816checking for egrep... /usr/bin/grep -E
1817checking for fgrep... /usr/bin/grep -F
1818checking for ld used by gcc... HSC2HS libraries/unix/dist-install/build/System/Posix/Semaphore.hs
1819 HSC2HS libraries/unix/dist-install/build/System/Posix/SharedMem.hs
1820ld
1821checking if the linker (ld) is GNU ld... no
1822checking for BSD- or MS-compatible name lister (nm)... nm
1823checking the name lister (nm) interface... HSC2HS libraries/unix/dist-install/build/System/Posix/Directory.hs
1824BSD nm
1825checking whether ln -s works... yes
1826checking the maximum length of command line arguments... 196608
1827checking how to convert x86_64-apple-darwin16.0.0 file names to x86_64-apple-darwin format... func_convert_file_noop
1828checking how to convert x86_64-apple-darwin16.0.0 file names to toolchain format... func_convert_file_noop
1829checking for ld option to reload object files... -r
1830checking for x86_64-apple-darwin-objdump... no
1831checking for objdump... objdump
1832checking how to recognize dependent libraries... pass_all
1833checking for x86_64-apple-darwin-dlltool... no
1834checking for dlltool... no
1835checking how to associate runtime and link libraries... printf %s\n
1836checking for x86_64-apple-darwin-ar... ar
1837 HSC2HS libraries/unix/dist-install/build/System/Posix/DynamicLinker/Prim.hs
1838checking for archiver @FILE support... no
1839checking for x86_64-apple-darwin-strip... strip
1840checking for x86_64-apple-darwin-ranlib... ranlib
1841checking command to parse nm output from gcc object... HSC2HS libraries/unix/dist-install/build/System/Posix/DynamicLinker/ByteString.hs
1842 HSC2HS libraries/unix/dist-install/build/System/Posix/DynamicLinker.hs
1843ok
1844 HSC2HS libraries/unix/dist-install/build/System/Posix/Files.hs
1845checking for sysroot... no
1846checking for a working dd... /bin/dd
1847checking how to truncate binary pipes... /bin/dd bs=4096 count=1
1848checking for x86_64-apple-darwin-mt... no
1849checking for mt... no
1850checking if : is a manifest tool... no
1851 HSC2HS libraries/unix/dist-install/build/System/Posix/IO.hs
1852checking for x86_64-apple-darwin-dsymutil... no
1853checking for dsymutil... dsymutil
1854checking for x86_64-apple-darwin-nmedit... no
1855checking for nmedit... nmedit
1856checking for x86_64-apple-darwin-lipo... no
1857checking for lipo... lipo
1858checking for x86_64-apple-darwin-otool... no
1859checking for otool... otool
1860checking for x86_64-apple-darwin-otool64... no
1861checking for otool64... no
1862checking for -single_module linker flag... yes
1863checking for -exported_symbols_list linker flag... yes
1864checking for -force_load linker flag... HSC2HS libraries/unix/dist-install/build/System/Posix/Env.hs
1865 HSC2HS libraries/unix/dist-install/build/System/Posix/Fcntl.hs
1866 HSC2HS libraries/unix/dist-install/build/System/Posix/Process.hs
1867yes
1868checking how to run the C preprocessor... gcc -E
1869 HSC2HS libraries/unix/dist-install/build/System/Posix/Temp.hs
1870 HSC2HS libraries/unix/dist-install/build/System/Posix/Terminal.hs
1871 HSC2HS libraries/unix/dist-install/build/System/Posix/Directory/Common.hs
1872checking for ANSI C header files... HSC2HS libraries/unix/dist-install/build/System/Posix/DynamicLinker/Common.hs
1873 HSC2HS libraries/unix/dist-install/build/System/Posix/Files/Common.hs
1874 HSC2HS libraries/unix/dist-install/build/System/Posix/IO/Common.hs
1875yes
1876checking for sys/types.h... HSC2HS libraries/unix/dist-install/build/System/Posix/Process/Common.hs
1877yes
1878checking for sys/stat.h... yes
1879 HSC2HS libraries/unix/dist-install/build/System/Posix/Terminal/Common.hs
1880checking for stdlib.h... yes
1881checking for string.h... yes
1882checking for memory.h... yes
1883checking for strings.h... yes
1884checking for inttypes.h... yes
1885checking for stdint.h... yes
1886checking for unistd.h... yes
1887checking for dlfcn.h... yes
1888checking for objdir... .libs
1889checking if gcc supports -fno-rtti -fno-exceptions... yes
1890checking for gcc option to produce PIC... -fno-common -DPIC
1891checking if gcc PIC flag -fno-common -DPIC works... yes
1892checking if gcc static flag -static works... no
1893checking if gcc supports -c -o file.o... yes
1894checking if gcc supports -c -o file.o... (cached) yes
1895checking whether the gcc linker (ld) supports shared libraries... yes
1896checking dynamic linker characteristics... darwin dyld
1897checking how to hardcode library paths into programs... immediate
1898checking whether stripping libraries is possible... yes
1899checking if libtool supports shared libraries... yes
1900checking whether to build shared libraries... yes
1901checking whether to build static libraries... yes
1902checking how to run the C++ preprocessor... gcc -E
1903 HSC2HS libraries/base/dist-install/build/GHC/Stats.hs
1904checking for ld used by gcc... ld
1905checking if the linker (ld) is GNU ld... no
1906checking whether the gcc linker (ld) supports shared libraries... yes
1907checking for gcc option to produce PIC... -fno-common -DPIC
1908checking if gcc PIC flag -fno-common -DPIC works... yes
1909checking if gcc static flag -static works... no
1910checking if gcc supports -c -o file.o... yes
1911checking if gcc supports -c -o file.o... (cached) yes
1912checking whether the gcc linker (ld) supports shared libraries... yes
1913checking dynamic linker characteristics... darwin dyld
1914checking how to hardcode library paths into programs... immediate
1915checking size of size_t... 8
1916checking for C compiler vendor... clang
1917checking CFLAGS for maximum warnings... -Wall
1918checking whether to enable maintainer-specific portions of Makefiles... no
1919checking sys/mman.h usability... yes
1920checking sys/mman.h presence... yes
1921checking for sys/mman.h... yes
1922checking for mmap... yes
1923checking for mkostemp... yes
1924checking for sys/mman.h... (cached) yes
1925checking for mmap... (cached) yes
1926checking whether read-only mmap of a plain file works... yes
1927checking whether mmap from /dev/zero works... no
1928checking for MAP_ANON(YMOUS)... yes
1929checking whether mmap with MAP_ANON(YMOUS) works... yes
1930checking for ANSI C header files... (cached) yes
1931checking for memcpy... yes
1932checking for size_t... yes
1933checking for working alloca.h... yes
1934checking for alloca... HSC2HS libraries/libiserv/dist-install/build/GHCi/Utils.hs
1935 HSC2HS libraries/ghci/dist-install/build/GHCi/InfoTable.hs
1936yes
1937checking size of double... HSC2HS libraries/haskeline/dist-install/build/System/Console/Haskeline/Directory.hs
1938 HSC2HS libraries/haskeline/dist-install/build/System/Console/Haskeline/Backend/Posix.hs
19398
1940checking size of long double... HSC2HS libraries/ghc-heap/dist-install/build/GHC/Exts/Heap/Constants.hs
1941 HSC2HS libraries/ghc-heap/dist-install/build/GHC/Exts/Heap/InfoTable.hs
194216
1943checking whether byte ordering is bigendian... HSC2HS libraries/ghc-heap/dist-install/build/GHC/Exts/Heap/InfoTable/Types.hs
1944 HSC2HS libraries/hpc/dist-install/build/Trace/Hpc/Reflect.hs
1945no
1946checking assembler .cfi pseudo-op support... HSC2HS libraries/directory/dist-install/build/System/Directory/Internal/C_utimensat.hs
1947yes
1948checking assembler supports pc related relocs... yes
1949checking for _ prefix in compiled symbols... HSC2HS libraries/directory/dist-install/build/System/Directory/Internal/Posix.hs
1950yes
1951checking toolchain supports unwind section type... HSC2HS libraries/directory/dist-install/build/System/Directory/Internal/Windows.hs
1952 HSC2HS libraries/unix/dist-install/build/System/Posix/Resource.hs
1953no
1954checking whether .eh_frame section should be read-only... no
1955checking for __attribute__((visibility("hidden")))... HSC2HS libraries/unix/dist-install/build/System/Posix/Unistd.hs
1956no
1957 HSC2HS libraries/unix/dist-install/build/System/Posix/User.hs
1958checking for ld used by gcc... HSC2HS libraries/unix/dist-install/build/System/Posix/Signals.hs
1959(cached) ld
1960checking if the linker (ld) is GNU ld... (cached) no
1961configure: versioning on shared library symbols is no
1962 HSC2HS libraries/unix/dist-install/build/System/Posix/Signals/Exts.hs
1963checking that generated files are newer than configure... done
1964configure: creating ./config.status
1965 HSC2HS libraries/unix/dist-install/build/System/Posix/ByteString/FilePath.hs
1966 HSC2HS libraries/unix/dist-install/build/System/Posix/Directory/ByteString.hs
1967 HSC2HS libraries/unix/dist-install/build/System/Posix/DynamicLinker/Module.hs
1968 HSC2HS libraries/unix/dist-install/build/System/Posix/DynamicLinker/Module/ByteString.hs
1969 HSC2HS libraries/unix/dist-install/build/System/Posix/Files/ByteString.hs
1970 HSC2HS libraries/unix/dist-install/build/System/Posix/IO/ByteString.hs
1971 HSC2HS libraries/unix/dist-install/build/System/Posix/Env/ByteString.hs
1972 HSC2HS libraries/unix/dist-install/build/System/Posix/Process/ByteString.hs
1973 HSC2HS libraries/unix/dist-install/build/System/Posix/Temp/ByteString.hs
1974 HSC2HS libraries/unix/dist-install/build/System/Posix/Terminal/ByteString.hs
1975 HSC2HS libraries/time/dist-install/build/Data/Time/Clock/Internal/CTimespec.hs
1976 HSC2HS libraries/base/dist-install/build/GHC/Clock.hs
1977 HSC2HS libraries/base/dist-install/build/GHC/ExecutionStack/Internal.hs
1978 HSC2HS libraries/base/dist-install/build/GHC/IO/Handle/Lock.hs
1979 HSC2HS libraries/base/dist-install/build/GHC/RTS/Flags.hs
1980 HSC2HS libraries/base/dist-install/build/GHC/Stack/CCS.hs
1981 HSC2HS libraries/base/dist-install/build/System/CPUTime.hs
1982 HSC2HS libraries/base/dist-install/build/System/Environment/Blank.hs
1983 HSC2HS libraries/base/dist-install/build/System/Environment/ExecutablePath.hs
1984 HSC2HS libraries/base/dist-install/build/GHC/Event/EPoll.hs
1985 HSC2HS libraries/base/dist-install/build/GHC/Event/KQueue.hs
1986 HSC2HS libraries/base/dist-install/build/GHC/Event/Poll.hs
1987 HSC2HS libraries/base/dist-install/build/System/CPUTime/Posix/ClockGetTime.hs
1988 HSC2HS libraries/base/dist-install/build/System/CPUTime/Posix/Times.hs
1989 HSC2HS libraries/base/dist-install/build/System/CPUTime/Posix/RUsage.hs
1990config.status: creating include/Makefile
1991config.status: creating include/ffi.h
1992config.status: creating Makefile
1993config.status: creating testsuite/Makefile
1994config.status: creating man/Makefile
1995config.status: creating doc/Makefile
1996config.status: creating libffi.pc
1997config.status: creating libffi.map
1998config.status: creating fficonfig.h
1999config.status: linking ../src/x86/ffitarget.h to include/ffitarget.h
2000config.status: executing buildir commands
2001config.status: create top_srcdir/Makefile guessed from local Makefile
2002config.status: buggy sed found - it deletes tab in "a" text parts
2003config.status: build in x86_64-apple-darwin (HOST=)
2004config.status: executing depfiles commands
2005config.status: executing libtool commands
2006config.status: executing include commands
2007config.status: executing src commands
2008MAKE x86_64-apple-darwin16.0.0 : 0 * all-all
2009/Applications/Xcode-7.2/Xcode.app/Contents/Developer/usr/bin/make 'AR_FLAGS=' 'CC_FOR_BUILD=' 'CFLAGS=-Wall -Werror -fno-stack-protector -w -fexceptions' 'CXXFLAGS=-g -O2' 'CFLAGS_FOR_BUILD=' 'CFLAGS_FOR_TARGET=' 'INSTALL=/usr/local/bin/ginstall -c' 'INSTALL_DATA=/usr/local/bin/ginstall -c -m 644' 'INSTALL_PROGRAM=/usr/local/bin/ginstall -c' 'INSTALL_SCRIPT=/usr/local/bin/ginstall -c' 'JC1FLAGS=' 'LDFLAGS=-w' 'LIBCFLAGS=' 'LIBCFLAGS_FOR_TARGET=' 'MAKE=/Applications/Xcode-7.2/Xcode.app/Contents/Developer/usr/bin/make' 'MAKEINFO=/bin/sh /var/drydock/workingcopy-121269/repo/glasgow-haskell-compiler/libffi/build/missing makeinfo ' 'PICFLAG=' 'PICFLAG_FOR_TARGET=' 'RUNTESTFLAGS=' 'SHELL=/bin/sh' 'exec_prefix=/var/drydock/workingcopy-121269/repo/glasgow-haskell-compiler/libffi/build/inst' 'infodir=/var/drydock/workingcopy-121269/repo/glasgow-haskell-compiler/libffi/build/inst/share/info' 'libdir=/var/drydock/workingcopy-121269/repo/glasgow-haskell-compiler/libffi/build/inst/lib' 'mandir=/var/drydock/workingcopy-121269/repo/glasgow-haskell-compiler/libffi/build/inst/share/man' 'prefix=/var/drydock/workingcopy-121269/repo/glasgow-haskell-compiler/libffi/build/inst' 'AR=ar' 'AS=as' 'CC=gcc' 'CXX=gcc' 'LD=ld' 'NM=nm' 'RANLIB=ranlib' 'DESTDIR=' all-recursive
2010Making all in include
2011make[5]: Nothing to be done for `all'.
2012Making all in testsuite
2013make[5]: Nothing to be done for `all'.
2014Making all in man
2015make[5]: Nothing to be done for `all'.
2016depbase=`echo src/prep_cif.lo | sed 's|[^/]*$|.deps/&|;s|\.lo$||'`;\
2017 /bin/sh ./libtool --tag=CC --mode=compile gcc -DHAVE_CONFIG_H -I. -I.. -I. -I../include -Iinclude -I../src -Wall -Werror -fno-stack-protector -w -fexceptions -MT src/prep_cif.lo -MMD -MP -MF $depbase.Tpo -c -o src/prep_cif.lo ../src/prep_cif.c &&\
2018 mv -f $depbase.Tpo $depbase.Plo
2019libtool: compile: gcc -DHAVE_CONFIG_H -I. -I.. -I. -I../include -Iinclude -I../src -Wall -Werror -fno-stack-protector -w -fexceptions -MT src/prep_cif.lo -MMD -MP -MF src/.deps/prep_cif.Tpo -c ../src/prep_cif.c -fno-common -DPIC -o src/.libs/prep_cif.o
2020libtool: compile: gcc -DHAVE_CONFIG_H -I. -I.. -I. -I../include -Iinclude -I../src -Wall -Werror -fno-stack-protector -w -fexceptions -MT src/prep_cif.lo -MMD -MP -MF src/.deps/prep_cif.Tpo -c ../src/prep_cif.c -o src/prep_cif.o >/dev/null 2>&1
2021depbase=`echo src/types.lo | sed 's|[^/]*$|.deps/&|;s|\.lo$||'`;\
2022 /bin/sh ./libtool --tag=CC --mode=compile gcc -DHAVE_CONFIG_H -I. -I.. -I. -I../include -Iinclude -I../src -Wall -Werror -fno-stack-protector -w -fexceptions -MT src/types.lo -MMD -MP -MF $depbase.Tpo -c -o src/types.lo ../src/types.c &&\
2023 mv -f $depbase.Tpo $depbase.Plo
2024libtool: compile: gcc -DHAVE_CONFIG_H -I. -I.. -I. -I../include -Iinclude -I../src -Wall -Werror -fno-stack-protector -w -fexceptions -MT src/types.lo -MMD -MP -MF src/.deps/types.Tpo -c ../src/types.c -fno-common -DPIC -o src/.libs/types.o
2025libtool: compile: gcc -DHAVE_CONFIG_H -I. -I.. -I. -I../include -Iinclude -I../src -Wall -Werror -fno-stack-protector -w -fexceptions -MT src/types.lo -MMD -MP -MF src/.deps/types.Tpo -c ../src/types.c -o src/types.o >/dev/null 2>&1
2026depbase=`echo src/raw_api.lo | sed 's|[^/]*$|.deps/&|;s|\.lo$||'`;\
2027 /bin/sh ./libtool --tag=CC --mode=compile gcc -DHAVE_CONFIG_H -I. -I.. -I. -I../include -Iinclude -I../src -Wall -Werror -fno-stack-protector -w -fexceptions -MT src/raw_api.lo -MMD -MP -MF $depbase.Tpo -c -o src/raw_api.lo ../src/raw_api.c &&\
2028 mv -f $depbase.Tpo $depbase.Plo
2029libtool: compile: gcc -DHAVE_CONFIG_H -I. -I.. -I. -I../include -Iinclude -I../src -Wall -Werror -fno-stack-protector -w -fexceptions -MT src/raw_api.lo -MMD -MP -MF src/.deps/raw_api.Tpo -c ../src/raw_api.c -fno-common -DPIC -o src/.libs/raw_api.o
2030libtool: compile: gcc -DHAVE_CONFIG_H -I. -I.. -I. -I../include -Iinclude -I../src -Wall -Werror -fno-stack-protector -w -fexceptions -MT src/raw_api.lo -MMD -MP -MF src/.deps/raw_api.Tpo -c ../src/raw_api.c -o src/raw_api.o >/dev/null 2>&1
2031depbase=`echo src/java_raw_api.lo | sed 's|[^/]*$|.deps/&|;s|\.lo$||'`;\
2032 /bin/sh ./libtool --tag=CC --mode=compile gcc -DHAVE_CONFIG_H -I. -I.. -I. -I../include -Iinclude -I../src -Wall -Werror -fno-stack-protector -w -fexceptions -MT src/java_raw_api.lo -MMD -MP -MF $depbase.Tpo -c -o src/java_raw_api.lo ../src/java_raw_api.c &&\
2033 mv -f $depbase.Tpo $depbase.Plo
2034libtool: compile: gcc -DHAVE_CONFIG_H -I. -I.. -I. -I../include -Iinclude -I../src -Wall -Werror -fno-stack-protector -w -fexceptions -MT src/java_raw_api.lo -MMD -MP -MF src/.deps/java_raw_api.Tpo -c ../src/java_raw_api.c -fno-common -DPIC -o src/.libs/java_raw_api.o
2035libtool: compile: gcc -DHAVE_CONFIG_H -I. -I.. -I. -I../include -Iinclude -I../src -Wall -Werror -fno-stack-protector -w -fexceptions -MT src/java_raw_api.lo -MMD -MP -MF src/.deps/java_raw_api.Tpo -c ../src/java_raw_api.c -o src/java_raw_api.o >/dev/null 2>&1
2036depbase=`echo src/closures.lo | sed 's|[^/]*$|.deps/&|;s|\.lo$||'`;\
2037 /bin/sh ./libtool --tag=CC --mode=compile gcc -DHAVE_CONFIG_H -I. -I.. -I. -I../include -Iinclude -I../src -Wall -Werror -fno-stack-protector -w -fexceptions -MT src/closures.lo -MMD -MP -MF $depbase.Tpo -c -o src/closures.lo ../src/closures.c &&\
2038 mv -f $depbase.Tpo $depbase.Plo
2039libtool: compile: gcc -DHAVE_CONFIG_H -I. -I.. -I. -I../include -Iinclude -I../src -Wall -Werror -fno-stack-protector -w -fexceptions -MT src/closures.lo -MMD -MP -MF src/.deps/closures.Tpo -c ../src/closures.c -fno-common -DPIC -o src/.libs/closures.o
2040libtool: compile: gcc -DHAVE_CONFIG_H -I. -I.. -I. -I../include -Iinclude -I../src -Wall -Werror -fno-stack-protector -w -fexceptions -MT src/closures.lo -MMD -MP -MF src/.deps/closures.Tpo -c ../src/closures.c -o src/closures.o >/dev/null 2>&1
2041depbase=`echo src/x86/ffi64.lo | sed 's|[^/]*$|.deps/&|;s|\.lo$||'`;\
2042 /bin/sh ./libtool --tag=CC --mode=compile gcc -DHAVE_CONFIG_H -I. -I.. -I. -I../include -Iinclude -I../src -Wall -Werror -fno-stack-protector -w -fexceptions -MT src/x86/ffi64.lo -MMD -MP -MF $depbase.Tpo -c -o src/x86/ffi64.lo ../src/x86/ffi64.c &&\
2043 mv -f $depbase.Tpo $depbase.Plo
2044libtool: compile: gcc -DHAVE_CONFIG_H -I. -I.. -I. -I../include -Iinclude -I../src -Wall -Werror -fno-stack-protector -w -fexceptions -MT src/x86/ffi64.lo -MMD -MP -MF src/x86/.deps/ffi64.Tpo -c ../src/x86/ffi64.c -fno-common -DPIC -o src/x86/.libs/ffi64.o
2045libtool: compile: gcc -DHAVE_CONFIG_H -I. -I.. -I. -I../include -Iinclude -I../src -Wall -Werror -fno-stack-protector -w -fexceptions -MT src/x86/ffi64.lo -MMD -MP -MF src/x86/.deps/ffi64.Tpo -c ../src/x86/ffi64.c -o src/x86/ffi64.o >/dev/null 2>&1
2046depbase=`echo src/x86/unix64.lo | sed 's|[^/]*$|.deps/&|;s|\.lo$||'`;\
2047 /bin/sh ./libtool --mode=compile gcc -DHAVE_CONFIG_H -I. -I.. -I. -I../include -Iinclude -I../src -I. -I../include -Iinclude -I../src -Wall -Werror -fno-stack-protector -w -MT src/x86/unix64.lo -MMD -MP -MF $depbase.Tpo -c -o src/x86/unix64.lo ../src/x86/unix64.S &&\
2048 mv -f $depbase.Tpo $depbase.Plo
2049libtool: compile: gcc -DHAVE_CONFIG_H -I. -I.. -I. -I../include -Iinclude -I../src -I. -I../include -Iinclude -I../src -Wall -Werror -fno-stack-protector -w -MT src/x86/unix64.lo -MMD -MP -MF src/x86/.deps/unix64.Tpo -c ../src/x86/unix64.S -fno-common -DPIC -o src/x86/.libs/unix64.o
2050libtool: compile: gcc -DHAVE_CONFIG_H -I. -I.. -I. -I../include -Iinclude -I../src -I. -I../include -Iinclude -I../src -Wall -Werror -fno-stack-protector -w -MT src/x86/unix64.lo -MMD -MP -MF src/x86/.deps/unix64.Tpo -c ../src/x86/unix64.S -o src/x86/unix64.o >/dev/null 2>&1
2051depbase=`echo src/x86/ffiw64.lo | sed 's|[^/]*$|.deps/&|;s|\.lo$||'`;\
2052 /bin/sh ./libtool --tag=CC --mode=compile gcc -DHAVE_CONFIG_H -I. -I.. -I. -I../include -Iinclude -I../src -Wall -Werror -fno-stack-protector -w -fexceptions -MT src/x86/ffiw64.lo -MMD -MP -MF $depbase.Tpo -c -o src/x86/ffiw64.lo ../src/x86/ffiw64.c &&\
2053 mv -f $depbase.Tpo $depbase.Plo
2054libtool: compile: gcc -DHAVE_CONFIG_H -I. -I.. -I. -I../include -Iinclude -I../src -Wall -Werror -fno-stack-protector -w -fexceptions -MT src/x86/ffiw64.lo -MMD -MP -MF src/x86/.deps/ffiw64.Tpo -c ../src/x86/ffiw64.c -fno-common -DPIC -o src/x86/.libs/ffiw64.o
2055libtool: compile: gcc -DHAVE_CONFIG_H -I. -I.. -I. -I../include -Iinclude -I../src -Wall -Werror -fno-stack-protector -w -fexceptions -MT src/x86/ffiw64.lo -MMD -MP -MF src/x86/.deps/ffiw64.Tpo -c ../src/x86/ffiw64.c -o src/x86/ffiw64.o >/dev/null 2>&1
2056depbase=`echo src/x86/win64.lo | sed 's|[^/]*$|.deps/&|;s|\.lo$||'`;\
2057 /bin/sh ./libtool --mode=compile gcc -DHAVE_CONFIG_H -I. -I.. -I. -I../include -Iinclude -I../src -I. -I../include -Iinclude -I../src -Wall -Werror -fno-stack-protector -w -MT src/x86/win64.lo -MMD -MP -MF $depbase.Tpo -c -o src/x86/win64.lo ../src/x86/win64.S &&\
2058 mv -f $depbase.Tpo $depbase.Plo
2059libtool: compile: gcc -DHAVE_CONFIG_H -I. -I.. -I. -I../include -Iinclude -I../src -I. -I../include -Iinclude -I../src -Wall -Werror -fno-stack-protector -w -MT src/x86/win64.lo -MMD -MP -MF src/x86/.deps/win64.Tpo -c ../src/x86/win64.S -fno-common -DPIC -o src/x86/.libs/win64.o
2060libtool: compile: gcc -DHAVE_CONFIG_H -I. -I.. -I. -I../include -Iinclude -I../src -I. -I../include -Iinclude -I../src -Wall -Werror -fno-stack-protector -w -MT src/x86/win64.lo -MMD -MP -MF src/x86/.deps/win64.Tpo -c ../src/x86/win64.S -o src/x86/win64.o >/dev/null 2>&1
2061/bin/sh ./libtool --tag=CC --mode=link gcc -Wall -Werror -fno-stack-protector -w -fexceptions -w -o libffi_convenience.la src/prep_cif.lo src/types.lo src/raw_api.lo src/java_raw_api.lo src/closures.lo src/x86/ffi64.lo src/x86/unix64.lo src/x86/ffiw64.lo src/x86/win64.lo
2062libtool: link: ar cru .libs/libffi_convenience.a src/.libs/prep_cif.o src/.libs/types.o src/.libs/raw_api.o src/.libs/java_raw_api.o src/.libs/closures.o src/x86/.libs/ffi64.o src/x86/.libs/unix64.o src/x86/.libs/ffiw64.o src/x86/.libs/win64.o
2063libtool: link: ranlib .libs/libffi_convenience.a
2064libtool: link: ( cd ".libs" && rm -f "libffi_convenience.la" && ln -s "../libffi_convenience.la" "libffi_convenience.la" )
2065/bin/sh ./libtool --tag=CC --mode=link gcc -Wall -Werror -fno-stack-protector -w -fexceptions -no-undefined -version-info `grep -v '^#' ../libtool-version` '-w' -w -o libffi.la -rpath /var/drydock/workingcopy-121269/repo/glasgow-haskell-compiler/libffi/build/inst/lib src/prep_cif.lo src/types.lo src/raw_api.lo src/java_raw_api.lo src/closures.lo src/x86/ffi64.lo src/x86/unix64.lo src/x86/ffiw64.lo src/x86/win64.lo
2066libtool: link: gcc -dynamiclib -o .libs/libffi.7.dylib src/.libs/prep_cif.o src/.libs/types.o src/.libs/raw_api.o src/.libs/java_raw_api.o src/.libs/closures.o src/x86/.libs/ffi64.o src/x86/.libs/unix64.o src/x86/.libs/ffiw64.o src/x86/.libs/win64.o -install_name /var/drydock/workingcopy-121269/repo/glasgow-haskell-compiler/libffi/build/inst/lib/libffi.7.dylib -compatibility_version 9 -current_version 9.0 -Wl,-single_module
2067libtool: link: (cd ".libs" && rm -f "libffi.dylib" && ln -s "libffi.7.dylib" "libffi.dylib")
2068libtool: link: ar cru .libs/libffi.a src/prep_cif.o src/types.o src/raw_api.o src/java_raw_api.o src/closures.o src/x86/ffi64.o src/x86/unix64.o src/x86/ffiw64.o src/x86/win64.o
2069libtool: link: ranlib .libs/libffi.a
2070libtool: link: ( cd ".libs" && rm -f "libffi.la" && ln -s "../libffi.la" "libffi.la" )
2071MAKE x86_64-apple-darwin16.0.0 : 0 * install
2072Making install in include
2073make[5]: Nothing to be done for `install-exec-am'.
2074 /usr/local/bin/gmkdir -p '/var/drydock/workingcopy-121269/repo/glasgow-haskell-compiler/libffi/build/inst/include'
2075 /usr/local/bin/ginstall -c -m 644 ffi.h ffitarget.h '/var/drydock/workingcopy-121269/repo/glasgow-haskell-compiler/libffi/build/inst/include'
2076Making install in testsuite
2077make[5]: Nothing to be done for `install-exec-am'.
2078make[5]: Nothing to be done for `install-data-am'.
2079Making install in man
2080make[5]: Nothing to be done for `install-exec-am'.
2081 /usr/local/bin/gmkdir -p '/var/drydock/workingcopy-121269/repo/glasgow-haskell-compiler/libffi/build/inst/share/man/man3'
2082 /usr/local/bin/ginstall -c -m 644 ../../man/ffi.3 ../../man/ffi_call.3 ../../man/ffi_prep_cif.3 ../../man/ffi_prep_cif_var.3 '/var/drydock/workingcopy-121269/repo/glasgow-haskell-compiler/libffi/build/inst/share/man/man3'
2083 /usr/local/bin/gmkdir -p '/var/drydock/workingcopy-121269/repo/glasgow-haskell-compiler/libffi/build/inst/lib'
2084 /bin/sh ./libtool --mode=install /usr/local/bin/ginstall -c libffi.la '/var/drydock/workingcopy-121269/repo/glasgow-haskell-compiler/libffi/build/inst/lib'
2085libtool: install: /usr/local/bin/ginstall -c .libs/libffi.7.dylib /var/drydock/workingcopy-121269/repo/glasgow-haskell-compiler/libffi/build/inst/lib/libffi.7.dylib
2086libtool: install: (cd /var/drydock/workingcopy-121269/repo/glasgow-haskell-compiler/libffi/build/inst/lib && { ln -s -f libffi.7.dylib libffi.dylib || { rm -f libffi.dylib && ln -s libffi.7.dylib libffi.dylib; }; })
2087libtool: install: /usr/local/bin/ginstall -c .libs/libffi.lai /var/drydock/workingcopy-121269/repo/glasgow-haskell-compiler/libffi/build/inst/lib/libffi.la
2088libtool: install: /usr/local/bin/ginstall -c .libs/libffi.a /var/drydock/workingcopy-121269/repo/glasgow-haskell-compiler/libffi/build/inst/lib/libffi.a
2089libtool: install: chmod 644 /var/drydock/workingcopy-121269/repo/glasgow-haskell-compiler/libffi/build/inst/lib/libffi.a
2090libtool: install: ranlib /var/drydock/workingcopy-121269/repo/glasgow-haskell-compiler/libffi/build/inst/lib/libffi.a
2091 /usr/local/bin/gmkdir -p '/var/drydock/workingcopy-121269/repo/glasgow-haskell-compiler/libffi/build/inst/lib/pkgconfig'
2092 /usr/local/bin/ginstall -c -m 644 libffi.pc '/var/drydock/workingcopy-121269/repo/glasgow-haskell-compiler/libffi/build/inst/lib/pkgconfig'
2093 HSC2HS libraries/ghci/dist-install/build/GHCi/FFI.hs
2094 CC utils/unlit/dist-install/build/unlit.dyn_o
2095 CC utils/unlit/dist-install/build/fs.dyn_o
2096 HC [stage 0] utils/hp2ps/dist/build/AreaBelow.o
2097 HC [stage 0] utils/hp2ps/dist/build/Curves.o
2098 HC [stage 0] utils/hp2ps/dist/build/Error.o
2099 HC [stage 0] utils/hp2ps/dist/build/Main.o
2100 HC [stage 0] utils/hp2ps/dist/build/Reorder.o
2101 HC [stage 0] utils/hp2ps/dist/build/TopTwenty.o
2102 HC [stage 0] utils/hp2ps/dist/build/Deviation.o
2103 HC [stage 0] utils/hp2ps/dist/build/AuxFile.o
2104 HC [stage 0] utils/hp2ps/dist/build/HpFile.o
2105 HC [stage 0] utils/hp2ps/dist/build/Marks.o
2106 HC [stage 0] utils/hp2ps/dist/build/Scale.o
2107 HC [stage 0] utils/hp2ps/dist/build/TraceElement.o
2108 HC [stage 0] utils/hp2ps/dist/build/Axes.o
2109 HC [stage 0] utils/hp2ps/dist/build/Dimensions.o
2110 HC [stage 0] utils/hp2ps/dist/build/Key.o
2111 HC [stage 0] utils/hp2ps/dist/build/PsFile.o
2112 HC [stage 0] utils/hp2ps/dist/build/Shade.o
2113 HC [stage 0] utils/hp2ps/dist/build/Utilities.o
2114 CC utils/hp2ps/dist-install/build/AreaBelow.dyn_o
2115 CC utils/hp2ps/dist-install/build/Curves.dyn_o
2116 CC utils/hp2ps/dist-install/build/Error.dyn_o
2117 CC utils/hp2ps/dist-install/build/Main.dyn_o
2118 CC utils/hp2ps/dist-install/build/Reorder.dyn_o
2119 CC utils/hp2ps/dist-install/build/TopTwenty.dyn_o
2120 CC utils/hp2ps/dist-install/build/AuxFile.dyn_o
2121 CC utils/hp2ps/dist-install/build/Deviation.dyn_o
2122 CC utils/hp2ps/dist-install/build/HpFile.dyn_o
2123 CC utils/hp2ps/dist-install/build/Marks.dyn_o
2124 CC utils/hp2ps/dist-install/build/Scale.dyn_o
2125 CC utils/hp2ps/dist-install/build/TraceElement.dyn_o
2126 CC utils/hp2ps/dist-install/build/Axes.dyn_o
2127 CC utils/hp2ps/dist-install/build/Dimensions.dyn_o
2128 CC utils/hp2ps/dist-install/build/Key.dyn_o
2129 CC utils/hp2ps/dist-install/build/PsFile.dyn_o
2130 CC utils/hp2ps/dist-install/build/Shade.dyn_o
2131 CC utils/hp2ps/dist-install/build/Utilities.dyn_o
2132 rts_dist_HC rts/dist/build/Adjustor.o
2133 rts_dist_HC rts/dist/build/Arena.o
2134 rts_dist_HC rts/dist/build/Capability.o
2135 rts_dist_HC rts/dist/build/CheckUnload.o
2136 rts_dist_HC rts/dist/build/ClosureFlags.o
2137 rts_dist_HC rts/dist/build/Disassembler.o
2138 rts_dist_HC rts/dist/build/FileLock.o
2139 rts_dist_HC rts/dist/build/Globals.o
2140 rts_dist_HC rts/dist/build/Hash.o
2141 rts_dist_HC rts/dist/build/Heap.o
2142 rts_dist_HC rts/dist/build/Hpc.o
2143 rts_dist_HC rts/dist/build/HsFFI.o
2144 rts_dist_HC rts/dist/build/Inlines.o
2145 rts_dist_HC rts/dist/build/LdvProfile.o
2146 rts_dist_HC rts/dist/build/Interpreter.o
2147 rts_dist_HC rts/dist/build/Libdw.o
2148 rts_dist_HC rts/dist/build/LibdwPool.o
2149 rts_dist_HC rts/dist/build/Linker.o
2150 rts_dist_HC rts/dist/build/Messages.o
2151 rts_dist_HC rts/dist/build/OldARMAtomic.o
2152 rts_dist_HC rts/dist/build/PathUtils.o
2153 rts_dist_HC rts/dist/build/Pool.o
2154 rts_dist_HC rts/dist/build/Printer.o
2155 rts_dist_HC rts/dist/build/ProfHeap.o
2156 rts_dist_HC rts/dist/build/ProfilerReport.o
2157 rts_dist_HC rts/dist/build/ProfilerReportJson.o
2158 rts_dist_HC rts/dist/build/Profiling.o
2159 rts_dist_HC rts/dist/build/Proftimer.o
2160 rts_dist_HC rts/dist/build/RaiseAsync.o
2161 rts_dist_HC rts/dist/build/RetainerProfile.o
2162 rts_dist_HC rts/dist/build/RetainerSet.o
2163 rts_dist_HC rts/dist/build/RtsAPI.o
2164 rts_dist_HC rts/dist/build/RtsDllMain.o
2165 rts_dist_HC rts/dist/build/RtsFlags.o
2166 rts_dist_HC rts/dist/build/RtsMain.o
2167 rts_dist_HC rts/dist/build/RtsMessages.o
2168 rts_dist_HC rts/dist/build/RtsStartup.o
2169 rts_dist_HC rts/dist/build/RtsSymbolInfo.o
2170 rts_dist_HC rts/dist/build/RtsSymbols.o
2171 rts_dist_HC rts/dist/build/RtsUtils.o
2172 rts_dist_HC rts/dist/build/STM.o
2173 rts_dist_HC rts/dist/build/Schedule.o
2174 rts_dist_HC rts/dist/build/Sparks.o
2175 rts_dist_HC rts/dist/build/Stable.o
2176 rts_dist_HC rts/dist/build/StaticPtrTable.o
2177 rts_dist_HC rts/dist/build/Stats.o
2178 rts_dist_HC rts/dist/build/StgCRun.o
2179 rts_dist_HC rts/dist/build/StgPrimFloat.o
2180 rts_dist_HC rts/dist/build/Task.o
2181 rts_dist_HC rts/dist/build/ThreadLabels.o
2182 rts_dist_HC rts/dist/build/ThreadPaused.o
2183 rts_dist_HC rts/dist/build/Threads.o
2184 rts_dist_HC rts/dist/build/Ticky.o
2185 rts_dist_HC rts/dist/build/Timer.o
2186 rts_dist_HC rts/dist/build/TopHandler.o
2187 rts_dist_HC rts/dist/build/Trace.o
2188 rts_dist_HC rts/dist/build/WSDeque.o
2189 rts_dist_HC rts/dist/build/Weak.o
2190 rts_dist_HC rts/dist/build/fs.o
2191 rts_dist_HC rts/dist/build/xxhash.o
2192 rts_dist_HC rts/dist/build/Apply.o
2193 rts_dist_HC rts/dist/build/Compact.o
2194 rts_dist_HC rts/dist/build/Exception.o
2195 rts_dist_HC rts/dist/build/HeapStackCheck.o
2196 rts_dist_HC rts/dist/build/PrimOps.o
2197 rts_dist_HC rts/dist/build/StgMiscClosures.o
2198 rts_dist_HC rts/dist/build/StgStartup.o
2199 rts_dist_HC rts/dist/build/StgStdThunks.o
2200 rts_dist_HC rts/dist/build/Updates.o
2201 HC [stage 0] utils/genapply/dist/build/Main.o
2202 rts_dist_HC rts/dist/build/Adjustor.dyn_o
2203 rts_dist_HC rts/dist/build/Arena.dyn_o
2204 rts_dist_HC rts/dist/build/Capability.dyn_o
2205 rts_dist_HC rts/dist/build/CheckUnload.dyn_o
2206 rts_dist_HC rts/dist/build/ClosureFlags.dyn_o
2207 rts_dist_HC rts/dist/build/Disassembler.dyn_o
2208 rts_dist_HC rts/dist/build/FileLock.dyn_o
2209 rts_dist_HC rts/dist/build/Globals.dyn_o
2210 rts_dist_HC rts/dist/build/Hash.dyn_o
2211 rts_dist_HC rts/dist/build/Heap.dyn_o
2212 rts_dist_HC rts/dist/build/Hpc.dyn_o
2213 rts_dist_HC rts/dist/build/HsFFI.dyn_o
2214 rts_dist_HC rts/dist/build/Inlines.dyn_o
2215 rts_dist_HC rts/dist/build/Interpreter.dyn_o
2216 rts_dist_HC rts/dist/build/LdvProfile.dyn_o
2217 rts_dist_HC rts/dist/build/Libdw.dyn_o
2218 rts_dist_HC rts/dist/build/LibdwPool.dyn_o
2219 rts_dist_HC rts/dist/build/Linker.dyn_o
2220 rts_dist_HC rts/dist/build/Messages.dyn_o
2221 rts_dist_HC rts/dist/build/OldARMAtomic.dyn_o
2222 rts_dist_HC rts/dist/build/PathUtils.dyn_o
2223 rts_dist_HC rts/dist/build/Pool.dyn_o
2224 rts_dist_HC rts/dist/build/Printer.dyn_o
2225 rts_dist_HC rts/dist/build/ProfHeap.dyn_o
2226 rts_dist_HC rts/dist/build/ProfilerReport.dyn_o
2227 rts_dist_HC rts/dist/build/ProfilerReportJson.dyn_o
2228 rts_dist_HC rts/dist/build/Profiling.dyn_o
2229 rts_dist_HC rts/dist/build/Proftimer.dyn_o
2230 rts_dist_HC rts/dist/build/RaiseAsync.dyn_o
2231 rts_dist_HC rts/dist/build/RetainerProfile.dyn_o
2232 rts_dist_HC rts/dist/build/RetainerSet.dyn_o
2233 rts_dist_HC rts/dist/build/RtsAPI.dyn_o
2234 rts_dist_HC rts/dist/build/RtsDllMain.dyn_o
2235 rts_dist_HC rts/dist/build/RtsFlags.dyn_o
2236 rts_dist_HC rts/dist/build/RtsMain.dyn_o
2237 rts_dist_HC rts/dist/build/RtsMessages.dyn_o
2238 rts_dist_HC rts/dist/build/RtsStartup.dyn_o
2239 rts_dist_HC rts/dist/build/RtsSymbolInfo.dyn_o
2240 rts_dist_HC rts/dist/build/RtsSymbols.dyn_o
2241 rts_dist_HC rts/dist/build/RtsUtils.dyn_o
2242 rts_dist_HC rts/dist/build/STM.dyn_o
2243 rts_dist_HC rts/dist/build/Schedule.dyn_o
2244 rts_dist_HC rts/dist/build/Sparks.dyn_o
2245 rts_dist_HC rts/dist/build/Stable.dyn_o
2246 rts_dist_HC rts/dist/build/StaticPtrTable.dyn_o
2247 rts_dist_HC rts/dist/build/Stats.dyn_o
2248 rts_dist_HC rts/dist/build/StgCRun.dyn_o
2249 rts_dist_HC rts/dist/build/StgPrimFloat.dyn_o
2250 rts_dist_HC rts/dist/build/Task.dyn_o
2251 rts_dist_HC rts/dist/build/ThreadLabels.dyn_o
2252 rts_dist_HC rts/dist/build/ThreadPaused.dyn_o
2253 rts_dist_HC rts/dist/build/Threads.dyn_o
2254 rts_dist_HC rts/dist/build/Ticky.dyn_o
2255 rts_dist_HC rts/dist/build/Timer.dyn_o
2256 rts_dist_HC rts/dist/build/Trace.dyn_o
2257 rts_dist_HC rts/dist/build/TopHandler.dyn_o
2258 rts_dist_HC rts/dist/build/WSDeque.dyn_o
2259 rts_dist_HC rts/dist/build/Weak.dyn_o
2260 rts_dist_HC rts/dist/build/fs.dyn_o
2261 rts_dist_HC rts/dist/build/xxhash.dyn_o
2262 rts_dist_HC rts/dist/build/hooks/FlagDefaults.dyn_o
2263 rts_dist_HC rts/dist/build/hooks/LongGCSync.dyn_o
2264 rts_dist_HC rts/dist/build/hooks/MallocFail.dyn_o
2265 rts_dist_HC rts/dist/build/hooks/OnExit.dyn_o
2266 rts_dist_HC rts/dist/build/hooks/OutOfHeap.dyn_o
2267 rts_dist_HC rts/dist/build/hooks/StackOverflow.dyn_o
2268 rts_dist_HC rts/dist/build/sm/BlockAlloc.dyn_o
2269 rts_dist_HC rts/dist/build/sm/CNF.dyn_o
2270 rts_dist_HC rts/dist/build/sm/Compact.dyn_o
2271 rts_dist_HC rts/dist/build/sm/Evac.dyn_o
2272 rts_dist_HC rts/dist/build/sm/Evac_thr.dyn_o
2273 rts_dist_HC rts/dist/build/sm/GC.dyn_o
2274 rts_dist_HC rts/dist/build/sm/GCAux.dyn_o
2275 rts_dist_HC rts/dist/build/sm/GCUtils.dyn_o
2276 rts_dist_HC rts/dist/build/sm/MBlock.dyn_o
2277 rts_dist_HC rts/dist/build/sm/MarkWeak.dyn_o
2278 rts_dist_HC rts/dist/build/sm/Sanity.dyn_o
2279 rts_dist_HC rts/dist/build/sm/Scav.dyn_o
2280 rts_dist_HC rts/dist/build/sm/Scav_thr.dyn_o
2281 rts_dist_HC rts/dist/build/sm/Storage.dyn_o
2282 rts_dist_HC rts/dist/build/sm/Sweep.dyn_o
2283 rts_dist_HC rts/dist/build/eventlog/EventLog.dyn_o
2284 rts_dist_HC rts/dist/build/eventlog/EventLogWriter.dyn_o
2285 rts_dist_HC rts/dist/build/linker/CacheFlush.dyn_o
2286 rts_dist_HC rts/dist/build/linker/Elf.dyn_o
2287 rts_dist_HC rts/dist/build/linker/LoadArchive.dyn_o
2288 rts_dist_HC rts/dist/build/linker/M32Alloc.dyn_o
2289 rts_dist_HC rts/dist/build/linker/MachO.dyn_o
2290 rts_dist_HC rts/dist/build/linker/PEi386.dyn_o
2291 rts_dist_HC rts/dist/build/linker/SymbolExtras.dyn_o
2292 rts_dist_HC rts/dist/build/linker/elf_got.dyn_o
2293 rts_dist_HC rts/dist/build/linker/elf_plt.dyn_o
2294 rts_dist_HC rts/dist/build/linker/elf_plt_aarch64.dyn_o
2295 rts_dist_HC rts/dist/build/linker/elf_plt_arm.dyn_o
2296 rts_dist_HC rts/dist/build/linker/elf_reloc.dyn_o
2297 rts_dist_HC rts/dist/build/linker/elf_reloc_aarch64.dyn_o
2298 rts_dist_HC rts/dist/build/linker/elf_util.dyn_o
2299 rts_dist_HC rts/dist/build/posix/GetEnv.dyn_o
2300 rts_dist_HC rts/dist/build/posix/GetTime.dyn_o
2301 rts_dist_HC rts/dist/build/posix/Itimer.dyn_o
2302 rts_dist_HC rts/dist/build/posix/OSMem.dyn_o
2303 rts_dist_HC rts/dist/build/posix/OSThreads.dyn_o
2304 rts_dist_HC rts/dist/build/posix/Select.dyn_o
2305 rts_dist_HC rts/dist/build/posix/Signals.dyn_o
2306 rts_dist_HC rts/dist/build/posix/TTY.dyn_o
2307 rts_dist_HC rts/dist/build/Apply.dyn_o
2308 rts_dist_HC rts/dist/build/Compact.dyn_o
2309 rts_dist_HC rts/dist/build/Exception.dyn_o
2310 rts_dist_HC rts/dist/build/HeapStackCheck.dyn_o
2311 rts_dist_HC rts/dist/build/PrimOps.dyn_o
2312 rts_dist_HC rts/dist/build/StgMiscClosures.dyn_o
2313 rts_dist_HC rts/dist/build/StgStartup.dyn_o
2314 rts_dist_HC rts/dist/build/StgStdThunks.dyn_o
2315 rts_dist_HC rts/dist/build/Updates.dyn_o
2316 rts_dist_HC rts/dist/build/Adjustor.l_o
2317 rts_dist_HC rts/dist/build/Arena.l_o
2318 rts_dist_HC rts/dist/build/Capability.l_o
2319 rts_dist_HC rts/dist/build/CheckUnload.l_o
2320 rts_dist_HC rts/dist/build/ClosureFlags.l_o
2321 rts_dist_HC rts/dist/build/Disassembler.l_o
2322 rts_dist_HC rts/dist/build/FileLock.l_o
2323 rts_dist_HC rts/dist/build/Globals.l_o
2324 rts_dist_HC rts/dist/build/Heap.l_o
2325 rts_dist_HC rts/dist/build/Hash.l_o
2326 rts_dist_HC rts/dist/build/Hpc.l_o
2327 rts_dist_HC rts/dist/build/HsFFI.l_o
2328 rts_dist_HC rts/dist/build/Inlines.l_o
2329 rts_dist_HC rts/dist/build/Interpreter.l_o
2330 rts_dist_HC rts/dist/build/LdvProfile.l_o
2331 rts_dist_HC rts/dist/build/Libdw.l_o
2332 rts_dist_HC rts/dist/build/LibdwPool.l_o
2333 rts_dist_HC rts/dist/build/Linker.l_o
2334 rts_dist_HC rts/dist/build/Messages.l_o
2335 rts_dist_HC rts/dist/build/OldARMAtomic.l_o
2336 rts_dist_HC rts/dist/build/PathUtils.l_o
2337 rts_dist_HC rts/dist/build/Pool.l_o
2338 rts_dist_HC rts/dist/build/Printer.l_o
2339 rts_dist_HC rts/dist/build/ProfHeap.l_o
2340 rts_dist_HC rts/dist/build/ProfilerReport.l_o
2341 rts_dist_HC rts/dist/build/ProfilerReportJson.l_o
2342 rts_dist_HC rts/dist/build/Profiling.l_o
2343 rts_dist_HC rts/dist/build/Proftimer.l_o
2344 rts_dist_HC rts/dist/build/RaiseAsync.l_o
2345 rts_dist_HC rts/dist/build/RetainerProfile.l_o
2346 rts_dist_HC rts/dist/build/RetainerSet.l_o
2347 rts_dist_HC rts/dist/build/RtsAPI.l_o
2348 rts_dist_HC rts/dist/build/RtsDllMain.l_o
2349 rts_dist_HC rts/dist/build/RtsFlags.l_o
2350 rts_dist_HC rts/dist/build/RtsMain.l_o
2351 rts_dist_HC rts/dist/build/RtsMessages.l_o
2352 rts_dist_HC rts/dist/build/RtsStartup.l_o
2353 rts_dist_HC rts/dist/build/RtsSymbolInfo.l_o
2354 rts_dist_HC rts/dist/build/RtsSymbols.l_o
2355 rts_dist_HC rts/dist/build/RtsUtils.l_o
2356 rts_dist_HC rts/dist/build/STM.l_o
2357 rts_dist_HC rts/dist/build/Schedule.l_o
2358 rts_dist_HC rts/dist/build/Sparks.l_o
2359 rts_dist_HC rts/dist/build/Stable.l_o
2360 rts_dist_HC rts/dist/build/StaticPtrTable.l_o
2361 rts_dist_HC rts/dist/build/Stats.l_o
2362 rts_dist_HC rts/dist/build/StgCRun.l_o
2363 rts_dist_HC rts/dist/build/StgPrimFloat.l_o
2364 rts_dist_HC rts/dist/build/Task.l_o
2365 rts_dist_HC rts/dist/build/ThreadLabels.l_o
2366 rts_dist_HC rts/dist/build/ThreadPaused.l_o
2367 rts_dist_HC rts/dist/build/Threads.l_o
2368 rts_dist_HC rts/dist/build/Ticky.l_o
2369 rts_dist_HC rts/dist/build/Timer.l_o
2370 rts_dist_HC rts/dist/build/TopHandler.l_o
2371 rts_dist_HC rts/dist/build/Trace.l_o
2372 rts_dist_HC rts/dist/build/WSDeque.l_o
2373 rts_dist_HC rts/dist/build/Weak.l_o
2374 rts_dist_HC rts/dist/build/fs.l_o
2375 rts_dist_HC rts/dist/build/xxhash.l_o
2376 rts_dist_HC rts/dist/build/hooks/FlagDefaults.l_o
2377 rts_dist_HC rts/dist/build/hooks/LongGCSync.l_o
2378 rts_dist_HC rts/dist/build/hooks/MallocFail.l_o
2379 rts_dist_HC rts/dist/build/hooks/OnExit.l_o
2380 rts_dist_HC rts/dist/build/hooks/OutOfHeap.l_o
2381 rts_dist_HC rts/dist/build/hooks/StackOverflow.l_o
2382 rts_dist_HC rts/dist/build/sm/BlockAlloc.l_o
2383 rts_dist_HC rts/dist/build/sm/CNF.l_o
2384 rts_dist_HC rts/dist/build/sm/Compact.l_o
2385 rts_dist_HC rts/dist/build/sm/Evac.l_o
2386 rts_dist_HC rts/dist/build/sm/Evac_thr.l_o
2387 rts_dist_HC rts/dist/build/sm/GC.l_o
2388 rts_dist_HC rts/dist/build/sm/GCAux.l_o
2389 rts_dist_HC rts/dist/build/sm/GCUtils.l_o
2390 rts_dist_HC rts/dist/build/sm/MBlock.l_o
2391 rts_dist_HC rts/dist/build/sm/MarkWeak.l_o
2392 rts_dist_HC rts/dist/build/sm/Sanity.l_o
2393 rts_dist_HC rts/dist/build/sm/Scav.l_o
2394 rts_dist_HC rts/dist/build/sm/Scav_thr.l_o
2395 rts_dist_HC rts/dist/build/sm/Storage.l_o
2396 rts_dist_HC rts/dist/build/sm/Sweep.l_o
2397 rts_dist_HC rts/dist/build/eventlog/EventLog.l_o
2398 rts_dist_HC rts/dist/build/eventlog/EventLogWriter.l_o
2399 rts_dist_HC rts/dist/build/linker/CacheFlush.l_o
2400 rts_dist_HC rts/dist/build/linker/Elf.l_o
2401 rts_dist_HC rts/dist/build/linker/LoadArchive.l_o
2402 rts_dist_HC rts/dist/build/linker/M32Alloc.l_o
2403 rts_dist_HC rts/dist/build/linker/MachO.l_o
2404 rts_dist_HC rts/dist/build/linker/PEi386.l_o
2405 rts_dist_HC rts/dist/build/linker/SymbolExtras.l_o
2406 rts_dist_HC rts/dist/build/linker/elf_got.l_o
2407 rts_dist_HC rts/dist/build/linker/elf_plt.l_o
2408 rts_dist_HC rts/dist/build/linker/elf_plt_aarch64.l_o
2409 rts_dist_HC rts/dist/build/linker/elf_plt_arm.l_o
2410 rts_dist_HC rts/dist/build/linker/elf_reloc.l_o
2411 rts_dist_HC rts/dist/build/linker/elf_reloc_aarch64.l_o
2412 rts_dist_HC rts/dist/build/linker/elf_util.l_o
2413 rts_dist_HC rts/dist/build/posix/GetEnv.l_o
2414 rts_dist_HC rts/dist/build/posix/GetTime.l_o
2415 rts_dist_HC rts/dist/build/posix/Itimer.l_o
2416 rts_dist_HC rts/dist/build/posix/OSMem.l_o
2417 rts_dist_HC rts/dist/build/posix/OSThreads.l_o
2418 rts_dist_HC rts/dist/build/posix/Select.l_o
2419 rts_dist_HC rts/dist/build/posix/Signals.l_o
2420 rts_dist_HC rts/dist/build/posix/TTY.l_o
2421 rts_dist_HC rts/dist/build/Apply.l_o
2422 rts_dist_HC rts/dist/build/Compact.l_o
2423 rts_dist_HC rts/dist/build/Exception.l_o
2424 rts_dist_HC rts/dist/build/HeapStackCheck.l_o
2425 rts_dist_HC rts/dist/build/PrimOps.l_o
2426 rts_dist_HC rts/dist/build/StgMiscClosures.l_o
2427 rts_dist_HC rts/dist/build/StgStartup.l_o
2428 rts_dist_HC rts/dist/build/StgStdThunks.l_o
2429 rts_dist_HC rts/dist/build/Updates.l_o
2430 rts_dist_HC rts/dist/build/Adjustor.debug_o
2431 rts_dist_HC rts/dist/build/Arena.debug_o
2432 rts_dist_HC rts/dist/build/Capability.debug_o
2433

Drydock: Prepare tree

When
Completed at Aug 5 2018, 7:23 PM · Built for 12 s
Status
Passed

Build Log 290480 (remote - stderr)
25 - 50 - 100 - Unlimited Lines

1+ git clean -qxfd
2+ git submodule sync
3+ git submodule update --init --recursive
4+ git submodule foreach -q git clean -qxfd
5

Build Log 290479 (remote - stdout)
25 - 50 - 100 - Unlimited Lines

1Synchronizing submodule url for '.arc-linters/arcanist-external-json-linter'
2Synchronizing submodule url for 'hadrian'
3Synchronizing submodule url for 'libffi-tarballs'
4Synchronizing submodule url for 'libraries/Cabal'
5Synchronizing submodule url for 'libraries/Win32'
6Synchronizing submodule url for 'libraries/array'
7Synchronizing submodule url for 'libraries/binary'
8Synchronizing submodule url for 'libraries/bytestring'
9Synchronizing submodule url for 'libraries/containers'
10Synchronizing submodule url for 'libraries/deepseq'
11Synchronizing submodule url for 'libraries/directory'
12Synchronizing submodule url for 'libraries/filepath'
13Synchronizing submodule url for 'libraries/haskeline'
14Synchronizing submodule url for 'libraries/hpc'
15Synchronizing submodule url for 'libraries/integer-gmp/gmp/gmp-tarballs'
16Synchronizing submodule url for 'libraries/mtl'
17Synchronizing submodule url for 'libraries/parallel'
18Synchronizing submodule url for 'libraries/parsec'
19Synchronizing submodule url for 'libraries/pretty'
20Synchronizing submodule url for 'libraries/process'
21Synchronizing submodule url for 'libraries/stm'
22Synchronizing submodule url for 'libraries/terminfo'
23Synchronizing submodule url for 'libraries/text'
24Synchronizing submodule url for 'libraries/time'
25Synchronizing submodule url for 'libraries/transformers'
26Synchronizing submodule url for 'libraries/unix'
27Synchronizing submodule url for 'libraries/xhtml'
28Synchronizing submodule url for 'nofib'
29Synchronizing submodule url for 'utils/haddock'
30Synchronizing submodule url for 'utils/hsc2hs'
31Submodule path 'hadrian': checked out 'a63ad3294b5d51eec50d454810a314c0b2a696c7'
32Submodule path 'libraries/Cabal': checked out '8fbacca029f3ad764576aefb610a0408c4b6aaad'
33Submodule path 'libraries/binary': checked out 'ecf48c4589b927de3ae3fff8455c1c25140df7e9'
34Submodule path 'libraries/filepath': checked out '1be834e1b3a3f8c5a14a58d73ce30133b4c69679'
35Submodule path 'libraries/terminfo': checked out '72a08c5435c332bdfd0444dd3ab3fad96e401da1'
36Submodule path 'utils/haddock': checked out '612f44f9a582b1f7c8a9ba709651bce83692b60b'
37

Lease Working Copy

When
Completed at Aug 5 2018, 7:23 PM · Built for 1 w, 1 d
Status
Passed
Description

Lease a working copy for OSX/amd64 builds.