Build 50717

Drydock: Build

When
Completed at Aug 5 2018, 7:46 PM · Built for 22 m, 58 s
Status
Failed
Description

Run the build.

Build Log 290482 (remote - stderr)
25 - 50 - 100 - Unlimited Lines

404Makefile:1804: warning: overriding commands for target `libffi.map'
405Makefile:672: warning: ignoring old commands for target `libffi.map'
406unused terminals: 2
407ld: warning: could not create compact unwind for _ffi_call_unix64: does not use RBP or RSP based frame
408Makefile:3406: warning: overriding commands for target `libffi.map'
409Makefile:731: warning: ignoring old commands for target `libffi.map'
410Makefile:1804: warning: overriding commands for target `libffi.map'
411Makefile:672: warning: ignoring old commands for target `libffi.map'
412Makefile:1804: warning: overriding commands for target `libffi.map'
413Makefile:672: warning: ignoring old commands for target `libffi.map'
414Makefile:1804: warning: overriding commands for target `libffi.map'
415Makefile:672: warning: ignoring old commands for target `libffi.map'
416Configured with: --prefix=/Applications/Xcode-7.2/Xcode.app/Contents/Developer/usr --with-gxx-include-dir=/usr/include/c++/4.2.1
417clang: error: optimization flag '-fkeep-inline-functions' is not supported
418clang: error: optimization flag '-fkeep-inline-functions' is not supported
419`gcc' failed in phase `C Compiler'. (Exit code: 1)
420`gcc' failed in phase `C Compiler'. (Exit code: 1)
421make[1]: *** [rts/dist/build/Adjustor.debug_o] Error 1
422make[1]: *** Waiting for unfinished jobs....
423make[1]: *** [rts/dist/build/Arena.debug_o] Error 1
424clang: error: optimization flag '-fkeep-inline-functions' is not supported
425`gcc' failed in phase `C Compiler'. (Exit code: 1)
426make[1]: *** [rts/dist/build/Capability.debug_o] Error 1
427make: *** [all] Error 2
428

Build Log 290481 (remote - stdout)
25 - 50 - 100 - Unlimited Lines

2408 rts_dist_HC rts/dist/build/linker/elf_plt_arm.l_o
2409 rts_dist_HC rts/dist/build/linker/elf_reloc.l_o
2410 rts_dist_HC rts/dist/build/linker/elf_reloc_aarch64.l_o
2411 rts_dist_HC rts/dist/build/linker/elf_util.l_o
2412 rts_dist_HC rts/dist/build/posix/GetEnv.l_o
2413 rts_dist_HC rts/dist/build/posix/GetTime.l_o
2414 rts_dist_HC rts/dist/build/posix/Itimer.l_o
2415 rts_dist_HC rts/dist/build/posix/OSMem.l_o
2416 rts_dist_HC rts/dist/build/posix/OSThreads.l_o
2417 rts_dist_HC rts/dist/build/posix/Select.l_o
2418 rts_dist_HC rts/dist/build/posix/Signals.l_o
2419 rts_dist_HC rts/dist/build/posix/TTY.l_o
2420 rts_dist_HC rts/dist/build/Apply.l_o
2421 rts_dist_HC rts/dist/build/Compact.l_o
2422 rts_dist_HC rts/dist/build/Exception.l_o
2423 rts_dist_HC rts/dist/build/HeapStackCheck.l_o
2424 rts_dist_HC rts/dist/build/PrimOps.l_o
2425 rts_dist_HC rts/dist/build/StgMiscClosures.l_o
2426 rts_dist_HC rts/dist/build/StgStartup.l_o
2427 rts_dist_HC rts/dist/build/StgStdThunks.l_o
2428 rts_dist_HC rts/dist/build/Updates.l_o
2429 rts_dist_HC rts/dist/build/Adjustor.debug_o
2430 rts_dist_HC rts/dist/build/Arena.debug_o
2431 rts_dist_HC rts/dist/build/Capability.debug_o
2432

Drydock: Prepare tree

When
Completed at Aug 5 2018, 7:23 PM · Built for 12 s
Status
Passed

Build Log 290480 (remote - stderr)
25 - 50 - 100 - Unlimited Lines

1+ git clean -qxfd
2+ git submodule sync
3+ git submodule update --init --recursive
4+ git submodule foreach -q git clean -qxfd
5

Build Log 290479 (remote - stdout)
25 - 50 - 100 - Unlimited Lines

12Synchronizing submodule url for 'libraries/haskeline'
13Synchronizing submodule url for 'libraries/hpc'
14Synchronizing submodule url for 'libraries/integer-gmp/gmp/gmp-tarballs'
15Synchronizing submodule url for 'libraries/mtl'
16Synchronizing submodule url for 'libraries/parallel'
17Synchronizing submodule url for 'libraries/parsec'
18Synchronizing submodule url for 'libraries/pretty'
19Synchronizing submodule url for 'libraries/process'
20Synchronizing submodule url for 'libraries/stm'
21Synchronizing submodule url for 'libraries/terminfo'
22Synchronizing submodule url for 'libraries/text'
23Synchronizing submodule url for 'libraries/time'
24Synchronizing submodule url for 'libraries/transformers'
25Synchronizing submodule url for 'libraries/unix'
26Synchronizing submodule url for 'libraries/xhtml'
27Synchronizing submodule url for 'nofib'
28Synchronizing submodule url for 'utils/haddock'
29Synchronizing submodule url for 'utils/hsc2hs'
30Submodule path 'hadrian': checked out 'a63ad3294b5d51eec50d454810a314c0b2a696c7'
31Submodule path 'libraries/Cabal': checked out '8fbacca029f3ad764576aefb610a0408c4b6aaad'
32Submodule path 'libraries/binary': checked out 'ecf48c4589b927de3ae3fff8455c1c25140df7e9'
33Submodule path 'libraries/filepath': checked out '1be834e1b3a3f8c5a14a58d73ce30133b4c69679'
34Submodule path 'libraries/terminfo': checked out '72a08c5435c332bdfd0444dd3ab3fad96e401da1'
35Submodule path 'utils/haddock': checked out '612f44f9a582b1f7c8a9ba709651bce83692b60b'
36

Lease Working Copy

When
Completed at Aug 5 2018, 7:23 PM · Built for 1 w, 1 d
Status
Passed
Description

Lease a working copy for OSX/amd64 builds.