Build 50697

Drydock: Build

When
Completed at Jul 27 2018, 5:04 PM · Built for 22 m, 59 s
Status
Failed
Description

Run the build.

Build Log 287957 (remote - stderr)
25 - 50 - 100 - Unlimited Lines

404Makefile:1804: warning: overriding commands for target `libffi.map'
405Makefile:672: warning: ignoring old commands for target `libffi.map'
406ld: warning: could not create compact unwind for _ffi_call_unix64: does not use RBP or RSP based frame
407Makefile:3406: warning: overriding commands for target `libffi.map'
408Makefile:731: warning: ignoring old commands for target `libffi.map'
409unused terminals: 2
410Makefile:1804: warning: overriding commands for target `libffi.map'
411Makefile:672: warning: ignoring old commands for target `libffi.map'
412Makefile:1804: warning: overriding commands for target `libffi.map'
413Makefile:672: warning: ignoring old commands for target `libffi.map'
414Makefile:1804: warning: overriding commands for target `libffi.map'
415Makefile:672: warning: ignoring old commands for target `libffi.map'
416Configured with: --prefix=/Applications/Xcode-7.2/Xcode.app/Contents/Developer/usr --with-gxx-include-dir=/usr/include/c++/4.2.1
417clang: error: optimization flag '-fkeep-inline-functions' is not supported
418`gcc' failed in phase `C Compiler'. (Exit code: 1)
419make[1]: *** [rts/dist/build/Adjustor.debug_o] Error 1
420make[1]: *** Waiting for unfinished jobs....
421clang: error: optimization flag '-fkeep-inline-functions' is not supported
422`gcc' failed in phase `C Compiler'. (Exit code: 1)
423clang: error: optimization flag '-fkeep-inline-functions' is not supported
424`gcc' failed in phase `C Compiler'. (Exit code: 1)
425make[1]: *** [rts/dist/build/Capability.debug_o] Error 1
426make[1]: *** [rts/dist/build/Arena.debug_o] Error 1
427make: *** [all] Error 2
428

Build Log 287956 (remote - stdout)
25 - 50 - 100 - Unlimited Lines

2408 rts_dist_HC rts/dist/build/linker/elf_plt_arm.l_o
2409 rts_dist_HC rts/dist/build/linker/elf_reloc.l_o
2410 rts_dist_HC rts/dist/build/linker/elf_reloc_aarch64.l_o
2411 rts_dist_HC rts/dist/build/linker/elf_util.l_o
2412 rts_dist_HC rts/dist/build/posix/GetEnv.l_o
2413 rts_dist_HC rts/dist/build/posix/GetTime.l_o
2414 rts_dist_HC rts/dist/build/posix/Itimer.l_o
2415 rts_dist_HC rts/dist/build/posix/OSMem.l_o
2416 rts_dist_HC rts/dist/build/posix/OSThreads.l_o
2417 rts_dist_HC rts/dist/build/posix/Select.l_o
2418 rts_dist_HC rts/dist/build/posix/Signals.l_o
2419 rts_dist_HC rts/dist/build/posix/TTY.l_o
2420 rts_dist_HC rts/dist/build/Apply.l_o
2421 rts_dist_HC rts/dist/build/Compact.l_o
2422 rts_dist_HC rts/dist/build/Exception.l_o
2423 rts_dist_HC rts/dist/build/HeapStackCheck.l_o
2424 rts_dist_HC rts/dist/build/PrimOps.l_o
2425 rts_dist_HC rts/dist/build/StgMiscClosures.l_o
2426 rts_dist_HC rts/dist/build/StgStartup.l_o
2427 rts_dist_HC rts/dist/build/StgStdThunks.l_o
2428 rts_dist_HC rts/dist/build/Updates.l_o
2429 rts_dist_HC rts/dist/build/Adjustor.debug_o
2430 rts_dist_HC rts/dist/build/Capability.debug_o
2431 rts_dist_HC rts/dist/build/Arena.debug_o
2432

Drydock: Prepare tree

When
Completed at Jul 27 2018, 4:41 PM · Built for 10 s
Status
Passed

Build Log 287955 (remote - stderr)
25 - 50 - 100 - Unlimited Lines

1+ git clean -qxfd
2+ git submodule sync
3+ git submodule update --init --recursive
4+ git submodule foreach -q git clean -qxfd
5

Build Log 287954 (remote - stdout)
25 - 50 - 100 - Unlimited Lines

7Synchronizing submodule url for 'libraries/bytestring'
8Synchronizing submodule url for 'libraries/containers'
9Synchronizing submodule url for 'libraries/deepseq'
10Synchronizing submodule url for 'libraries/directory'
11Synchronizing submodule url for 'libraries/filepath'
12Synchronizing submodule url for 'libraries/haskeline'
13Synchronizing submodule url for 'libraries/hpc'
14Synchronizing submodule url for 'libraries/integer-gmp/gmp/gmp-tarballs'
15Synchronizing submodule url for 'libraries/mtl'
16Synchronizing submodule url for 'libraries/parallel'
17Synchronizing submodule url for 'libraries/parsec'
18Synchronizing submodule url for 'libraries/pretty'
19Synchronizing submodule url for 'libraries/process'
20Synchronizing submodule url for 'libraries/stm'
21Synchronizing submodule url for 'libraries/terminfo'
22Synchronizing submodule url for 'libraries/text'
23Synchronizing submodule url for 'libraries/time'
24Synchronizing submodule url for 'libraries/transformers'
25Synchronizing submodule url for 'libraries/unix'
26Synchronizing submodule url for 'libraries/xhtml'
27Synchronizing submodule url for 'nofib'
28Synchronizing submodule url for 'utils/haddock'
29Synchronizing submodule url for 'utils/hsc2hs'
30Submodule path 'utils/haddock': checked out '612f44f9a582b1f7c8a9ba709651bce83692b60b'
31

Lease Working Copy

When
Completed at Jul 27 2018, 4:40 PM · Built for 1 m, 29 s
Status
Passed
Description

Lease a working copy for OSX/amd64 builds.