Build 50273

Properties

Drydock: Testsuite

When
Completed at Jul 19 2018, 9:10 AM · Built for 20 s
Status
Passed

Build Log 286344 (remote - stderr)
25 - 50 - 100 - Unlimited Lines

1using THREADS=5
2cat: testsuite_summary_stage1.txt: No such file or directory
3

Build Log 286343 (remote - stdout)
25 - 50 - 100 - Unlimited Lines

1[1 of 1] Compiling Main ( ..\mk\ghc-config.hs, ..\mk\ghc-config.o )
2Linking ../mk/ghc-config.exe ...
3Looks like you don't have timeout, building it first...
4[1 of 1] Compiling Main ( Setup.hs, Setup.o )
5Linking Setup.exe ...
6C://msys64//var//drydock//workingcopy-121279//repo//glasgow-haskell-compiler//bindisttest//install dir//mingw//bin/ld.exe: final link failed: No space left on device
7collect2.exe: error: ld returned 1 exit status
8`gcc.exe' failed in phase `Linker'. (Exit code: 1)
9make[1]: *** [Makefile:40: install-inplace/bin/timeout] Error 1
10make: *** [../mk/test.mk:323: ../timeout/install-inplace/bin/timeout.exe] Error 2
11Looks like you don't have timeout, building it first...
12Linking Setup.exe ...
13C://msys64//var//drydock//workingcopy-121279//repo//glasgow-haskell-compiler//inplace//mingw//bin/ld.exe: final link failed: No space left on device
14collect2.exe: error: ld returned 1 exit status
15`gcc.exe' failed in phase `Linker'. (Exit code: 1)
16make[1]: *** [Makefile:40: install-inplace/bin/timeout] Error 1
17make: *** [../../mk/test.mk:323: ../../timeout/install-inplace/bin/timeout.exe] Error 2
18
19==== STAGE 1 TESTS ====
20

Drydock: Build

When
Completed at Jul 19 2018, 9:10 AM · Built for 1 h, 16 m
Status
Passed

Build Log 286334 (remote - stderr)
25 - 50 - 100 - Unlimited Lines

706 Data.Functor.Compose, Data.Functor.Const, Data.Functor.Identity,
707 Data.Functor.Product, Data.Functor.Sum, Data.Monoid,
708 Data.Semigroup, Data.Semigroup.Internal, Data.Version, Data.Void,
709 GHC.Exts, GHC.Generics, GHC.IO.Exception, Data.Graph,
710 Data.IntMap.Internal, Data.IntSet.Internal, Data.Map.Internal,
711 Data.Sequence.Internal, Data.Set.Internal, Data.Tree,
712 Text.PrettyPrint.Annotated.HughesPJ, Text.PrettyPrint.HughesPJ,
713 Data.Text, Data.Text.Lazy]
714 []
715Warning: -rtsopts and -with-rtsopts have no effect with -no-hs-main.
716 Call hs_init_ghc() from your main() function to set these options.
717C:\msys64\var\drydock\workingcopy-121279\repo\glasgow-haskell-compiler\inplace\mingw\bin\ar.exe: creating compiler/stage2/build/libHSghc-8.7.a
718Warning: -rtsopts and -with-rtsopts have no effect with -no-hs-main.
719 Call hs_init_ghc() from your main() function to set these options.
720C:\msys64\var\drydock\workingcopy-121279\repo\glasgow-haskell-compiler\inplace\mingw\bin\ar.exe: creating libraries/parallel/dist-install/build/libHSparallel-3.2.2.0.a
721Warning: include-dirs: C:\msys64\var\drydock\workingcopy-121279\repo\glasgow-haskell-compiler\compiler\stage2\build\utils doesn't exist or isn't a directory
722Warning: include-dirs: C:\msys64\var\drydock\workingcopy-121279\repo\glasgow-haskell-compiler\compiler\stage2\build\../rts/dist/build doesn't exist or isn't a directory
723Warning: include-dirs: C:\msys64\var\drydock\workingcopy-121279\repo\glasgow-haskell-compiler\compiler\stage2\build\stage2 doesn't exist or isn't a directory
724Warning: include-dirs: C:\msys64\var\drydock\workingcopy-121279\repo\glasgow-haskell-compiler\libraries\haskeline\dist-install\build\includes doesn't exist or isn't a directory
725Warning: include-dirs: C:\msys64\var\drydock\workingcopy-121279\repo\glasgow-haskell-compiler\libraries\text\dist-install\build\include doesn't exist or isn't a directory
726Warning: include-dirs: C:\msys64\var\drydock\workingcopy-121279\repo\glasgow-haskell-compiler\libraries\Win32\dist-install\build\include doesn't exist or isn't a directory
727Warning: include-dirs: C:\msys64\var\drydock\workingcopy-121279\repo\glasgow-haskell-compiler\libraries\containers\dist-install\build\include doesn't exist or isn't a directory
728Warning: include-dirs: C:\msys64\var\drydock\workingcopy-121279\repo\glasgow-haskell-compiler\libraries\bytestring\dist-install\build\include doesn't exist or isn't a directory
729rts-1.0: Warning: .:479:1: The field "hugs-options" is deprecated. hugs isn't supported anymore
730

Build Log 286333 (remote - stdout)
25 - 50 - 100 - Unlimited Lines

11763 defList (Text\XHtml\Extras.hs:91)
11764 widget (Text\XHtml\Extras.hs:99)
11765 checkbox (Text\XHtml\Extras.hs:103)
11766 hidden (Text\XHtml\Extras.hs:104)
11767 radio (Text\XHtml\Extras.hs:105)
11768 reset (Text\XHtml\Extras.hs:106)
11769 submit (Text\XHtml\Extras.hs:107)
11770 password (Text\XHtml\Extras.hs:108)
11771 textfield (Text\XHtml\Extras.hs:109)
11772 afile (Text\XHtml\Extras.hs:110)
11773 clickmap (Text\XHtml\Extras.hs:111)
11774 menu (Text\XHtml\Extras.hs:124)
11775 gui (Text\XHtml\Extras.hs:128)
11776 71% ( 5 / 7) in 'Text.XHtml'
11777 Missing documentation for:
11778 treeHtml (Text\XHtml\Debug.hs:24)
11779 treeColors (Text\XHtml\Debug.hs:64)
11780Installing library in C:/msys64/var/drydock/workingcopy-121279/repo/glasgow-haskell-compiler/bindisttest/install dir\x86_64-windows-ghc-8.7.20180719\xhtml-3000.2.2.1-FbbswYqHoHjI6bfJsZmh8z
11781Registering library for xhtml-3000.2.2.1..
11782cleaning...
11783-------------------------------------------------------------------
11784Congratulations! This tree has compiled successfully.
11785
11786You can now test your new compiler using ./validate --testsuite-only.
11787

Drydock: Prepare tree

When
Completed at Jul 19 2018, 7:53 AM · Built for 46 s
Status
Passed

Build Log 286332 (remote - stderr)
25 - 50 - 100 - Unlimited Lines

1+ git clean -qxfd
2+ git submodule foreach git checkout .
3+ git submodule foreach git clean -qxfd
4+ git submodule sync
5+ git submodule update --init --recursive
6+ git submodule foreach -q git clean -qxfd
7

Build Log 286331 (remote - stdout)
25 - 50 - 100 - Unlimited Lines

66Synchronizing submodule url for 'libraries/binary'
67Synchronizing submodule url for 'libraries/bytestring'
68Synchronizing submodule url for 'libraries/containers'
69Synchronizing submodule url for 'libraries/deepseq'
70Synchronizing submodule url for 'libraries/directory'
71Synchronizing submodule url for 'libraries/filepath'
72Synchronizing submodule url for 'libraries/haskeline'
73Synchronizing submodule url for 'libraries/hpc'
74Synchronizing submodule url for 'libraries/integer-gmp/gmp/gmp-tarballs'
75Synchronizing submodule url for 'libraries/mtl'
76Synchronizing submodule url for 'libraries/parallel'
77Synchronizing submodule url for 'libraries/parsec'
78Synchronizing submodule url for 'libraries/pretty'
79Synchronizing submodule url for 'libraries/process'
80Synchronizing submodule url for 'libraries/stm'
81Synchronizing submodule url for 'libraries/terminfo'
82Synchronizing submodule url for 'libraries/text'
83Synchronizing submodule url for 'libraries/time'
84Synchronizing submodule url for 'libraries/transformers'
85Synchronizing submodule url for 'libraries/unix'
86Synchronizing submodule url for 'libraries/xhtml'
87Synchronizing submodule url for 'nofib'
88Synchronizing submodule url for 'utils/haddock'
89Synchronizing submodule url for 'utils/hsc2hs'
90

Lease Working Copy

When
Completed at Jul 19 2018, 7:52 AM · Built for 3 h, 6 m
Status
Passed