Build 49649

Properties

Drydock: Testsuite

When
Completed at Jul 11 2018, 8:32 AM · Built for 30 s
Status
Passed

Build Log 283928 (remote - stderr)
25 - 50 - 100 - Unlimited Lines

1using THREADS=5
2cat: testsuite_summary_stage1.txt: No such file or directory
3

Build Log 283927 (remote - stdout)
25 - 50 - 100 - Unlimited Lines

4Linking Setup.exe ...
5Configuring timeout-1...
6Preprocessing executable 'timeout' for timeout-1..
7Building executable 'timeout' for timeout-1..
8[1 of 2] Compiling WinCBindings ( dist\build\timeout\timeout-tmp\WinCBindings.hs, dist\build\timeout\timeout-tmp\WinCBindings.o )
9[2 of 2] Compiling Main ( timeout.hs, dist\build\timeout\timeout-tmp\Main.o )
10Linking dist\build\timeout\timeout.exe ...
11C://msys64//var//drydock//workingcopy-121273//repo//glasgow-haskell-compiler//bindisttest//install dir//mingw//bin/ld.exe: final link failed: No space left on device
12collect2.exe: error: ld returned 1 exit status
13`gcc.exe' failed in phase `Linker'. (Exit code: 1)
14make[1]: *** [Makefile:42: install-inplace/bin/timeout] Error 1
15make: *** [../mk/test.mk:323: ../timeout/install-inplace/bin/timeout.exe] Error 2
16Looks like you don't have timeout, building it first...
17Configuring timeout-1...
18Preprocessing executable 'timeout' for timeout-1..
19Building executable 'timeout' for timeout-1..
20Linking dist\build\timeout\timeout.exe ...
21C://msys64//var//drydock//workingcopy-121273//repo//glasgow-haskell-compiler//inplace//mingw//bin/ld.exe: final link failed: No space left on device
22collect2.exe: error: ld returned 1 exit status
23`gcc.exe' failed in phase `Linker'. (Exit code: 1)
24make[1]: *** [Makefile:42: install-inplace/bin/timeout] Error 1
25make: *** [../../mk/test.mk:323: ../../timeout/install-inplace/bin/timeout.exe] Error 2
26
27==== STAGE 1 TESTS ====
28

Drydock: Build

When
Completed at Jul 11 2018, 8:31 AM · Built for 1 h, 20 m
Status
Passed

Build Log 283912 (remote - stderr)
25 - 50 - 100 - Unlimited Lines

633 Data.Functor.Product, Data.Functor.Sum, Data.Monoid,
634 Data.Semigroup, Data.Semigroup.Internal, Data.Version, Data.Void,
635 GHC.Exts, GHC.Generics, GHC.IO.Exception, Data.Graph,
636 Data.IntMap.Internal, Data.IntSet.Internal, Data.Map.Internal,
637 Data.Sequence.Internal, Data.Set.Internal, Data.Tree,
638 Text.PrettyPrint.Annotated.HughesPJ, Text.PrettyPrint.HughesPJ,
639 Data.Text, Data.Text.Lazy]
640 []
641Warning: -rtsopts and -with-rtsopts have no effect with -no-hs-main.
642 Call hs_init_ghc() from your main() function to set these options.
643C:\msys64\var\drydock\workingcopy-121273\repo\glasgow-haskell-compiler\inplace\mingw\bin\ar.exe: creating compiler/stage2/build/libHSghc-8.7.a
644Warning: -rtsopts and -with-rtsopts have no effect with -no-hs-main.
645 Call hs_init_ghc() from your main() function to set these options.
646C:\msys64\var\drydock\workingcopy-121273\repo\glasgow-haskell-compiler\inplace\mingw\bin\ar.exe: creating libraries/parallel/dist-install/build/libHSparallel-3.2.1.1.a
647C:\msys64\var\drydock\workingcopy-121273\repo\glasgow-haskell-compiler\inplace\mingw\bin\ar.exe: creating libraries/random/dist-install/build/libHSrandom-1.1.a
648Warning: include-dirs: C:\msys64\var\drydock\workingcopy-121273\repo\glasgow-haskell-compiler\compiler\stage2\build\utils doesn't exist or isn't a directory
649Warning: include-dirs: C:\msys64\var\drydock\workingcopy-121273\repo\glasgow-haskell-compiler\compiler\stage2\build\../rts/dist/build doesn't exist or isn't a directory
650Warning: include-dirs: C:\msys64\var\drydock\workingcopy-121273\repo\glasgow-haskell-compiler\compiler\stage2\build\stage2 doesn't exist or isn't a directory
651Warning: include-dirs: C:\msys64\var\drydock\workingcopy-121273\repo\glasgow-haskell-compiler\libraries\haskeline\dist-install\build\includes doesn't exist or isn't a directory
652Warning: include-dirs: C:\msys64\var\drydock\workingcopy-121273\repo\glasgow-haskell-compiler\libraries\text\dist-install\build\include doesn't exist or isn't a directory
653Warning: include-dirs: C:\msys64\var\drydock\workingcopy-121273\repo\glasgow-haskell-compiler\libraries\Win32\dist-install\build\include doesn't exist or isn't a directory
654Warning: include-dirs: C:\msys64\var\drydock\workingcopy-121273\repo\glasgow-haskell-compiler\libraries\containers\dist-install\build\include doesn't exist or isn't a directory
655Warning: include-dirs: C:\msys64\var\drydock\workingcopy-121273\repo\glasgow-haskell-compiler\libraries\bytestring\dist-install\build\include doesn't exist or isn't a directory
656rts-1.0: Warning: .:479:1: The field "hugs-options" is deprecated. hugs isn't supported anymore
657

Build Log 283911 (remote - stdout)
25 - 50 - 100 - Unlimited Lines

11777 defList (Text\XHtml\Extras.hs:91)
11778 widget (Text\XHtml\Extras.hs:99)
11779 checkbox (Text\XHtml\Extras.hs:103)
11780 hidden (Text\XHtml\Extras.hs:104)
11781 radio (Text\XHtml\Extras.hs:105)
11782 reset (Text\XHtml\Extras.hs:106)
11783 submit (Text\XHtml\Extras.hs:107)
11784 password (Text\XHtml\Extras.hs:108)
11785 textfield (Text\XHtml\Extras.hs:109)
11786 afile (Text\XHtml\Extras.hs:110)
11787 clickmap (Text\XHtml\Extras.hs:111)
11788 menu (Text\XHtml\Extras.hs:124)
11789 gui (Text\XHtml\Extras.hs:128)
11790 71% ( 5 / 7) in 'Text.XHtml'
11791 Missing documentation for:
11792 treeHtml (Text\XHtml\Debug.hs:24)
11793 treeColors (Text\XHtml\Debug.hs:64)
11794Installing library in C:/msys64/var/drydock/workingcopy-121273/repo/glasgow-haskell-compiler/bindisttest/install dir\x86_64-windows-ghc-8.7.20180711\xhtml-3000.2.2-DvkubWCxbtz3CZ1J2h4nG5
11795Registering library for xhtml-3000.2.2..
11796cleaning...
11797-------------------------------------------------------------------
11798Congratulations! This tree has compiled successfully.
11799
11800You can now test your new compiler using ./validate --testsuite-only.
11801

Drydock: Prepare tree

When
Completed at Jul 11 2018, 7:11 AM · Built for 30 s
Status
Passed

Build Log 283910 (remote - stderr)
25 - 50 - 100 - Unlimited Lines

1+ git clean -qxfd
2+ git submodule foreach git checkout .
3+ git submodule foreach git clean -qxfd
4+ git submodule sync
5+ git submodule update --init --recursive
6+ git submodule foreach -q git clean -qxfd
7

Build Log 283909 (remote - stdout)
25 - 50 - 100 - Unlimited Lines

70Synchronizing submodule url for 'libraries/containers'
71Synchronizing submodule url for 'libraries/deepseq'
72Synchronizing submodule url for 'libraries/directory'
73Synchronizing submodule url for 'libraries/filepath'
74Synchronizing submodule url for 'libraries/haskeline'
75Synchronizing submodule url for 'libraries/hpc'
76Synchronizing submodule url for 'libraries/integer-gmp/gmp/gmp-tarballs'
77Synchronizing submodule url for 'libraries/mtl'
78Synchronizing submodule url for 'libraries/parallel'
79Synchronizing submodule url for 'libraries/parsec'
80Synchronizing submodule url for 'libraries/pretty'
81Synchronizing submodule url for 'libraries/process'
82Synchronizing submodule url for 'libraries/random'
83Synchronizing submodule url for 'libraries/stm'
84Synchronizing submodule url for 'libraries/terminfo'
85Synchronizing submodule url for 'libraries/text'
86Synchronizing submodule url for 'libraries/time'
87Synchronizing submodule url for 'libraries/transformers'
88Synchronizing submodule url for 'libraries/unix'
89Synchronizing submodule url for 'libraries/xhtml'
90Synchronizing submodule url for 'nofib'
91Synchronizing submodule url for 'utils/haddock'
92Synchronizing submodule url for 'utils/hsc2hs'
93Submodule path 'libraries/bytestring': checked out 'ce3c6a01cd9e2438358108e3e4b515304b5ce5a6'
94

Lease Working Copy

When
Completed at Jul 11 2018, 7:10 AM · Built for 3 h, 46 m
Status
Passed