Build 49548

Properties

Drydock: Build

When
Completed at Jul 21 2018, 6:04 PM · Built for 53 m, 54 s
Status
Failed
Description

Run the build.

Build Log 286970 (remote - stderr)
25 - 50 - 100 - Unlimited Lines

617 Call hs_init_ghc() from your main() function to set these options.
618Warning: -rtsopts and -with-rtsopts have no effect with -shared.
619 Call hs_init_ghc() from your main() function to set these options.
620Warning: -rtsopts and -with-rtsopts have no effect with -shared.
621 Call hs_init_ghc() from your main() function to set these options.
622Warning: -rtsopts and -with-rtsopts have no effect with -shared.
623 Call hs_init_ghc() from your main() function to set these options.
624
625compiler/llvmGen/LlvmCodeGen/CodeGen.hs:1166:22: error: [-Wincomplete-patterns, -Werror=incomplete-patterns]
626 Pattern match(es) are non-exhaustive
627 In a case alternative: Patterns not matched: (MO_VF_Broadcast _ _)
628 |
6291166 | genMachOp _ op [x] = case op of
630 | ^^^^^^^^^^...
631
632compiler/llvmGen/LlvmCodeGen/CodeGen.hs:1374:32: error: [-Wincomplete-patterns, -Werror=incomplete-patterns]
633 Pattern match(es) are non-exhaustive
634 In a case alternative: Patterns not matched: (MO_VF_Broadcast _ _)
635 |
6361374 | genMachOp_slow opt op [x, y] = case op of
637 | ^^^^^^^^^^...
638make[1]: *** [compiler/stage2/build/LlvmCodeGen/CodeGen.o] Error 1
639make[1]: *** Waiting for unfinished jobs....
640make: *** [all] Error 2
641

Build Log 286969 (remote - stdout)
25 - 50 - 100 - Unlimited Lines

4925 HC [stage 1] libraries/Cabal/Cabal/dist-install/build/Distribution/ParseUtils.o
4926 HC [stage 1] compiler/stage2/build/LlvmCodeGen/Regs.o
4927 HC [stage 1] compiler/stage2/build/StgCmmTicky.o
4928 HC [stage 1] compiler/stage2/build/StgCmmEnv.o
4929 HC [stage 1] compiler/stage2/build/RegAlloc/Linear/JoinToTargets.o
4930 HC [stage 1] compiler/stage2/build/SPARC/CodeGen/Amode.o
4931 HC [stage 1] compiler/stage2/build/SPARC/CodeGen/CondCode.o
4932 HC [stage 1] compiler/stage2/build/StgCmmProf.o
4933 HC [stage 1] libraries/Cabal/Cabal/dist-install/build/Distribution/Types/PackageName.o
4934 HC [stage 1] libraries/Cabal/Cabal/dist-install/build/Distribution/Types/LegacyExeDependency.o
4935 HC [stage 1] libraries/Cabal/Cabal/dist-install/build/Distribution/PrettyUtils.o
4936 HC [stage 1] compiler/stage2/build/LlvmCodeGen/Base.o
4937 HC [stage 1] compiler/stage2/build/StgCmmLayout.o
4938 HC [stage 1] compiler/stage2/build/RegAlloc/Linear/Main.o
4939 HC [stage 1] compiler/stage2/build/SPARC/CodeGen/Gen64.o
4940 HC [stage 1] libraries/Cabal/Cabal/dist-install/build/Distribution/Types/PackageId.o
4941 HC [stage 1] libraries/Cabal/Cabal/dist-install/build/Distribution/Types/UnqualComponentName.o
4942 HC [stage 1] libraries/Cabal/Cabal/dist-install/build/Distribution/Types/Mixin.o
4943 HC [stage 1] libraries/Cabal/Cabal/dist-install/build/Distribution/Types/ModuleReexport.o
4944 HC [stage 1] compiler/stage2/build/SysTools/Tasks.o
4945 HC [stage 1] compiler/stage2/build/ByteCodeInstr.o
4946 HC [stage 1] compiler/stage2/build/LlvmCodeGen/Data.o
4947 HC [stage 1] compiler/stage2/build/LlvmCodeGen/CodeGen.o
4948 HC [stage 1] compiler/stage2/build/SPARC/CodeGen/Gen32.o
4949

Drydock: Prepare tree

When
Completed at Jul 21 2018, 5:10 PM · Built for 13 s
Status
Passed

Build Log 286968 (remote - stderr)
25 - 50 - 100 - Unlimited Lines

1+ git clean -qxfd
2+ git submodule sync
3+ git submodule update --init --recursive
4warning: unable to rmdir docs/_extensions/haddock-autolink: Directory not empty
5+ git submodule foreach -q git clean -qxfd
6

Build Log 286967 (remote - stdout)
25 - 50 - 100 - Unlimited Lines

22Synchronizing submodule url for 'libraries/random'
23Synchronizing submodule url for 'libraries/stm'
24Synchronizing submodule url for 'libraries/terminfo'
25Synchronizing submodule url for 'libraries/text'
26Synchronizing submodule url for 'libraries/time'
27Synchronizing submodule url for 'libraries/transformers'
28Synchronizing submodule url for 'libraries/unix'
29Synchronizing submodule url for 'libraries/vector'
30Synchronizing submodule url for 'libraries/xhtml'
31Synchronizing submodule url for 'nofib'
32Synchronizing submodule url for 'utils/haddock'
33Synchronizing submodule url for 'utils/hsc2hs'
34Submodule path 'hadrian': checked out '7c3c45f4539af8e75764a1c100dfbb35a86f4be3'
35Submodule path 'libraries/Cabal': checked out 'cbdb135bdadab9595f1a80be4c65453b49a9dde2'
36Submodule path 'libraries/binary': checked out 'd4a030ab448191f664fc734bfbee61450a6fa5af'
37Submodule path 'libraries/containers': checked out 'a57e7dd0c0aa6a719a73085ae30edef8206ccea0'
38Submodule path 'libraries/haskeline': checked out '481b890e8616d9e85da69173d5079ad49f9fb83d'
39Submodule path 'libraries/hpc': checked out '91f520cb9725d812fa93b57bca1d8dbd72c88dd5'
40Submodule path 'libraries/parallel': checked out 'd08911d1748b0c6bd0dbde282acc164c94bb0d83'
41Submodule path 'libraries/process': checked out '78c338b2ad06f0a3ed4ace7d95cc68ddb87ab207'
42Submodule path 'libraries/stm': checked out '33a36c33de150f562a98803e2fc332f07bb29457'
43Submodule path 'nofib': checked out '1364fe623f9216108a285a8804a27bdd8dfea3c4'
44Submodule path 'utils/haddock': checked out '46ff2306f580c44915a6f3adb652f02b7f4edfe9'
45Submodule path 'utils/hsc2hs': checked out 'b8588039f3810e2d0f52e9afdb15998992ee38b1'
46

Lease Working Copy

When
Completed at Jul 21 2018, 5:10 PM · Built for 1 w, 4 d
Status
Passed
Description

Lease a working copy for OSX/amd64 builds.