Build 49547

Properties

Drydock: Build

When
Completed at Jul 9 2018, 11:24 PM · Built for 57 m, 26 s
Status
Failed

Build Log 283516 (remote - stderr)
25 - 50 - 100 - Unlimited Lines

515WARNING: file compiler\\simplCore\\SimplCore.hs, line 706
516 Simplifier bailing out after 4 iterations [57, 2, 1, 1]
517 Size = {terms: 687, types: 903, coercions: 12, joins: 0/27}
518C:\msys64\var\drydock\workingcopy-121273\repo\glasgow-haskell-compiler\inplace\mingw\bin\ar.exe: creating libraries/haskeline/dist-install/build/libHShaskeline-0.7.4.2.a
519C:\msys64\var\drydock\workingcopy-121273\repo\glasgow-haskell-compiler\inplace\mingw\bin\ar.exe: creating libraries/parsec/dist-install/build/libHSparsec-3.1.13.0.0.0.0.0.a
520C:\msys64\var\drydock\workingcopy-121273\repo\glasgow-haskell-compiler\inplace\mingw\bin\ar.exe: creating libraries/text/dist-install/build/libHStext-1.2.3.0.a
521C:\msys64\var\drydock\workingcopy-121273\repo\glasgow-haskell-compiler\inplace\mingw\bin\ar.exe: creating libraries/ghci/dist-install/build/libHSghci-8.5.a
522
523compiler\llvmGen\LlvmCodeGen\CodeGen.hs:1166:22: error: [-Wincomplete-patterns, -Werror=incomplete-patterns]
524 Pattern match(es) are non-exhaustive
525 In a case alternative: Patterns not matched: (MO_VF_Broadcast _ _)
526 |
5271166 | genMachOp _ op [x] = case op of
528 | ^^^^^^^^^^...
529
530compiler\llvmGen\LlvmCodeGen\CodeGen.hs:1374:32: error: [-Wincomplete-patterns, -Werror=incomplete-patterns]
531 Pattern match(es) are non-exhaustive
532 In a case alternative: Patterns not matched: (MO_VF_Broadcast _ _)
533 |
5341374 | genMachOp_slow opt op [x, y] = case op of
535 | ^^^^^^^^^^...
536make[1]: *** [compiler/ghc.mk:447: compiler/stage2/build/LlvmCodeGen/CodeGen.o] Error 1
537make[1]: *** Waiting for unfinished jobs....
538make: *** [Makefile:127: all] Error 2
539

Build Log 283515 (remote - stdout)
25 - 50 - 100 - Unlimited Lines

6136 HC [stage 1] compiler/stage2/build/SPARC/CodeGen/CondCode.o
6137 HC [stage 1] compiler/stage2/build/X86/CodeGen.o
6138 HC [stage 1] compiler/stage2/build/StgCmmProf.o
6139 HC [stage 1] libraries/Cabal/Cabal/dist-install/build/Distribution/Types/PackageId.o
6140 HC [stage 1] libraries/Cabal/Cabal/dist-install/build/Distribution/Types/UnqualComponentName.o
6141 HC [stage 1] libraries/Cabal/Cabal/dist-install/build/Distribution/Types/Mixin.o
6142 HC [stage 1] libraries/Cabal/Cabal/dist-install/build/Distribution/Types/ModuleReexport.o
6143 HC [stage 1] compiler/stage2/build/LlvmCodeGen/Base.o
6144 HC [stage 1] compiler/stage2/build/StgCmmLayout.o
6145 HC [stage 1] compiler/stage2/build/RegAlloc/Linear/Main.o
6146 HC [stage 1] compiler/stage2/build/SPARC/CodeGen/Gen64.o
6147 HC [stage 1] libraries/Cabal/Cabal/dist-install/build/Distribution/Types/UnitId.o
6148 HC [stage 1] libraries/Cabal/Cabal/dist-install/build/Distribution/Simple/Utils.o
6149 HC [stage 1] libraries/Cabal/Cabal/dist-install/build/Distribution/Types/ComponentName.o
6150 HC [stage 1] libraries/Cabal/Cabal/dist-install/build/Distribution/Types/MungedPackageName.o
6151 HC [stage 1] libraries/Cabal/Cabal/dist-install/build/Distribution/Types/Dependency.o
6152 HC [stage 1] libraries/Cabal/Cabal/dist-install/build/Distribution/Types/PackageId/Lens.o
6153 HC [stage 1] libraries/Cabal/Cabal/dist-install/build/Distribution/Simple/GHC/IPIConvert.o
6154 HC [stage 1] compiler/stage2/build/SysTools/Tasks.o
6155 HC [stage 1] compiler/stage2/build/ByteCodeInstr.o
6156 HC [stage 1] compiler/stage2/build/LlvmCodeGen/Data.o
6157 HC [stage 1] compiler/stage2/build/LlvmCodeGen/CodeGen.o
6158 HC [stage 1] compiler/stage2/build/SPARC/CodeGen/Gen32.o
6159 HC [stage 1] compiler/stage2/build/StgCmmForeign.o
6160

Drydock: Prepare tree

When
Completed at Jul 9 2018, 10:27 PM · Built for 1 m, 6 s
Status
Passed

Build Log 283514 (remote - stderr)
25 - 50 - 100 - Unlimited Lines

1+ git clean -qxfd
2+ git submodule foreach git checkout .
3+ git submodule foreach git clean -qxfd
4+ git submodule sync
5+ git submodule update --init --recursive
6warning: unable to rmdir docs/_extensions/haddock-autolink: Directory not empty
7+ git submodule foreach -q git clean -qxfd
8

Build Log 283513 (remote - stdout)
25 - 50 - 100 - Unlimited Lines

90Synchronizing submodule url for 'libraries/random'
91Synchronizing submodule url for 'libraries/stm'
92Synchronizing submodule url for 'libraries/terminfo'
93Synchronizing submodule url for 'libraries/text'
94Synchronizing submodule url for 'libraries/time'
95Synchronizing submodule url for 'libraries/transformers'
96Synchronizing submodule url for 'libraries/unix'
97Synchronizing submodule url for 'libraries/vector'
98Synchronizing submodule url for 'libraries/xhtml'
99Synchronizing submodule url for 'nofib'
100Synchronizing submodule url for 'utils/haddock'
101Synchronizing submodule url for 'utils/hsc2hs'
102Submodule path 'hadrian': checked out '7c3c45f4539af8e75764a1c100dfbb35a86f4be3'
103Submodule path 'libraries/Cabal': checked out 'cbdb135bdadab9595f1a80be4c65453b49a9dde2'
104Submodule path 'libraries/binary': checked out 'd4a030ab448191f664fc734bfbee61450a6fa5af'
105Submodule path 'libraries/containers': checked out 'a57e7dd0c0aa6a719a73085ae30edef8206ccea0'
106Submodule path 'libraries/haskeline': checked out '481b890e8616d9e85da69173d5079ad49f9fb83d'
107Submodule path 'libraries/hpc': checked out '91f520cb9725d812fa93b57bca1d8dbd72c88dd5'
108Submodule path 'libraries/parallel': checked out 'd08911d1748b0c6bd0dbde282acc164c94bb0d83'
109Submodule path 'libraries/process': checked out '78c338b2ad06f0a3ed4ace7d95cc68ddb87ab207'
110Submodule path 'libraries/stm': checked out '33a36c33de150f562a98803e2fc332f07bb29457'
111Submodule path 'nofib': checked out '1364fe623f9216108a285a8804a27bdd8dfea3c4'
112Submodule path 'utils/haddock': checked out '46ff2306f580c44915a6f3adb652f02b7f4edfe9'
113Submodule path 'utils/hsc2hs': checked out 'b8588039f3810e2d0f52e9afdb15998992ee38b1'
114

Lease Working Copy

When
Completed at Jul 9 2018, 10:26 PM · Built for 2 h, 46 s
Status
Passed