Build 49433

Drydock: Testsuite

When
Completed at Jul 7 2018, 10:57 AM · Built for 32 s
Status
Passed

Build Log 283065 (remote - stderr)
25 - 50 - 100 - Unlimited Lines

1using THREADS=5
2cat: testsuite_summary_stage1.txt: No such file or directory
3

Build Log 283064 (remote - stdout)
25 - 50 - 100 - Unlimited Lines

8Building executable 'timeout' for timeout-1..
9[1 of 2] Compiling WinCBindings ( dist\build\timeout\timeout-tmp\WinCBindings.hs, dist\build\timeout\timeout-tmp\WinCBindings.o )
10[2 of 2] Compiling Main ( timeout.hs, dist\build\timeout\timeout-tmp\Main.o )
11Linking dist\build\timeout\timeout.exe ...
12Installing executable timeout in C:/msys64/var/drydock/workingcopy-121273/repo/glasgow-haskell-compiler/testsuite/timeout/install-inplace\bin
13Warning: The directory
14C:/msys64/var/drydock/workingcopy-121273/repo/glasgow-haskell-compiler/testsuite/timeout/install-inplace\bin
15is not in the system search path.
16copyFile: resource exhausted (There is not enough space on the disk.)
17make[1]: *** [Makefile:43: install-inplace/bin/timeout] Error 1
18make: *** [../mk/test.mk:323: ../timeout/install-inplace/bin/timeout.exe] Error 2
19Looks like you don't have timeout, building it first...
20Configuring timeout-1...
21Preprocessing executable 'timeout' for timeout-1..
22Building executable 'timeout' for timeout-1..
23Installing executable timeout in C:/msys64/var/drydock/workingcopy-121273/repo/glasgow-haskell-compiler/testsuite/timeout/install-inplace\bin
24Warning: The directory
25C:/msys64/var/drydock/workingcopy-121273/repo/glasgow-haskell-compiler/testsuite/timeout/install-inplace\bin
26is not in the system search path.
27copyFile: resource exhausted (There is not enough space on the disk.)
28make[1]: *** [Makefile:43: install-inplace/bin/timeout] Error 1
29make: *** [../../mk/test.mk:323: ../../timeout/install-inplace/bin/timeout.exe] Error 2
30
31==== STAGE 1 TESTS ====
32

Drydock: Build

When
Completed at Jul 7 2018, 10:56 AM · Built for 1 h, 20 m
Status
Passed

Build Log 283051 (remote - stderr)
25 - 50 - 100 - Unlimited Lines

637 Data.Functor.Product, Data.Functor.Sum, Data.Monoid,
638 Data.Semigroup, Data.Semigroup.Internal, Data.Version, Data.Void,
639 GHC.Exts, GHC.Generics, GHC.IO.Exception, Data.Graph,
640 Data.IntMap.Internal, Data.IntSet.Internal, Data.Map.Internal,
641 Data.Sequence.Internal, Data.Set.Internal, Data.Tree,
642 Text.PrettyPrint.Annotated.HughesPJ, Text.PrettyPrint.HughesPJ,
643 Data.Text, Data.Text.Lazy]
644 []
645Warning: -rtsopts and -with-rtsopts have no effect with -no-hs-main.
646 Call hs_init_ghc() from your main() function to set these options.
647C:\msys64\var\drydock\workingcopy-121273\repo\glasgow-haskell-compiler\inplace\mingw\bin\ar.exe: creating compiler/stage2/build/libHSghc-8.7.a
648Warning: -rtsopts and -with-rtsopts have no effect with -no-hs-main.
649 Call hs_init_ghc() from your main() function to set these options.
650C:\msys64\var\drydock\workingcopy-121273\repo\glasgow-haskell-compiler\inplace\mingw\bin\ar.exe: creating libraries/parallel/dist-install/build/libHSparallel-3.2.1.1.a
651C:\msys64\var\drydock\workingcopy-121273\repo\glasgow-haskell-compiler\inplace\mingw\bin\ar.exe: creating libraries/random/dist-install/build/libHSrandom-1.1.a
652Warning: include-dirs: C:\msys64\var\drydock\workingcopy-121273\repo\glasgow-haskell-compiler\compiler\stage2\build\utils doesn't exist or isn't a directory
653Warning: include-dirs: C:\msys64\var\drydock\workingcopy-121273\repo\glasgow-haskell-compiler\compiler\stage2\build\../rts/dist/build doesn't exist or isn't a directory
654Warning: include-dirs: C:\msys64\var\drydock\workingcopy-121273\repo\glasgow-haskell-compiler\compiler\stage2\build\stage2 doesn't exist or isn't a directory
655Warning: include-dirs: C:\msys64\var\drydock\workingcopy-121273\repo\glasgow-haskell-compiler\libraries\haskeline\dist-install\build\includes doesn't exist or isn't a directory
656Warning: include-dirs: C:\msys64\var\drydock\workingcopy-121273\repo\glasgow-haskell-compiler\libraries\text\dist-install\build\include doesn't exist or isn't a directory
657Warning: include-dirs: C:\msys64\var\drydock\workingcopy-121273\repo\glasgow-haskell-compiler\libraries\Win32\dist-install\build\include doesn't exist or isn't a directory
658Warning: include-dirs: C:\msys64\var\drydock\workingcopy-121273\repo\glasgow-haskell-compiler\libraries\containers\dist-install\build\include doesn't exist or isn't a directory
659Warning: include-dirs: C:\msys64\var\drydock\workingcopy-121273\repo\glasgow-haskell-compiler\libraries\bytestring\dist-install\build\include doesn't exist or isn't a directory
660rts-1.0: Warning: .:479:1: The field "hugs-options" is deprecated. hugs isn't supported anymore
661

Build Log 283050 (remote - stdout)
25 - 50 - 100 - Unlimited Lines

11776 defList (Text\XHtml\Extras.hs:91)
11777 widget (Text\XHtml\Extras.hs:99)
11778 checkbox (Text\XHtml\Extras.hs:103)
11779 hidden (Text\XHtml\Extras.hs:104)
11780 radio (Text\XHtml\Extras.hs:105)
11781 reset (Text\XHtml\Extras.hs:106)
11782 submit (Text\XHtml\Extras.hs:107)
11783 password (Text\XHtml\Extras.hs:108)
11784 textfield (Text\XHtml\Extras.hs:109)
11785 afile (Text\XHtml\Extras.hs:110)
11786 clickmap (Text\XHtml\Extras.hs:111)
11787 menu (Text\XHtml\Extras.hs:124)
11788 gui (Text\XHtml\Extras.hs:128)
11789 71% ( 5 / 7) in 'Text.XHtml'
11790 Missing documentation for:
11791 treeHtml (Text\XHtml\Debug.hs:24)
11792 treeColors (Text\XHtml\Debug.hs:64)
11793Installing library in C:/msys64/var/drydock/workingcopy-121273/repo/glasgow-haskell-compiler/bindisttest/install dir\x86_64-windows-ghc-8.7.20180706\xhtml-3000.2.2-DvkubWCxbtz3CZ1J2h4nG5
11794Registering library for xhtml-3000.2.2..
11795cleaning...
11796-------------------------------------------------------------------
11797Congratulations! This tree has compiled successfully.
11798
11799You can now test your new compiler using ./validate --testsuite-only.
11800

Drydock: Prepare tree

When
Completed at Jul 7 2018, 9:36 AM · Built for 58 s
Status
Passed

Build Log 283049 (remote - stderr)
25 - 50 - 100 - Unlimited Lines

1+ git clean -qxfd
2+ git submodule foreach git checkout .
3+ git submodule foreach git clean -qxfd
4+ git submodule sync
5+ git submodule update --init --recursive
6+ git submodule foreach -q git clean -qxfd
7

Build Log 283048 (remote - stdout)
25 - 50 - 100 - Unlimited Lines

69Synchronizing submodule url for 'libraries/bytestring'
70Synchronizing submodule url for 'libraries/containers'
71Synchronizing submodule url for 'libraries/deepseq'
72Synchronizing submodule url for 'libraries/directory'
73Synchronizing submodule url for 'libraries/filepath'
74Synchronizing submodule url for 'libraries/haskeline'
75Synchronizing submodule url for 'libraries/hpc'
76Synchronizing submodule url for 'libraries/integer-gmp/gmp/gmp-tarballs'
77Synchronizing submodule url for 'libraries/mtl'
78Synchronizing submodule url for 'libraries/parallel'
79Synchronizing submodule url for 'libraries/parsec'
80Synchronizing submodule url for 'libraries/pretty'
81Synchronizing submodule url for 'libraries/process'
82Synchronizing submodule url for 'libraries/random'
83Synchronizing submodule url for 'libraries/stm'
84Synchronizing submodule url for 'libraries/terminfo'
85Synchronizing submodule url for 'libraries/text'
86Synchronizing submodule url for 'libraries/time'
87Synchronizing submodule url for 'libraries/transformers'
88Synchronizing submodule url for 'libraries/unix'
89Synchronizing submodule url for 'libraries/xhtml'
90Synchronizing submodule url for 'nofib'
91Synchronizing submodule url for 'utils/haddock'
92Synchronizing submodule url for 'utils/hsc2hs'
93

Lease Working Copy

When
Completed at Jul 7 2018, 9:35 AM · Built for 20 h, 37 s
Status
Passed