Build 49344

Properties

Drydock: Build

When
Completed at Jul 5 2018, 3:15 PM · Built for 24 m, 15 s
Status
Failed

Build Log 282557 (remote - stderr)
25 - 50 - 100 - Unlimited Lines

344/var/drydock/workingcopy-121262/repo/glasgow-haskell-compiler/docs/users_guide/using-optimisation.rst:: ERROR: Anonymous hyperlink mismatch: 1 references but 0 targets.
345See "backrefs" attribute for IDs.
346/var/drydock/workingcopy-121262/repo/glasgow-haskell-compiler/docs/users_guide/8.2.1-notes.rst:: WARNING: document isn't included in any toctree
347/var/drydock/workingcopy-121262/repo/glasgow-haskell-compiler/docs/users_guide/8.4.1-notes.rst:: WARNING: document isn't included in any toctree
348ar: creating rts/dist/build/libHSrts.a
349ar: creating rts/dist/build/libHSrts_l.a
350ar: creating rts/dist/build/libHSrts_debug.a
351ar: creating rts/dist/build/libHSrts_thr.a
352ar: creating rts/dist/build/libHSrts_thr_debug.a
353ar: creating rts/dist/build/libHSrts_thr_l.a
354/var/drydock/workingcopy-121262/repo/glasgow-haskell-compiler/docs/users_guide/glasgow_exts.rst:2194: WARNING: Could not lex literal_block as "haskell". Highlighting skipped.
355/var/drydock/workingcopy-121262/repo/glasgow-haskell-compiler/docs/users_guide/glasgow_exts.rst:2214: WARNING: Could not lex literal_block as "haskell". Highlighting skipped.
356/var/drydock/workingcopy-121262/repo/glasgow-haskell-compiler/docs/users_guide/glasgow_exts.rst:3755: WARNING: Could not lex literal_block as "haskell". Highlighting skipped.
357/var/drydock/workingcopy-121262/repo/glasgow-haskell-compiler/docs/users_guide/glasgow_exts.rst:8633: WARNING: Could not lex literal_block as "haskell". Highlighting skipped.
358/var/drydock/workingcopy-121262/repo/glasgow-haskell-compiler/docs/users_guide/glasgow_exts.rst:8646: WARNING: Could not lex literal_block as "haskell". Highlighting skipped.
359/var/drydock/workingcopy-121262/repo/glasgow-haskell-compiler/docs/users_guide/glasgow_exts.rst:10686: WARNING: Could not lex literal_block as "haskell". Highlighting skipped.
360/var/drydock/workingcopy-121262/repo/glasgow-haskell-compiler/docs/users_guide/glasgow_exts.rst:12021: WARNING: Could not lex literal_block as "haskell". Highlighting skipped.
361/var/drydock/workingcopy-121262/repo/glasgow-haskell-compiler/docs/users_guide/glasgow_exts.rst:12037: WARNING: Could not lex literal_block as "haskell". Highlighting skipped.
362/var/drydock/workingcopy-121262/repo/glasgow-haskell-compiler/docs/users_guide/glasgow_exts.rst:12054: WARNING: Could not lex literal_block as "haskell". Highlighting skipped.
363/var/drydock/workingcopy-121262/repo/glasgow-haskell-compiler/docs/users_guide/glasgow_exts.rst:12277: WARNING: Could not lex literal_block as "haskell". Highlighting skipped.
364/var/drydock/workingcopy-121262/repo/glasgow-haskell-compiler/docs/users_guide/separate_compilation.rst:611: WARNING: Could not lex literal_block as "haskell". Highlighting skipped.
365/var/drydock/workingcopy-121262/repo/glasgow-haskell-compiler/docs/users_guide/glasgow_exts.rst:10182: WARNING: undefined label: pattern signature equivalent pattern-equiv-form (if the link has no caption the label must precede a section header)
366ar: creating libraries/ghc-prim/dist-install/build/libHSghc-prim-0.5.3.a
367Warning: -rtsopts and -with-rtsopts have no effect with -shared.
368 Call hs_init_ghc() from your main() function to set these options.
369ar: creating libraries/integer-gmp/dist-install/build/libHSinteger-gmp-1.0.2.0.a
370Warning: -rtsopts and -with-rtsopts have no effect with -shared.
371 Call hs_init_ghc() from your main() function to set these options.
372WARNING: file compiler/stgSyn/CoreToStg.hs, line 328
373 joinLines_s4mq True False
374ar: creating libraries/ghc-boot-th/dist-install/build/libHSghc-boot-th-8.7.a
375ar: creating libraries/filepath/dist-install/build/libHSfilepath-1.4.2.a
376ar: creating libraries/ghc-heap/dist-install/build/libHSghc-heap-8.7.a
377ar: creating libraries/deepseq/dist-install/build/libHSdeepseq-1.4.4.0.a
378ar: creating libraries/base/dist-install/build/libHSbase-4.12.0.0.a
379WARNING: file compiler/simplCore/SimplCore.hs, line 977
380 Not shorting out: happyReduce
381WARNING: file compiler/simplCore/SimplCore.hs, line 977
382 Not shorting out: happyDoAction
383WARNING: file compiler/simplCore/SimplCore.hs, line 977
384 Not shorting out: happyShift
385WARNING: file compiler/simplCore/SimplCore.hs, line 977
386 Not shorting out: happyFail
387WARNING: file compiler/simplCore/SimplCore.hs, line 977
388 Not shorting out: happySpecReduce_3
389WARNING: file compiler/simplCore/SimplCore.hs, line 977
390 Not shorting out: happySpecReduce_1
391WARNING: file compiler/simplCore/SimplCore.hs, line 977
392 Not shorting out: happySpecReduce_0
393WARNING: file compiler/simplCore/SimplCore.hs, line 977
394 Not shorting out: happySpecReduce_2
395WARNING: file compiler/simplCore/SimplCore.hs, line 977
396 Not shorting out: happyGoto
397WARNING: file compiler/simplCore/SimplCore.hs, line 977
398 Not shorting out: happyReduce
399WARNING: file compiler/simplCore/SimplCore.hs, line 977
400 Not shorting out: happyDoAction
401WARNING: file compiler/simplCore/SimplCore.hs, line 977
402 Not shorting out: happyShift
403WARNING: file compiler/simplCore/SimplCore.hs, line 977
404 Not shorting out: happyFail
405WARNING: file compiler/simplCore/SimplCore.hs, line 977
406 Not shorting out: happySpecReduce_3
407WARNING: file compiler/simplCore/SimplCore.hs, line 977
408 Not shorting out: happySpecReduce_1
409WARNING: file compiler/simplCore/SimplCore.hs, line 977
410 Not shorting out: happySpecReduce_0
411WARNING: file compiler/simplCore/SimplCore.hs, line 977
412 Not shorting out: happySpecReduce_2
413WARNING: file compiler/simplCore/SimplCore.hs, line 977
414 Not shorting out: happyGoto
415ar: creating libraries/terminfo/dist-install/build/libHSterminfo-0.4.1.1.a
416Warning: -rtsopts and -with-rtsopts have no effect with -shared.
417 Call hs_init_ghc() from your main() function to set these options.
418Warning: -rtsopts and -with-rtsopts have no effect with -shared.
419 Call hs_init_ghc() from your main() function to set these options.
420Warning: -rtsopts and -with-rtsopts have no effect with -shared.
421 Call hs_init_ghc() from your main() function to set these options.
422Warning: -rtsopts and -with-rtsopts have no effect with -shared.
423 Call hs_init_ghc() from your main() function to set these options.
424ar: creating libraries/transformers/dist-install/build/libHStransformers-0.5.5.0.a
425Warning: -rtsopts and -with-rtsopts have no effect with -shared.
426 Call hs_init_ghc() from your main() function to set these options.
427ar: creating libraries/xhtml/dist-install/build/libHSxhtml-3000.2.2.a
428
429libraries/bytestring/Data/ByteString/Char8.hs:243:1: error: [-Wdeprecations, -Werror=deprecations]
430 Deprecated: "findSubstring is deprecated in favour of breakSubstring."
431 |
432243 | import Data.ByteString (empty,null,length,tail,init,append
433 | ^^^^^^^^^^^^^^^^^^^^^^^^^^^^^^^^^^^^^^^^^^^^^^^^^^^^^^^^^^...
434
435libraries/bytestring/Data/ByteString/Char8.hs:243:1: error: [-Wdeprecations, -Werror=deprecations]
436 Deprecated: "findSubstrings is deprecated in favour of breakSubstring."
437 |
438243 | import Data.ByteString (empty,null,length,tail,init,append
439 | ^^^^^^^^^^^^^^^^^^^^^^^^^^^^^^^^^^^^^^^^^^^^^^^^^^^^^^^^^^...
440make[1]: *** [libraries/bytestring/dist-install/build/Data/ByteString/Char8.o] Error 1
441make[1]: *** Waiting for unfinished jobs....
442make: *** [all] Error 2
443

Build Log 282556 (remote - stdout)
25 - 50 - 100 - Unlimited Lines

4283 HC [stage 1] libraries/text/dist-install/build/Data/Text/Internal/Search.o
4284 HC [stage 1] libraries/text/dist-install/build/Data/Text/Unsafe.o
4285 HC [stage 1] libraries/text/dist-install/build/Data/Text/Internal/Fusion/Size.o
4286 HC [stage 1] libraries/text/dist-install/build/Data/Text/Encoding/Error.o
4287 HC [stage 1] libraries/mtl/dist-install/build/Control/Monad/Identity.o
4288 HC [stage 1] libraries/mtl/dist-install/build/Control/Monad/List.o
4289 HC [stage 1] libraries/xhtml/dist-install/build/Text/XHtml/Table.o
4290 HC [stage 1] libraries/xhtml/dist-install/build/Text/XHtml/Extras.o
4291 LD_NO_GOLD libraries/terminfo/dist-install/build/HSterminfo-0.4.1.1.o
4292 HC [stage 1] utils/hsc2hs/dist-install/build/C.dyn_o
4293 HC [stage 1] libraries/time/dist-install/build/Data/Time/Clock/Internal/UTCTime.o
4294 HC [stage 1] libraries/time/dist-install/build/Data/Time/Clock/Internal/SystemTime.o
4295 HC [stage 1] libraries/time/dist-install/build/Data/Time/Clock/Internal/AbsoluteTime.o
4296 HC [stage 1] libraries/time/dist-install/build/Data/Time/Clock/Internal/NominalDiffTime.o
4297 HC [stage 1] libraries/time/dist-install/build/Data/Time/Calendar/OrdinalDate.o
4298 HC [stage 1] libraries/containers/dist-install/build/Data/Set.o
4299 HC [stage 1] libraries/containers/dist-install/build/Data/IntMap/Internal.o
4300 HC [stage 1] libraries/bytestring/dist-install/build/Data/ByteString/Unsafe.o
4301 HC [stage 1] libraries/array/dist-install/build/Data/Array/IArray.o
4302 HC [stage 1] libraries/array/dist-install/build/Data/Array/MArray/Safe.o
4303 HC [stage 1] libraries/array/dist-install/build/Data/Array/MArray.o
4304 HC [stage 1] libraries/containers/dist-install/build/Data/Map/Internal.o
4305 HC [stage 1] libraries/array/dist-install/build/Data/Array/IO/Internals.o
4306 HC [stage 1] libraries/bytestring/dist-install/build/Data/ByteString/Short/Internal.o
4307 HC [stage 1] libraries/binary/dist-install/build/Data/Binary/Internal.o
4308 HC [stage 1] libraries/containers/dist-install/build/Data/IntSet.o
4309 HC [stage 1] compiler/stage2/build/SysTools/BaseDir.o
4310 HC [stage 1] libraries/pretty/dist-install/build/Text/PrettyPrint/HughesPJ.o
4311 HC [stage 1] libraries/process/dist-install/build/System/Process/Internals.o
4312 HC [stage 1] compiler/stage2/build/Ctype.o
4313 HC [stage 1] compiler/stage2/build/PPC/Cond.o
4314 HC [stage 1] libraries/haskeline/dist-install/build/System/Console/Haskeline/MonadException.o
4315 HC [stage 1] libraries/stm/dist-install/build/Control/Concurrent/STM/TArray.o
4316 HC [stage 1] libraries/base/dist-install/build/libHSbase-4.12.0.0-ghc8.7.20180705.so
4317 HC [stage 1] libraries/time/dist-install/build/Data/Time/Calendar/JulianYearDay.o
4318 HC [stage 1] libraries/terminfo/dist-install/build/libHSterminfo-0.4.1.1-ghc8.7.20180705.so
4319 HC [stage 1] libraries/transformers/dist-install/build/Control/Monad/Trans/Accum.o
4320 HC [stage 1] libraries/ghc-boot-th/dist-install/build/libHSghc-boot-th-8.7-ghc8.7.20180705.so
4321 HC [stage 1] libraries/ghc-heap/dist-install/build/libHSghc-heap-8.7-ghc8.7.20180705.so
4322 HC [stage 1] libraries/pretty/dist-install/build/Text/PrettyPrint/Annotated.o
4323 HC [stage 1] libraries/pretty/dist-install/build/Text/PrettyPrint/Annotated/HughesPJClass.o
4324 AR libraries/transformers/dist-install/build/libHStransformers-0.5.5.0.a
4325 HC [stage 1] libraries/text/dist-install/build/Data/Text/Internal/Fusion/Types.o
4326 HC [stage 1] libraries/text/dist-install/build/Data/Text/Internal/Private.o
4327 HC [stage 1] libraries/mtl/dist-install/build/Control/Monad/Cont/Class.o
4328 HC [stage 1] libraries/mtl/dist-install/build/Control/Monad/Error/Class.o
4329 HC [stage 1] libraries/mtl/dist-install/build/Control/Monad/Writer/Class.o
4330 HC [stage 1] libraries/mtl/dist-install/build/Control/Monad/State/Class.o
4331 HC [stage 1] libraries/mtl/dist-install/build/Control/Monad/Reader/Class.o
4332 HC [stage 1] libraries/xhtml/dist-install/build/Text/XHtml/Debug.o
4333 HC [stage 1] libraries/xhtml/dist-install/build/Text/XHtml/Transitional.o
4334 HC [stage 1] libraries/xhtml/dist-install/build/Text/XHtml/Frameset.o
4335 HC [stage 1] libraries/xhtml/dist-install/build/Text/XHtml/Strict.o
4336 LD_NO_GOLD libraries/transformers/dist-install/build/HStransformers-0.5.5.0.o
4337 HC [stage 1] libraries/time/dist-install/build/Data/Time/Clock/System.o
4338 HC [stage 1] libraries/time/dist-install/build/Data/Time/Clock/Internal/POSIXTime.o
4339 HC [stage 1] libraries/time/dist-install/build/Data/Time/Calendar/Gregorian.o
4340 HC [stage 1] libraries/time/dist-install/build/Data/Time/Calendar/WeekDate.o
4341 HC [stage 1] libraries/containers/dist-install/build/Data/IntMap/Internal/DeprecatedDebug.o
4342 HC [stage 1] libraries/bytestring/dist-install/build/Data/ByteString.o
4343 HC [stage 1] libraries/array/dist-install/build/Data/Array/Unboxed.o
4344 HC [stage 1] libraries/array/dist-install/build/Data/Array/ST.o
4345 HC [stage 1] libraries/containers/dist-install/build/Data/Map/Internal/Debug.o
4346 HC [stage 1] libraries/containers/dist-install/build/Data/Map/Internal/DeprecatedShowTree.o
4347 HC [stage 1] libraries/array/dist-install/build/Data/Array/Storable/Internals.o
4348 HC [stage 1] libraries/bytestring/dist-install/build/Data/ByteString/Short.o
4349 HC [stage 1] compiler/stage2/build/EnumSet.o
4350 HC [stage 1] libraries/pretty/dist-install/build/Text/PrettyPrint.o
4351 HC [stage 1] libraries/process/dist-install/build/System/Process.o
4352 HC [stage 1] libraries/haskeline/dist-install/build/System/Console/Haskeline/Monads.o
4353 HC [stage 1] libraries/stm/dist-install/build/Control/Concurrent/STM.o
4354 HC [stage 1] libraries/array/dist-install/build/Data/Array/IO.o
4355 HC [stage 1] libraries/containers/dist-install/build/Data/Containers/ListUtils.o
4356 HC [stage 1] libraries/containers/dist-install/build/Data/IntMap/Internal/Debug.o
4357 HC [stage 1] libraries/containers/dist-install/build/Data/IntMap/Merge/Lazy.o
4358 HC [stage 1] libraries/containers/dist-install/build/Data/IntMap/Merge/Strict.o
4359 HC [stage 1] libraries/containers/dist-install/build/Data/Map/Merge/Lazy.o
4360 HC [stage 1] libraries/filepath/dist-install/build/libHSfilepath-1.4.2-ghc8.7.20180705.so
4361 HC [stage 1] libraries/time/dist-install/build/Data/Time/Calendar/Julian.o
4362 HC [stage 1] libraries/pretty/dist-install/build/Text/PrettyPrint/HughesPJClass.o
4363 HC [stage 1] libraries/text/dist-install/build/Data/Text/Internal/Fusion/CaseMapping.o
4364 HC [stage 1] libraries/mtl/dist-install/build/Control/Monad/Cont.o
4365 HC [stage 1] libraries/mtl/dist-install/build/Control/Monad/Error.o
4366 HC [stage 1] libraries/mtl/dist-install/build/Control/Monad/Except.o
4367 HC [stage 1] libraries/mtl/dist-install/build/Control/Monad/RWS/Class.o
4368 HC [stage 1] libraries/mtl/dist-install/build/Control/Monad/Reader.o
4369 HC [stage 1] libraries/mtl/dist-install/build/Control/Monad/State/Lazy.o
4370 HC [stage 1] libraries/mtl/dist-install/build/Control/Monad/State/Strict.o
4371 HC [stage 1] libraries/mtl/dist-install/build/Control/Monad/Writer/Lazy.o
4372 HC [stage 1] libraries/mtl/dist-install/build/Control/Monad/Writer/Strict.o
4373 HC [stage 1] libraries/xhtml/dist-install/build/Text/XHtml.o
4374 LD_NO_GOLD libraries/pretty/dist-install/build/HSpretty-1.1.3.6.o
4375 AR libraries/xhtml/dist-install/build/libHSxhtml-3000.2.2.a
4376 LD_NO_GOLD libraries/xhtml/dist-install/build/HSxhtml-3000.2.2.o
4377 HC [stage 1] libraries/time/dist-install/build/Data/Time/Clock/POSIX.o
4378 HC [stage 1] libraries/containers/dist-install/build/Data/IntMap/Lazy.o
4379 HC [stage 1] libraries/bytestring/dist-install/build/Data/ByteString/Char8.o
4380libraries/bytestring/ghc.mk:4: recipe for target 'libraries/bytestring/dist-install/build/Data/ByteString/Char8.o' failed
4381Makefile:122: recipe for target 'all' failed
4382

Drydock: Prepare tree

When
Completed at Jul 5 2018, 2:51 PM · Built for 4 s
Status
Passed

Build Log 282555 (remote - stderr)
25 - 50 - 100 - Unlimited Lines

1+ git clean -qxfd
2+ git submodule sync
3+ git submodule update --init --recursive
4+ git submodule foreach -q git clean -qxfd
5

Build Log 282554 (remote - stdout)
25 - 50 - 100 - Unlimited Lines

1Synchronizing submodule url for '.arc-linters/arcanist-external-json-linter'
2Synchronizing submodule url for 'hadrian'
3Synchronizing submodule url for 'libffi-tarballs'
4Synchronizing submodule url for 'libraries/Cabal'
5Synchronizing submodule url for 'libraries/Win32'
6Synchronizing submodule url for 'libraries/array'
7Synchronizing submodule url for 'libraries/binary'
8Synchronizing submodule url for 'libraries/bytestring'
9Synchronizing submodule url for 'libraries/containers'
10Synchronizing submodule url for 'libraries/deepseq'
11Synchronizing submodule url for 'libraries/directory'
12Synchronizing submodule url for 'libraries/filepath'
13Synchronizing submodule url for 'libraries/haskeline'
14Synchronizing submodule url for 'libraries/hpc'
15Synchronizing submodule url for 'libraries/integer-gmp/gmp/gmp-tarballs'
16Synchronizing submodule url for 'libraries/mtl'
17Synchronizing submodule url for 'libraries/parallel'
18Synchronizing submodule url for 'libraries/parsec'
19Synchronizing submodule url for 'libraries/pretty'
20Synchronizing submodule url for 'libraries/process'
21Synchronizing submodule url for 'libraries/random'
22Synchronizing submodule url for 'libraries/stm'
23Synchronizing submodule url for 'libraries/terminfo'
24Synchronizing submodule url for 'libraries/text'
25Synchronizing submodule url for 'libraries/time'
26Synchronizing submodule url for 'libraries/transformers'
27Synchronizing submodule url for 'libraries/unix'
28Synchronizing submodule url for 'libraries/xhtml'
29Synchronizing submodule url for 'nofib'
30Synchronizing submodule url for 'utils/haddock'
31Synchronizing submodule url for 'utils/hsc2hs'
32

Build Working Copy

When
Completed at Jul 5 2018, 2:51 PM · Built for 6 h, 34 m
Status
Passed
Description

Lease a working copy for Linux/amd64 builds.