Build 49344

Properties

Drydock: Build

When
Completed at Jul 5 2018, 3:15 PM · Built for 24 m, 15 s
Status
Failed

Build Log 282557 (remote - stderr)
25 - 50 - 100 - Unlimited Lines

419 Call hs_init_ghc() from your main() function to set these options.
420Warning: -rtsopts and -with-rtsopts have no effect with -shared.
421 Call hs_init_ghc() from your main() function to set these options.
422Warning: -rtsopts and -with-rtsopts have no effect with -shared.
423 Call hs_init_ghc() from your main() function to set these options.
424ar: creating libraries/transformers/dist-install/build/libHStransformers-0.5.5.0.a
425Warning: -rtsopts and -with-rtsopts have no effect with -shared.
426 Call hs_init_ghc() from your main() function to set these options.
427ar: creating libraries/xhtml/dist-install/build/libHSxhtml-3000.2.2.a
428
429libraries/bytestring/Data/ByteString/Char8.hs:243:1: error: [-Wdeprecations, -Werror=deprecations]
430 Deprecated: "findSubstring is deprecated in favour of breakSubstring."
431 |
432243 | import Data.ByteString (empty,null,length,tail,init,append
433 | ^^^^^^^^^^^^^^^^^^^^^^^^^^^^^^^^^^^^^^^^^^^^^^^^^^^^^^^^^^...
434
435libraries/bytestring/Data/ByteString/Char8.hs:243:1: error: [-Wdeprecations, -Werror=deprecations]
436 Deprecated: "findSubstrings is deprecated in favour of breakSubstring."
437 |
438243 | import Data.ByteString (empty,null,length,tail,init,append
439 | ^^^^^^^^^^^^^^^^^^^^^^^^^^^^^^^^^^^^^^^^^^^^^^^^^^^^^^^^^^...
440make[1]: *** [libraries/bytestring/dist-install/build/Data/ByteString/Char8.o] Error 1
441make[1]: *** Waiting for unfinished jobs....
442make: *** [all] Error 2
443

Build Log 282556 (remote - stdout)
25 - 50 - 100 - Unlimited Lines

4358 HC [stage 1] libraries/containers/dist-install/build/Data/IntMap/Merge/Strict.o
4359 HC [stage 1] libraries/containers/dist-install/build/Data/Map/Merge/Lazy.o
4360 HC [stage 1] libraries/filepath/dist-install/build/libHSfilepath-1.4.2-ghc8.7.20180705.so
4361 HC [stage 1] libraries/time/dist-install/build/Data/Time/Calendar/Julian.o
4362 HC [stage 1] libraries/pretty/dist-install/build/Text/PrettyPrint/HughesPJClass.o
4363 HC [stage 1] libraries/text/dist-install/build/Data/Text/Internal/Fusion/CaseMapping.o
4364 HC [stage 1] libraries/mtl/dist-install/build/Control/Monad/Cont.o
4365 HC [stage 1] libraries/mtl/dist-install/build/Control/Monad/Error.o
4366 HC [stage 1] libraries/mtl/dist-install/build/Control/Monad/Except.o
4367 HC [stage 1] libraries/mtl/dist-install/build/Control/Monad/RWS/Class.o
4368 HC [stage 1] libraries/mtl/dist-install/build/Control/Monad/Reader.o
4369 HC [stage 1] libraries/mtl/dist-install/build/Control/Monad/State/Lazy.o
4370 HC [stage 1] libraries/mtl/dist-install/build/Control/Monad/State/Strict.o
4371 HC [stage 1] libraries/mtl/dist-install/build/Control/Monad/Writer/Lazy.o
4372 HC [stage 1] libraries/mtl/dist-install/build/Control/Monad/Writer/Strict.o
4373 HC [stage 1] libraries/xhtml/dist-install/build/Text/XHtml.o
4374 LD_NO_GOLD libraries/pretty/dist-install/build/HSpretty-1.1.3.6.o
4375 AR libraries/xhtml/dist-install/build/libHSxhtml-3000.2.2.a
4376 LD_NO_GOLD libraries/xhtml/dist-install/build/HSxhtml-3000.2.2.o
4377 HC [stage 1] libraries/time/dist-install/build/Data/Time/Clock/POSIX.o
4378 HC [stage 1] libraries/containers/dist-install/build/Data/IntMap/Lazy.o
4379 HC [stage 1] libraries/bytestring/dist-install/build/Data/ByteString/Char8.o
4380libraries/bytestring/ghc.mk:4: recipe for target 'libraries/bytestring/dist-install/build/Data/ByteString/Char8.o' failed
4381Makefile:122: recipe for target 'all' failed
4382

Drydock: Prepare tree

When
Completed at Jul 5 2018, 2:51 PM · Built for 4 s
Status
Passed

Build Log 282555 (remote - stderr)
25 - 50 - 100 - Unlimited Lines

1+ git clean -qxfd
2+ git submodule sync
3+ git submodule update --init --recursive
4+ git submodule foreach -q git clean -qxfd
5

Build Log 282554 (remote - stdout)
25 - 50 - 100 - Unlimited Lines

7Synchronizing submodule url for 'libraries/bytestring'
8Synchronizing submodule url for 'libraries/containers'
9Synchronizing submodule url for 'libraries/deepseq'
10Synchronizing submodule url for 'libraries/directory'
11Synchronizing submodule url for 'libraries/filepath'
12Synchronizing submodule url for 'libraries/haskeline'
13Synchronizing submodule url for 'libraries/hpc'
14Synchronizing submodule url for 'libraries/integer-gmp/gmp/gmp-tarballs'
15Synchronizing submodule url for 'libraries/mtl'
16Synchronizing submodule url for 'libraries/parallel'
17Synchronizing submodule url for 'libraries/parsec'
18Synchronizing submodule url for 'libraries/pretty'
19Synchronizing submodule url for 'libraries/process'
20Synchronizing submodule url for 'libraries/random'
21Synchronizing submodule url for 'libraries/stm'
22Synchronizing submodule url for 'libraries/terminfo'
23Synchronizing submodule url for 'libraries/text'
24Synchronizing submodule url for 'libraries/time'
25Synchronizing submodule url for 'libraries/transformers'
26Synchronizing submodule url for 'libraries/unix'
27Synchronizing submodule url for 'libraries/xhtml'
28Synchronizing submodule url for 'nofib'
29Synchronizing submodule url for 'utils/haddock'
30Synchronizing submodule url for 'utils/hsc2hs'
31

Build Working Copy

When
Completed at Jul 5 2018, 2:51 PM · Built for 6 h, 34 m
Status
Passed
Description

Lease a working copy for Linux/amd64 builds.