Build 49343

Properties

Drydock: Build

When
Completed at Jul 7 2018, 6:33 PM · Built for 33 m, 53 s
Status
Failed
Description

Run the build.

Build Log 283108 (remote - stderr)
25 - 50 - 100 - Unlimited Lines

499ld: warning: could not create compact unwind for _StgRunIsImplementedInAssembler: register saved more than once (might be shrink wrap)
500ld: warning: could not create compact unwind for _StgRunIsImplementedInAssembler: register saved more than once (might be shrink wrap)
501ld: warning: could not create compact unwind for _StgRunIsImplementedInAssembler: register saved more than once (might be shrink wrap)
502/private/var/drydock/workingcopy-121269/repo/glasgow-haskell-compiler/docs/users_guide/extending_ghc.rst:845: WARNING: Unexpected indentation.
503/private/var/drydock/workingcopy-121269/repo/glasgow-haskell-compiler/docs/users_guide/glasgow_exts.rst:9747: WARNING: Literal block expected; none found.
504WARNING: /private/var/drydock/workingcopy-121269/repo/glasgow-haskell-compiler/docs/users_guide/using-optimisation.rst:: (ERROR/3) Anonymous hyperlink mismatch: 1 references but 0 targets.
505See "backrefs" attribute for IDs.
506/private/var/drydock/workingcopy-121269/repo/glasgow-haskell-compiler/docs/users_guide/extending_ghc.rst:845: WARNING: Unexpected indentation.
507/private/var/drydock/workingcopy-121269/repo/glasgow-haskell-compiler/docs/users_guide/glasgow_exts.rst:9747: WARNING: Literal block expected; none found.
508WARNING: /private/var/drydock/workingcopy-121269/repo/glasgow-haskell-compiler/docs/users_guide/using-optimisation.rst:: (ERROR/3) Anonymous hyperlink mismatch: 1 references but 0 targets.
509See "backrefs" attribute for IDs.
510/private/var/drydock/workingcopy-121269/repo/glasgow-haskell-compiler/docs/users_guide/8.2.1-notes.rst: WARNING: document isn't included in any toctree
511/private/var/drydock/workingcopy-121269/repo/glasgow-haskell-compiler/docs/users_guide/8.4.1-notes.rst: WARNING: document isn't included in any toctree
512/private/var/drydock/workingcopy-121269/repo/glasgow-haskell-compiler/docs/users_guide/8.2.1-notes.rst: WARNING: document isn't included in any toctree
513/private/var/drydock/workingcopy-121269/repo/glasgow-haskell-compiler/docs/users_guide/8.4.1-notes.rst: WARNING: document isn't included in any toctree
514/Applications/Xcode-7.2/Xcode.app/Contents/Developer/Toolchains/XcodeDefault.xctoolchain/usr/bin/ranlib: file: libraries/ghc-prim/dist-install/build/libHSghc-prim-0.5.3.a(longlong.o) has no symbols
515Warning: -rtsopts and -with-rtsopts have no effect with -shared.
516 Call hs_init_ghc() from your main() function to set these options.
517Warning: -rtsopts and -with-rtsopts have no effect with -shared.
518 Call hs_init_ghc() from your main() function to set these options.
519/private/var/drydock/workingcopy-121269/repo/glasgow-haskell-compiler/docs/users_guide/glasgow_exts.rst:10182: WARNING: undefined label: pattern signature equivalent pattern-equiv-form (if the link has no caption the label must precede a section header)
520/private/var/drydock/workingcopy-121269/repo/glasgow-haskell-compiler/docs/users_guide/glasgow_exts.rst:2194: WARNING: Could not lex literal_block as "haskell". Highlighting skipped.
521/private/var/drydock/workingcopy-121269/repo/glasgow-haskell-compiler/docs/users_guide/glasgow_exts.rst:2214: WARNING: Could not lex literal_block as "haskell". Highlighting skipped.
522/private/var/drydock/workingcopy-121269/repo/glasgow-haskell-compiler/docs/users_guide/glasgow_exts.rst:3755: WARNING: Could not lex literal_block as "haskell". Highlighting skipped.
523/private/var/drydock/workingcopy-121269/repo/glasgow-haskell-compiler/docs/users_guide/glasgow_exts.rst:8633: WARNING: Could not lex literal_block as "haskell". Highlighting skipped.
524/private/var/drydock/workingcopy-121269/repo/glasgow-haskell-compiler/docs/users_guide/glasgow_exts.rst:8646: WARNING: Could not lex literal_block as "haskell". Highlighting skipped.
525/private/var/drydock/workingcopy-121269/repo/glasgow-haskell-compiler/docs/users_guide/glasgow_exts.rst:10686: WARNING: Could not lex literal_block as "haskell". Highlighting skipped.
526/private/var/drydock/workingcopy-121269/repo/glasgow-haskell-compiler/docs/users_guide/glasgow_exts.rst:12021: WARNING: Could not lex literal_block as "haskell". Highlighting skipped.
527/private/var/drydock/workingcopy-121269/repo/glasgow-haskell-compiler/docs/users_guide/glasgow_exts.rst:12037: WARNING: Could not lex literal_block as "haskell". Highlighting skipped.
528/private/var/drydock/workingcopy-121269/repo/glasgow-haskell-compiler/docs/users_guide/glasgow_exts.rst:12054: WARNING: Could not lex literal_block as "haskell". Highlighting skipped.
529/private/var/drydock/workingcopy-121269/repo/glasgow-haskell-compiler/docs/users_guide/glasgow_exts.rst:12277: WARNING: Could not lex literal_block as "haskell". Highlighting skipped.
530/private/var/drydock/workingcopy-121269/repo/glasgow-haskell-compiler/docs/users_guide/separate_compilation.rst:611: WARNING: Could not lex literal_block as "haskell". Highlighting skipped.
531WARNING: file compiler/stgSyn/CoreToStg.hs, line 328
532 joinLines_s4mq True False
533WARNING: file compiler/simplCore/SimplCore.hs, line 977
534 Not shorting out: happyReduce
535WARNING: file compiler/simplCore/SimplCore.hs, line 977
536 Not shorting out: happyDoAction
537WARNING: file compiler/simplCore/SimplCore.hs, line 977
538 Not shorting out: happyShift
539WARNING: file compiler/simplCore/SimplCore.hs, line 977
540 Not shorting out: happyFail
541WARNING: file compiler/simplCore/SimplCore.hs, line 977
542 Not shorting out: happySpecReduce_3
543WARNING: file compiler/simplCore/SimplCore.hs, line 977
544 Not shorting out: happySpecReduce_1
545WARNING: file compiler/simplCore/SimplCore.hs, line 977
546 Not shorting out: happySpecReduce_0
547WARNING: file compiler/simplCore/SimplCore.hs, line 977
548 Not shorting out: happySpecReduce_2
549WARNING: file compiler/simplCore/SimplCore.hs, line 977
550 Not shorting out: happyGoto
551WARNING: file compiler/simplCore/SimplCore.hs, line 977
552 Not shorting out: happyReduce
553WARNING: file compiler/simplCore/SimplCore.hs, line 977
554 Not shorting out: happyDoAction
555WARNING: file compiler/simplCore/SimplCore.hs, line 977
556 Not shorting out: happyShift
557WARNING: file compiler/simplCore/SimplCore.hs, line 977
558 Not shorting out: happyFail
559WARNING: file compiler/simplCore/SimplCore.hs, line 977
560 Not shorting out: happySpecReduce_3
561WARNING: file compiler/simplCore/SimplCore.hs, line 977
562 Not shorting out: happySpecReduce_1
563WARNING: file compiler/simplCore/SimplCore.hs, line 977
564 Not shorting out: happySpecReduce_0
565WARNING: file compiler/simplCore/SimplCore.hs, line 977
566 Not shorting out: happySpecReduce_2
567WARNING: file compiler/simplCore/SimplCore.hs, line 977
568 Not shorting out: happyGoto
569/Applications/Xcode-7.2/Xcode.app/Contents/Developer/Toolchains/XcodeDefault.xctoolchain/usr/bin/ranlib: file: libraries/base/dist-install/build/libHSbase-4.12.0.0.a(Win32Utils.o) has no symbols
570/Applications/Xcode-7.2/Xcode.app/Contents/Developer/Toolchains/XcodeDefault.xctoolchain/usr/bin/ranlib: file: libraries/base/dist-install/build/libHSbase-4.12.0.0.a(consUtils.o) has no symbols
571Warning: -rtsopts and -with-rtsopts have no effect with -shared.
572 Call hs_init_ghc() from your main() function to set these options.
573Warning: -rtsopts and -with-rtsopts have no effect with -shared.
574 Call hs_init_ghc() from your main() function to set these options.
575Warning: -rtsopts and -with-rtsopts have no effect with -shared.
576 Call hs_init_ghc() from your main() function to set these options.
577Warning: -rtsopts and -with-rtsopts have no effect with -shared.
578 Call hs_init_ghc() from your main() function to set these options.
579Warning: -rtsopts and -with-rtsopts have no effect with -shared.
580 Call hs_init_ghc() from your main() function to set these options.
581Warning: -rtsopts and -with-rtsopts have no effect with -shared.
582 Call hs_init_ghc() from your main() function to set these options.
583
584libraries/bytestring/Data/ByteString/Char8.hs:243:1: error: [-Wdeprecations, -Werror=deprecations]
585 Deprecated: "findSubstring is deprecated in favour of breakSubstring."
586 |
587243 | import Data.ByteString (empty,null,length,tail,init,append
588 | ^^^^^^^^^^^^^^^^^^^^^^^^^^^^^^^^^^^^^^^^^^^^^^^^^^^^^^^^^^...
589
590libraries/bytestring/Data/ByteString/Char8.hs:243:1: error: [-Wdeprecations, -Werror=deprecations]
591 Deprecated: "findSubstrings is deprecated in favour of breakSubstring."
592 |
593243 | import Data.ByteString (empty,null,length,tail,init,append
594 | ^^^^^^^^^^^^^^^^^^^^^^^^^^^^^^^^^^^^^^^^^^^^^^^^^^^^^^^^^^...
595make[1]: *** [libraries/bytestring/dist-install/build/Data/ByteString/Char8.o] Error 1
596make[1]: *** Waiting for unfinished jobs....
597make: *** [all] Error 2
598

Build Log 283107 (remote - stdout)
25 - 50 - 100 - Unlimited Lines

4252 HC [stage 1] libraries/time/dist-install/build/Data/Time/Calendar/OrdinalDate.o
4253 HC [stage 1] libraries/containers/dist-install/build/Data/Set.o
4254 HC [stage 1] libraries/containers/dist-install/build/Data/IntMap/Internal.o
4255 HC [stage 1] libraries/bytestring/dist-install/build/Data/ByteString/Unsafe.o
4256 HC [stage 1] libraries/array/dist-install/build/Data/Array/IArray.o
4257 HC [stage 1] libraries/array/dist-install/build/Data/Array/MArray/Safe.o
4258 HC [stage 1] libraries/array/dist-install/build/Data/Array/MArray.o
4259 HC [stage 1] libraries/containers/dist-install/build/Data/Map/Internal.o
4260 HC [stage 1] libraries/array/dist-install/build/Data/Array/IO/Internals.o
4261 HC [stage 1] libraries/bytestring/dist-install/build/Data/ByteString/Short/Internal.o
4262 HC [stage 1] libraries/binary/dist-install/build/Data/Binary/Internal.o
4263 HC [stage 1] libraries/containers/dist-install/build/Data/IntSet.o
4264 HC [stage 1] libraries/pretty/dist-install/build/Text/PrettyPrint/HughesPJ.o
4265 HC [stage 1] libraries/haskeline/dist-install/build/System/Console/Haskeline/MonadException.o
4266 HC [stage 1] libraries/stm/dist-install/build/Control/Concurrent/STM/TArray.o
4267 HC [stage 1] libraries/filepath/dist-install/build/libHSfilepath-1.4.2-ghc8.7.20180705.dylib
4268 HC [stage 1] libraries/time/dist-install/build/Data/Time/Calendar/JulianYearDay.o
4269 HC [stage 1] libraries/process/dist-install/build/System/Cmd.o
4270 HC [stage 1] libraries/terminfo/dist-install/build/libHSterminfo-0.4.1.1-ghc8.7.20180705.dylib
4271 HC [stage 1] libraries/transformers/dist-install/build/Control/Monad/Trans/Accum.o
4272 HC [stage 1] libraries/ghc-boot-th/dist-install/build/libHSghc-boot-th-8.7-ghc8.7.20180705.dylib
4273 HC [stage 1] libraries/ghc-heap/dist-install/build/libHSghc-heap-8.7-ghc8.7.20180705.dylib
4274 HC [stage 1] libraries/pretty/dist-install/build/Text/PrettyPrint/Annotated.o
4275 HC [stage 1] libraries/pretty/dist-install/build/Text/PrettyPrint/Annotated/HughesPJClass.o
4276 HC [stage 1] libraries/text/dist-install/build/Data/Text/Internal/Fusion/CaseMapping.o
4277 HC [stage 1] libraries/mtl/dist-install/build/Control/Monad/Cont/Class.o
4278 HC [stage 1] libraries/mtl/dist-install/build/Control/Monad/Error/Class.o
4279 HC [stage 1] libraries/mtl/dist-install/build/Control/Monad/Writer/Class.o
4280 HC [stage 1] libraries/mtl/dist-install/build/Control/Monad/State/Class.o
4281 HC [stage 1] libraries/mtl/dist-install/build/Control/Monad/Reader/Class.o
4282 HC [stage 1] libraries/xhtml/dist-install/build/Text/XHtml/Debug.o
4283 HC [stage 1] libraries/xhtml/dist-install/build/Text/XHtml/Transitional.o
4284 HC [stage 1] libraries/xhtml/dist-install/build/Text/XHtml/Frameset.o
4285 HC [stage 1] libraries/xhtml/dist-install/build/Text/XHtml/Strict.o
4286 LD_NO_GOLD libraries/process/dist-install/build/HSprocess-1.6.3.0.o
4287 LD_NO_GOLD libraries/transformers/dist-install/build/HStransformers-0.5.5.0.o
4288 HC [stage 1] libraries/time/dist-install/build/Data/Time/Clock/System.o
4289 HC [stage 1] libraries/time/dist-install/build/Data/Time/Clock/Internal/POSIXTime.o
4290 HC [stage 1] libraries/time/dist-install/build/Data/Time/Calendar/Gregorian.o
4291 HC [stage 1] libraries/time/dist-install/build/Data/Time/Calendar/WeekDate.o
4292 HC [stage 1] libraries/containers/dist-install/build/Data/IntMap/Internal/DeprecatedDebug.o
4293 HC [stage 1] libraries/bytestring/dist-install/build/Data/ByteString.o
4294 HC [stage 1] libraries/array/dist-install/build/Data/Array/Unboxed.o
4295 HC [stage 1] libraries/array/dist-install/build/Data/Array/ST.o
4296 HC [stage 1] libraries/containers/dist-install/build/Data/Map/Internal/Debug.o
4297 HC [stage 1] libraries/containers/dist-install/build/Data/Map/Internal/DeprecatedShowTree.o
4298 HC [stage 1] libraries/array/dist-install/build/Data/Array/Storable/Internals.o
4299 HC [stage 1] libraries/bytestring/dist-install/build/Data/ByteString/Short.o
4300 HC [stage 1] compiler/stage2/build/EnumSet.o
4301 HC [stage 1] libraries/pretty/dist-install/build/Text/PrettyPrint.o
4302 HC [stage 1] libraries/haskeline/dist-install/build/System/Console/Haskeline/Monads.o
4303 HC [stage 1] libraries/stm/dist-install/build/Control/Concurrent/STM.o
4304 HC [stage 1] libraries/array/dist-install/build/Data/Array/IO.o
4305 HC [stage 1] libraries/containers/dist-install/build/Data/Containers/ListUtils.o
4306 HC [stage 1] libraries/containers/dist-install/build/Data/IntMap/Internal/Debug.o
4307 HC [stage 1] libraries/containers/dist-install/build/Data/IntMap/Merge/Lazy.o
4308 HC [stage 1] libraries/containers/dist-install/build/Data/IntMap/Merge/Strict.o
4309 HC [stage 1] libraries/containers/dist-install/build/Data/Map/Merge/Lazy.o
4310 HC [stage 1] libraries/time/dist-install/build/Data/Time/Calendar/Julian.o
4311 HC [stage 1] libraries/pretty/dist-install/build/Text/PrettyPrint/HughesPJClass.o
4312 HC [stage 1] libraries/text/dist-install/build/Data/Text/Internal/Fusion/Common.o
4313 HC [stage 1] libraries/mtl/dist-install/build/Control/Monad/Cont.o
4314 HC [stage 1] libraries/mtl/dist-install/build/Control/Monad/Error.o
4315 HC [stage 1] libraries/mtl/dist-install/build/Control/Monad/Except.o
4316 HC [stage 1] libraries/mtl/dist-install/build/Control/Monad/RWS/Class.o
4317 HC [stage 1] libraries/mtl/dist-install/build/Control/Monad/Reader.o
4318 HC [stage 1] libraries/mtl/dist-install/build/Control/Monad/State/Lazy.o
4319 HC [stage 1] libraries/mtl/dist-install/build/Control/Monad/State/Strict.o
4320 HC [stage 1] libraries/mtl/dist-install/build/Control/Monad/Writer/Lazy.o
4321 HC [stage 1] libraries/mtl/dist-install/build/Control/Monad/Writer/Strict.o
4322 HC [stage 1] libraries/xhtml/dist-install/build/Text/XHtml.o
4323 LD_NO_GOLD libraries/pretty/dist-install/build/HSpretty-1.1.3.6.o
4324 LD_NO_GOLD libraries/xhtml/dist-install/build/HSxhtml-3000.2.2.o
4325 HC [stage 1] libraries/time/dist-install/build/Data/Time/Clock/POSIX.o
4326 HC [stage 1] libraries/containers/dist-install/build/Data/IntMap/Lazy.o
4327 HC [stage 1] libraries/array/dist-install/build/Data/Array/ST/Safe.o
4328 HC [stage 1] libraries/containers/dist-install/build/Data/Map/Lazy.o
4329 HC [stage 1] libraries/array/dist-install/build/Data/Array/Unsafe.o
4330 HC [stage 1] libraries/containers/dist-install/build/Data/Map/Strict/Internal.o
4331 HC [stage 1] libraries/containers/dist-install/build/Data/IntMap/Strict.o
4332 HC [stage 1] libraries/haskeline/dist-install/build/System/Console/Haskeline/Backend/Posix/Encoder.o
4333 HC [stage 1] libraries/haskeline/dist-install/build/System/Console/Haskeline/Command/Undo.o
4334 HC [stage 1] libraries/array/dist-install/build/Data/Array/IO/Safe.o
4335 HC [stage 1] libraries/array/dist-install/build/Data/Array/Storable.o
4336 HC [stage 1] libraries/array/dist-install/build/Data/Array/Storable/Safe.o
4337 HC [stage 1] libraries/stm/dist-install/build/Control/Concurrent/STM/TSem.o
4338 HC [stage 1] libraries/transformers/dist-install/build/libHStransformers-0.5.5.0-ghc8.7.20180705.dylib
4339 HC [stage 1] libraries/text/dist-install/build/Data/Text/Internal/Fusion.o
4340 HC [stage 1] libraries/mtl/dist-install/build/Control/Monad/RWS/Lazy.o
4341 HC [stage 1] libraries/mtl/dist-install/build/Control/Monad/RWS/Strict.o
4342 HC [stage 1] libraries/mtl/dist-install/build/Control/Monad/State.o
4343 HC [stage 1] libraries/mtl/dist-install/build/Control/Monad/Writer.o
4344 LD_NO_GOLD libraries/array/dist-install/build/HSarray-0.5.2.0.o
4345 LD_NO_GOLD libraries/stm/dist-install/build/HSstm-2.5.0.0.o
4346 HC [stage 1] libraries/time/dist-install/build/Data/Time/LocalTime/Internal/TimeZone.o
4347 HC [stage 1] libraries/time/dist-install/build/Data/Time/Clock/Internal/UTCDiff.o
4348 HC [stage 1] libraries/containers/dist-install/build/Data/IntMap.o
4349 HC [stage 1] libraries/unix/dist-install/build/System/Posix/Files/Common.o
4350 HC [stage 1] libraries/bytestring/dist-install/build/Data/ByteString/Char8.o
4351

Drydock: Prepare tree

When
Completed at Jul 7 2018, 5:59 PM · Built for 11 s
Status
Passed

Build Log 283106 (remote - stderr)
25 - 50 - 100 - Unlimited Lines

1+ git clean -qxfd
2+ git submodule sync
3+ git submodule update --init --recursive
4+ git submodule foreach -q git clean -qxfd
5

Build Log 283105 (remote - stdout)
25 - 50 - 100 - Unlimited Lines

1Synchronizing submodule url for '.arc-linters/arcanist-external-json-linter'
2Synchronizing submodule url for 'hadrian'
3Synchronizing submodule url for 'libffi-tarballs'
4Synchronizing submodule url for 'libraries/Cabal'
5Synchronizing submodule url for 'libraries/Win32'
6Synchronizing submodule url for 'libraries/array'
7Synchronizing submodule url for 'libraries/binary'
8Synchronizing submodule url for 'libraries/bytestring'
9Synchronizing submodule url for 'libraries/containers'
10Synchronizing submodule url for 'libraries/deepseq'
11Synchronizing submodule url for 'libraries/directory'
12Synchronizing submodule url for 'libraries/filepath'
13Synchronizing submodule url for 'libraries/haskeline'
14Synchronizing submodule url for 'libraries/hpc'
15Synchronizing submodule url for 'libraries/integer-gmp/gmp/gmp-tarballs'
16Synchronizing submodule url for 'libraries/mtl'
17Synchronizing submodule url for 'libraries/parallel'
18Synchronizing submodule url for 'libraries/parsec'
19Synchronizing submodule url for 'libraries/pretty'
20Synchronizing submodule url for 'libraries/process'
21Synchronizing submodule url for 'libraries/random'
22Synchronizing submodule url for 'libraries/stm'
23Synchronizing submodule url for 'libraries/terminfo'
24Synchronizing submodule url for 'libraries/text'
25Synchronizing submodule url for 'libraries/time'
26Synchronizing submodule url for 'libraries/transformers'
27Synchronizing submodule url for 'libraries/unix'
28Synchronizing submodule url for 'libraries/xhtml'
29Synchronizing submodule url for 'nofib'
30Synchronizing submodule url for 'utils/haddock'
31Synchronizing submodule url for 'utils/hsc2hs'
32

Lease Working Copy

When
Completed at Jul 7 2018, 5:59 PM · Built for 2 d, 9 h
Status
Passed
Description

Lease a working copy for OSX/amd64 builds.