Build 49216

Properties

Drydock: Build

When
Completed at Jul 3 2018, 9:03 AM · Built for 31 m, 38 s
Status
Failed

Build Log 281542 (remote - stderr)
25 - 50 - 100 - Unlimited Lines

483 Call hs_init_ghc() from your main() function to set these options.
484ar: creating libraries/parsec/dist-install/build/libHSparsec-3.1.13.0.0.0.0.0.a
485ar: creating libraries/text/dist-install/build/libHStext-1.2.3.0.a
486Warning: -rtsopts and -with-rtsopts have no effect with -shared.
487 Call hs_init_ghc() from your main() function to set these options.
488ar: creating libraries/ghci/dist-install/build/libHSghci-8.7.a
489Warning: -rtsopts and -with-rtsopts have no effect with -shared.
490 Call hs_init_ghc() from your main() function to set these options.
491Warning: -rtsopts and -with-rtsopts have no effect with -shared.
492 Call hs_init_ghc() from your main() function to set these options.
493ar: creating libraries/libiserv/dist-install/build/libHSlibiserv-8.7.1.a
494Warning: -rtsopts and -with-rtsopts have no effect with -shared.
495 Call hs_init_ghc() from your main() function to set these options.
496
497compiler/utils/UnVarGraph.hs:37:1: error: [-Wunused-imports, -Werror=unused-imports]
498 The import of ‘Data.List’ is redundant
499 except perhaps to import instances from ‘Data.List’
500 To import instances alone, use: import Data.List()
501 |
50237 | import Data.List
503 | ^^^^^^^^^^^^^^^^
504make[1]: *** [compiler/stage2/build/UnVarGraph.o] Error 1
505make[1]: *** Waiting for unfinished jobs....
506make: *** [all] Error 2
507

Build Log 281541 (remote - stdout)
25 - 50 - 100 - Unlimited Lines

4824 HC [stage 1] compiler/stage2/build/Literal.o
4825 HC [stage 1] compiler/stage2/build/HsLit.o
4826 HC [stage 1] compiler/stage2/build/Unify.o
4827 HC [stage 1] compiler/stage2/build/TrieMap.o
4828 HC [stage 1] compiler/stage2/build/Hoopl/Label.o
4829 HC [stage 1] compiler/stage2/build/Hoopl/Graph.o
4830 HC [stage 1] compiler/stage2/build/BlockId.o-boot
4831 HC [stage 1] compiler/stage2/build/CmmSwitch.o
4832 HC [stage 1] compiler/stage2/build/DataCon.o
4833 HC [stage 1] compiler/stage2/build/RepType.o
4834 HC [stage 1] compiler/stage2/build/Demand.o
4835 HC [stage 1] compiler/stage2/build/CoreSyn.o
4836 HC [stage 1] compiler/stage2/build/ConLike.o
4837 HC [stage 1] compiler/stage2/build/CoreMap.o
4838 HC [stage 1] compiler/stage2/build/IdInfo.o
4839 HC [stage 1] compiler/stage2/build/Id.o
4840 HC [stage 1] compiler/stage2/build/TysWiredIn.o
4841 HC [stage 1] compiler/stage2/build/CoreStats.o
4842 HC [stage 1] compiler/stage2/build/HsTypes.o
4843 HC [stage 1] compiler/stage2/build/InteractiveEvalTypes.o
4844 HC [stage 1] compiler/stage2/build/CoreSeq.o
4845 HC [stage 1] compiler/stage2/build/UnVarGraph.o
4846compiler/ghc.mk:447: recipe for target 'compiler/stage2/build/UnVarGraph.o' failed
4847Makefile:122: recipe for target 'all' failed
4848

Drydock: Prepare tree

When
Completed at Jul 3 2018, 8:32 AM · Built for 4 s
Status
Passed

Build Log 281540 (remote - stderr)
25 - 50 - 100 - Unlimited Lines

1+ git clean -qxfd
2+ git submodule sync
3+ git submodule update --init --recursive
4+ git submodule foreach -q git clean -qxfd
5

Build Log 281539 (remote - stdout)
25 - 50 - 100 - Unlimited Lines

8Synchronizing submodule url for 'libraries/containers'
9Synchronizing submodule url for 'libraries/deepseq'
10Synchronizing submodule url for 'libraries/directory'
11Synchronizing submodule url for 'libraries/filepath'
12Synchronizing submodule url for 'libraries/haskeline'
13Synchronizing submodule url for 'libraries/hpc'
14Synchronizing submodule url for 'libraries/integer-gmp/gmp/gmp-tarballs'
15Synchronizing submodule url for 'libraries/mtl'
16Synchronizing submodule url for 'libraries/parallel'
17Synchronizing submodule url for 'libraries/parsec'
18Synchronizing submodule url for 'libraries/pretty'
19Synchronizing submodule url for 'libraries/process'
20Synchronizing submodule url for 'libraries/random'
21Synchronizing submodule url for 'libraries/stm'
22Synchronizing submodule url for 'libraries/terminfo'
23Synchronizing submodule url for 'libraries/text'
24Synchronizing submodule url for 'libraries/time'
25Synchronizing submodule url for 'libraries/transformers'
26Synchronizing submodule url for 'libraries/unix'
27Synchronizing submodule url for 'libraries/xhtml'
28Synchronizing submodule url for 'nofib'
29Synchronizing submodule url for 'utils/haddock'
30Synchronizing submodule url for 'utils/hsc2hs'
31Submodule path 'utils/haddock': checked out '3266a962f7b6083b4b48cb66e70c62e3157df930'
32

Build Working Copy

When
Completed at Jul 3 2018, 8:32 AM · Built for 1 h, 19 m
Status
Passed
Description

Lease a working copy for Linux/amd64 builds.