Build 49215

Properties

Drydock: Build

When
Completed at Jul 9 2018, 7:52 AM · Built for 45 m, 42 s
Status
Failed
Description

Run the build.

Build Log 283358 (remote - stderr)
25 - 50 - 100 - Unlimited Lines

616 Call hs_init_ghc() from your main() function to set these options.
617Warning: -rtsopts and -with-rtsopts have no effect with -shared.
618 Call hs_init_ghc() from your main() function to set these options.
619Warning: -rtsopts and -with-rtsopts have no effect with -shared.
620 Call hs_init_ghc() from your main() function to set these options.
621Warning: -rtsopts and -with-rtsopts have no effect with -shared.
622 Call hs_init_ghc() from your main() function to set these options.
623Warning: -rtsopts and -with-rtsopts have no effect with -shared.
624 Call hs_init_ghc() from your main() function to set these options.
625Warning: -rtsopts and -with-rtsopts have no effect with -shared.
626 Call hs_init_ghc() from your main() function to set these options.
627Warning: -rtsopts and -with-rtsopts have no effect with -shared.
628 Call hs_init_ghc() from your main() function to set these options.
629
630compiler/utils/UnVarGraph.hs:37:1: error: [-Wunused-imports, -Werror=unused-imports]
631 The import of ‘Data.List’ is redundant
632 except perhaps to import instances from ‘Data.List’
633 To import instances alone, use: import Data.List()
634 |
63537 | import Data.List
636 | ^^^^^^^^^^^^^^^^
637make[1]: *** [compiler/stage2/build/UnVarGraph.o] Error 1
638make[1]: *** Waiting for unfinished jobs....
639make: *** [all] Error 2
640

Build Log 283357 (remote - stdout)
25 - 50 - 100 - Unlimited Lines

4746 HC [stage 1] compiler/stage2/build/Coercion.o
4747 HC [stage 1] compiler/stage2/build/PatSyn.o
4748 HC [stage 1] compiler/stage2/build/Literal.o
4749 HC [stage 1] compiler/stage2/build/HsLit.o
4750 HC [stage 1] compiler/stage2/build/Unify.o
4751 HC [stage 1] compiler/stage2/build/TrieMap.o
4752 HC [stage 1] compiler/stage2/build/Hoopl/Label.o
4753 HC [stage 1] compiler/stage2/build/Hoopl/Graph.o
4754 HC [stage 1] compiler/stage2/build/BlockId.o-boot
4755 HC [stage 1] compiler/stage2/build/CmmSwitch.o
4756 HC [stage 1] compiler/stage2/build/DataCon.o
4757 HC [stage 1] compiler/stage2/build/RepType.o
4758 HC [stage 1] compiler/stage2/build/Demand.o
4759 HC [stage 1] compiler/stage2/build/CoreSyn.o
4760 HC [stage 1] compiler/stage2/build/ConLike.o
4761 HC [stage 1] compiler/stage2/build/CoreMap.o
4762 HC [stage 1] compiler/stage2/build/IdInfo.o
4763 HC [stage 1] compiler/stage2/build/Id.o
4764 HC [stage 1] compiler/stage2/build/TysWiredIn.o
4765 HC [stage 1] compiler/stage2/build/CoreStats.o
4766 HC [stage 1] compiler/stage2/build/HsTypes.o
4767 HC [stage 1] compiler/stage2/build/InteractiveEvalTypes.o
4768 HC [stage 1] compiler/stage2/build/CoreSeq.o
4769 HC [stage 1] compiler/stage2/build/UnVarGraph.o
4770

Drydock: Prepare tree

When
Completed at Jul 9 2018, 7:07 AM · Built for 12 s
Status
Passed

Build Log 283356 (remote - stderr)
25 - 50 - 100 - Unlimited Lines

1+ git clean -qxfd
2+ git submodule sync
3+ git submodule update --init --recursive
4From git://git.haskell.org/haddock
5 + 6debdc0...0c99b14 alexbiehl-patch-1 -> origin/alexbiehl-patch-1 (forced update)
6 ec0a8ba..ddc115e class-default-sigs -> origin/class-default-sigs
7 bea565e..657b1b3 ghc-8.4 -> origin/ghc-8.4
8 + 93f8400...f50684f ghc-head -> origin/ghc-head (forced update)
9+ git submodule foreach -q git clean -qxfd
10

Build Log 283355 (remote - stdout)
25 - 50 - 100 - Unlimited Lines

16Synchronizing submodule url for 'libraries/parallel'
17Synchronizing submodule url for 'libraries/parsec'
18Synchronizing submodule url for 'libraries/pretty'
19Synchronizing submodule url for 'libraries/process'
20Synchronizing submodule url for 'libraries/random'
21Synchronizing submodule url for 'libraries/stm'
22Synchronizing submodule url for 'libraries/terminfo'
23Synchronizing submodule url for 'libraries/text'
24Synchronizing submodule url for 'libraries/time'
25Synchronizing submodule url for 'libraries/transformers'
26Synchronizing submodule url for 'libraries/unix'
27Synchronizing submodule url for 'libraries/xhtml'
28Synchronizing submodule url for 'nofib'
29Synchronizing submodule url for 'utils/haddock'
30Synchronizing submodule url for 'utils/hsc2hs'
31Submodule path 'libraries/Cabal': checked out '8fbacca029f3ad764576aefb610a0408c4b6aaad'
32Submodule path 'libraries/containers': checked out 'e5b3bbaeb79cbf3a2c99bd14257d4199cc651b73'
33Submodule path 'libraries/haskeline': checked out '19b0be5687e933494c462a72cd7348c397aa3406'
34Submodule path 'libraries/hpc': checked out '85e04edd6e29de549301cf10d2c725cbf29b2098'
35Submodule path 'libraries/parallel': checked out '41279a764acd0758f15801c10650d73343637451'
36Submodule path 'libraries/process': checked out '36a3ad577e31e8c3336c7464b252fc2c9b01a20c'
37Submodule path 'nofib': checked out 'a3b0f2b2cff8babbb85cbbe1e7515905ffb444a8'
38Submodule path 'utils/haddock': checked out '3266a962f7b6083b4b48cb66e70c62e3157df930'
39Submodule path 'utils/hsc2hs': checked out '6b6938db11a33904bb6ba90d70d89df4b72a7f90'
40

Lease Working Copy

When
Completed at Jul 9 2018, 7:06 AM · Built for 5 d, 23 h
Status
Passed
Description

Lease a working copy for OSX/amd64 builds.