Build 49183

Properties

Drydock: Build

When
Completed at Jul 9 2018, 12:57 PM · Built for 22 m, 6 s
Status
Failed
Description

Run the build.

Build Log 283404 (remote - stderr)
25 - 50 - 100 - Unlimited Lines

355 ~~~~~~ ^
356 |
357315 | expand(table);
358 | ^
359
360rts/Hash.c:134:1: error: note: 'expand' declared here
361 |
362134 | STATIC_INLINE void
363 | ^
364STATIC_INLINE void
365^
366
367includes/Stg.h:143:23: error:
368 note: expanded from macro 'STATIC_INLINE'
369 |
370143 | #define STATIC_INLINE static inline
371 | ^
372#define STATIC_INLINE static inline
373 ^
3741 error generated.
375`gcc' failed in phase `C Compiler'. (Exit code: 1)
376make[1]: *** [rts/dist/build/Hash.o] Error 1
377make[1]: *** Waiting for unfinished jobs....
378make: *** [all] Error 2
379

Build Log 283403 (remote - stdout)
25 - 50 - 100 - Unlimited Lines

2115 CC utils/hp2ps/dist-install/build/TopTwenty.dyn_o
2116 CC utils/hp2ps/dist-install/build/Reorder.dyn_o
2117 CC utils/hp2ps/dist-install/build/AuxFile.dyn_o
2118 CC utils/hp2ps/dist-install/build/Deviation.dyn_o
2119 CC utils/hp2ps/dist-install/build/HpFile.dyn_o
2120 CC utils/hp2ps/dist-install/build/Marks.dyn_o
2121 CC utils/hp2ps/dist-install/build/Scale.dyn_o
2122 CC utils/hp2ps/dist-install/build/TraceElement.dyn_o
2123 CC utils/hp2ps/dist-install/build/Axes.dyn_o
2124 CC utils/hp2ps/dist-install/build/Dimensions.dyn_o
2125 CC utils/hp2ps/dist-install/build/Key.dyn_o
2126 CC utils/hp2ps/dist-install/build/PsFile.dyn_o
2127 CC utils/hp2ps/dist-install/build/Shade.dyn_o
2128 CC utils/hp2ps/dist-install/build/Utilities.dyn_o
2129 rts_dist_HC rts/dist/build/Adjustor.o
2130 rts_dist_HC rts/dist/build/Arena.o
2131 rts_dist_HC rts/dist/build/Capability.o
2132 rts_dist_HC rts/dist/build/CheckUnload.o
2133 rts_dist_HC rts/dist/build/ClosureFlags.o
2134 rts_dist_HC rts/dist/build/Disassembler.o
2135 rts_dist_HC rts/dist/build/FileLock.o
2136 rts_dist_HC rts/dist/build/Globals.o
2137 rts_dist_HC rts/dist/build/Hash.o
2138 rts_dist_HC rts/dist/build/Heap.o
2139

Drydock: Prepare tree

When
Completed at Jul 9 2018, 12:35 PM · Built for 12 s
Status
Passed

Build Log 283402 (remote - stderr)
25 - 50 - 100 - Unlimited Lines

1+ git clean -qxfd
2+ git submodule sync
3+ git submodule update --init --recursive
4+ git submodule foreach -q git clean -qxfd
5

Build Log 283401 (remote - stdout)
25 - 50 - 100 - Unlimited Lines

15Synchronizing submodule url for 'libraries/mtl'
16Synchronizing submodule url for 'libraries/parallel'
17Synchronizing submodule url for 'libraries/parsec'
18Synchronizing submodule url for 'libraries/pretty'
19Synchronizing submodule url for 'libraries/process'
20Synchronizing submodule url for 'libraries/random'
21Synchronizing submodule url for 'libraries/stm'
22Synchronizing submodule url for 'libraries/terminfo'
23Synchronizing submodule url for 'libraries/text'
24Synchronizing submodule url for 'libraries/time'
25Synchronizing submodule url for 'libraries/transformers'
26Synchronizing submodule url for 'libraries/unix'
27Synchronizing submodule url for 'libraries/xhtml'
28Synchronizing submodule url for 'nofib'
29Synchronizing submodule url for 'utils/haddock'
30Synchronizing submodule url for 'utils/hsc2hs'
31Submodule path 'hadrian': checked out 'a63ad3294b5d51eec50d454810a314c0b2a696c7'
32Submodule path 'libraries/Cabal': checked out 'b8c4ce3dacece1b1ac68360b48a3129d9ca440c1'
33Submodule path 'libraries/binary': checked out 'ecf48c4589b927de3ae3fff8455c1c25140df7e9'
34Submodule path 'libraries/haskeline': checked out '4168a4adb7a8a572995d4b5deee33fbe34d0f1aa'
35Submodule path 'libraries/process': checked out '36a3ad577e31e8c3336c7464b252fc2c9b01a20c'
36Submodule path 'libraries/stm': checked out '637013d3f2596c86adc8c946e2f38e9e1a85fd84'
37Submodule path 'nofib': checked out 'a3b0f2b2cff8babbb85cbbe1e7515905ffb444a8'
38Submodule path 'utils/haddock': checked out '2755526abb478c2f51c9cf4b894de287dd318868'
39

Lease Working Copy

When
Completed at Jul 9 2018, 12:35 PM · Built for 6 d, 13 h
Status
Passed
Description

Lease a working copy for OSX/amd64 builds.