Build 49159

Properties

Drydock: Build

When
Completed at Jul 22 2018, 8:31 AM · Built for 53 m, 55 s
Status
Failed
Description

Run the build.

Build Log 287032 (remote - stderr)
25 - 50 - 100 - Unlimited Lines

617 Call hs_init_ghc() from your main() function to set these options.
618Warning: -rtsopts and -with-rtsopts have no effect with -shared.
619 Call hs_init_ghc() from your main() function to set these options.
620Warning: -rtsopts and -with-rtsopts have no effect with -shared.
621 Call hs_init_ghc() from your main() function to set these options.
622Warning: -rtsopts and -with-rtsopts have no effect with -shared.
623 Call hs_init_ghc() from your main() function to set these options.
624
625compiler/llvmGen/LlvmCodeGen/CodeGen.hs:1166:22: error: [-Wincomplete-patterns, -Werror=incomplete-patterns]
626 Pattern match(es) are non-exhaustive
627 In a case alternative: Patterns not matched: (MO_VF_Broadcast _ _)
628 |
6291166 | genMachOp _ op [x] = case op of
630 | ^^^^^^^^^^...
631
632compiler/llvmGen/LlvmCodeGen/CodeGen.hs:1374:32: error: [-Wincomplete-patterns, -Werror=incomplete-patterns]
633 Pattern match(es) are non-exhaustive
634 In a case alternative: Patterns not matched: (MO_VF_Broadcast _ _)
635 |
6361374 | genMachOp_slow opt op [x, y] = case op of
637 | ^^^^^^^^^^...
638make[1]: *** [compiler/stage2/build/LlvmCodeGen/CodeGen.o] Error 1
639make[1]: *** Waiting for unfinished jobs....
640make: *** [all] Error 2
641

Build Log 287031 (remote - stdout)
25 - 50 - 100 - Unlimited Lines

4925 HC [stage 1] libraries/Cabal/Cabal/dist-install/build/Distribution/ParseUtils.o
4926 HC [stage 1] compiler/stage2/build/LlvmCodeGen/Regs.o
4927 HC [stage 1] compiler/stage2/build/StgCmmTicky.o
4928 HC [stage 1] compiler/stage2/build/StgCmmEnv.o
4929 HC [stage 1] compiler/stage2/build/RegAlloc/Linear/JoinToTargets.o
4930 HC [stage 1] compiler/stage2/build/SPARC/CodeGen/Amode.o
4931 HC [stage 1] compiler/stage2/build/SPARC/CodeGen/CondCode.o
4932 HC [stage 1] compiler/stage2/build/StgCmmProf.o
4933 HC [stage 1] libraries/Cabal/Cabal/dist-install/build/Distribution/Types/PackageName.o
4934 HC [stage 1] libraries/Cabal/Cabal/dist-install/build/Distribution/Types/LegacyExeDependency.o
4935 HC [stage 1] libraries/Cabal/Cabal/dist-install/build/Distribution/PrettyUtils.o
4936 HC [stage 1] compiler/stage2/build/LlvmCodeGen/Base.o
4937 HC [stage 1] compiler/stage2/build/StgCmmLayout.o
4938 HC [stage 1] compiler/stage2/build/RegAlloc/Linear/Main.o
4939 HC [stage 1] compiler/stage2/build/SPARC/CodeGen/Gen64.o
4940 HC [stage 1] libraries/Cabal/Cabal/dist-install/build/Distribution/Types/PackageId.o
4941 HC [stage 1] libraries/Cabal/Cabal/dist-install/build/Distribution/Types/UnqualComponentName.o
4942 HC [stage 1] libraries/Cabal/Cabal/dist-install/build/Distribution/Types/Mixin.o
4943 HC [stage 1] libraries/Cabal/Cabal/dist-install/build/Distribution/Types/ModuleReexport.o
4944 HC [stage 1] compiler/stage2/build/SysTools/Tasks.o
4945 HC [stage 1] compiler/stage2/build/ByteCodeInstr.o
4946 HC [stage 1] compiler/stage2/build/LlvmCodeGen/Data.o
4947 HC [stage 1] compiler/stage2/build/LlvmCodeGen/CodeGen.o
4948 HC [stage 1] compiler/stage2/build/SPARC/CodeGen/Gen32.o
4949

Drydock: Prepare tree

When
Completed at Jul 22 2018, 7:37 AM · Built for 10 s
Status
Passed

Build Log 287030 (remote - stderr)
25 - 50 - 100 - Unlimited Lines

1+ git clean -qxfd
2+ git submodule sync
3+ git submodule update --init --recursive
4+ git submodule foreach -q git clean -qxfd
5

Build Log 287029 (remote - stdout)
25 - 50 - 100 - Unlimited Lines

10Synchronizing submodule url for 'libraries/directory'
11Synchronizing submodule url for 'libraries/dph'
12Synchronizing submodule url for 'libraries/filepath'
13Synchronizing submodule url for 'libraries/haskeline'
14Synchronizing submodule url for 'libraries/hpc'
15Synchronizing submodule url for 'libraries/integer-gmp/gmp/gmp-tarballs'
16Synchronizing submodule url for 'libraries/mtl'
17Synchronizing submodule url for 'libraries/parallel'
18Synchronizing submodule url for 'libraries/parsec'
19Synchronizing submodule url for 'libraries/pretty'
20Synchronizing submodule url for 'libraries/primitive'
21Synchronizing submodule url for 'libraries/process'
22Synchronizing submodule url for 'libraries/random'
23Synchronizing submodule url for 'libraries/stm'
24Synchronizing submodule url for 'libraries/terminfo'
25Synchronizing submodule url for 'libraries/text'
26Synchronizing submodule url for 'libraries/time'
27Synchronizing submodule url for 'libraries/transformers'
28Synchronizing submodule url for 'libraries/unix'
29Synchronizing submodule url for 'libraries/vector'
30Synchronizing submodule url for 'libraries/xhtml'
31Synchronizing submodule url for 'nofib'
32Synchronizing submodule url for 'utils/haddock'
33Synchronizing submodule url for 'utils/hsc2hs'
34

Lease Working Copy

When
Completed at Jul 22 2018, 7:37 AM · Built for 2 w, 5 d
Status
Passed
Description

Lease a working copy for OSX/amd64 builds.