Build 48900

Properties

Drydock: Build

When
Completed at Jun 26 2018, 5:39 PM · Built for 36 m, 27 s
Status
Failed

Build Log 280270 (remote - stderr)
25 - 50 - 100 - Unlimited Lines

489Warning: -rtsopts and -with-rtsopts have no effect with -shared.
490 Call hs_init_ghc() from your main() function to set these options.
491ar: creating libraries/ghci/dist-install/build/libHSghci-8.5.a
492Warning: -rtsopts and -with-rtsopts have no effect with -shared.
493 Call hs_init_ghc() from your main() function to set these options.
494Warning: -rtsopts and -with-rtsopts have no effect with -shared.
495 Call hs_init_ghc() from your main() function to set these options.
496
497compiler/llvmGen/LlvmCodeGen/CodeGen.hs:1166:22: error: [-Wincomplete-patterns, -Werror=incomplete-patterns]
498 Pattern match(es) are non-exhaustive
499 In a case alternative: Patterns not matched: (MO_VF_Broadcast _ _)
500 |
5011166 | genMachOp _ op [x] = case op of
502 | ^^^^^^^^^^...
503
504compiler/llvmGen/LlvmCodeGen/CodeGen.hs:1374:32: error: [-Wincomplete-patterns, -Werror=incomplete-patterns]
505 Pattern match(es) are non-exhaustive
506 In a case alternative: Patterns not matched: (MO_VF_Broadcast _ _)
507 |
5081374 | genMachOp_slow opt op [x, y] = case op of
509 | ^^^^^^^^^^...
510make[1]: *** [compiler/stage2/build/LlvmCodeGen/CodeGen.o] Error 1
511make[1]: *** Waiting for unfinished jobs....
512make: *** [all] Error 2
513

Build Log 280269 (remote - stdout)
25 - 50 - 100 - Unlimited Lines

4998 HC [stage 1] compiler/stage2/build/StgCmmExtCode.o
4999 HC [stage 1] libraries/Cabal/Cabal/dist-install/build/Distribution/Parsec/Newtypes.o
5000 HC [stage 1] compiler/stage2/build/LlvmCodeGen/Regs.o
5001 HC [stage 1] compiler/stage2/build/StgCmmTicky.o
5002 HC [stage 1] compiler/stage2/build/StgCmmEnv.o
5003 HC [stage 1] compiler/stage2/build/RegAlloc/Linear/JoinToTargets.o
5004 HC [stage 1] compiler/stage2/build/SPARC/CodeGen/Amode.o
5005 HC [stage 1] compiler/stage2/build/SPARC/CodeGen/CondCode.o
5006 HC [stage 1] compiler/stage2/build/StgCmmProf.o
5007 HC [stage 1] libraries/Cabal/Cabal/dist-install/build/Distribution/ParseUtils.o
5008 HC [stage 1] compiler/stage2/build/LlvmCodeGen/Base.o
5009 HC [stage 1] compiler/stage2/build/StgCmmLayout.o
5010 HC [stage 1] compiler/stage2/build/RegAlloc/Linear/Main.o
5011 HC [stage 1] compiler/stage2/build/SPARC/CodeGen/Gen64.o
5012 HC [stage 1] libraries/Cabal/Cabal/dist-install/build/Distribution/Types/PackageName.o
5013 HC [stage 1] libraries/Cabal/Cabal/dist-install/build/Distribution/Types/LegacyExeDependency.o
5014 HC [stage 1] libraries/Cabal/Cabal/dist-install/build/Distribution/PrettyUtils.o
5015 HC [stage 1] compiler/stage2/build/SysTools/Tasks.o
5016 HC [stage 1] compiler/stage2/build/ByteCodeInstr.o
5017 HC [stage 1] compiler/stage2/build/LlvmCodeGen/Data.o
5018 HC [stage 1] compiler/stage2/build/LlvmCodeGen/CodeGen.o
5019 HC [stage 1] compiler/stage2/build/SPARC/CodeGen/Gen32.o
5020compiler/ghc.mk:447: recipe for target 'compiler/stage2/build/LlvmCodeGen/CodeGen.o' failed
5021Makefile:122: recipe for target 'all' failed
5022

Drydock: Prepare tree

When
Completed at Jun 26 2018, 5:02 PM · Built for 5 s
Status
Passed

Build Log 280268 (remote - stderr)
25 - 50 - 100 - Unlimited Lines

1+ git clean -qxfd
2+ git submodule sync
3+ git submodule update --init --recursive
4warning: unable to rmdir docs/_extensions/haddock-autolink: Directory not empty
5+ git submodule foreach -q git clean -qxfd
6

Build Log 280267 (remote - stdout)
25 - 50 - 100 - Unlimited Lines

22Synchronizing submodule url for 'libraries/random'
23Synchronizing submodule url for 'libraries/stm'
24Synchronizing submodule url for 'libraries/terminfo'
25Synchronizing submodule url for 'libraries/text'
26Synchronizing submodule url for 'libraries/time'
27Synchronizing submodule url for 'libraries/transformers'
28Synchronizing submodule url for 'libraries/unix'
29Synchronizing submodule url for 'libraries/vector'
30Synchronizing submodule url for 'libraries/xhtml'
31Synchronizing submodule url for 'nofib'
32Synchronizing submodule url for 'utils/haddock'
33Synchronizing submodule url for 'utils/hsc2hs'
34Submodule path 'hadrian': checked out '7c3c45f4539af8e75764a1c100dfbb35a86f4be3'
35Submodule path 'libraries/Cabal': checked out 'cbdb135bdadab9595f1a80be4c65453b49a9dde2'
36Submodule path 'libraries/binary': checked out 'd4a030ab448191f664fc734bfbee61450a6fa5af'
37Submodule path 'libraries/containers': checked out 'a57e7dd0c0aa6a719a73085ae30edef8206ccea0'
38Submodule path 'libraries/haskeline': checked out '481b890e8616d9e85da69173d5079ad49f9fb83d'
39Submodule path 'libraries/hpc': checked out '91f520cb9725d812fa93b57bca1d8dbd72c88dd5'
40Submodule path 'libraries/parallel': checked out 'd08911d1748b0c6bd0dbde282acc164c94bb0d83'
41Submodule path 'libraries/process': checked out '78c338b2ad06f0a3ed4ace7d95cc68ddb87ab207'
42Submodule path 'libraries/stm': checked out '33a36c33de150f562a98803e2fc332f07bb29457'
43Submodule path 'nofib': checked out '1364fe623f9216108a285a8804a27bdd8dfea3c4'
44Submodule path 'utils/haddock': checked out '46ff2306f580c44915a6f3adb652f02b7f4edfe9'
45Submodule path 'utils/hsc2hs': checked out 'b8588039f3810e2d0f52e9afdb15998992ee38b1'
46

Build Working Copy

When
Completed at Jun 26 2018, 5:02 PM · Built for 5 s
Status
Passed
Description

Lease a working copy for Linux/amd64 builds.