Build 47693

Properties

Drydock: Build

When
Completed at Jun 12 2018, 10:43 PM · Built for 17 m, 4 s
Status
Failed

Build Log 275762 (remote - stderr)
25 - 50 - 100 - Unlimited Lines

344ar: creating rts/dist/build/libHSrts_l.a
345ar: creating rts/dist/build/libHSrts_debug.a
346ar: creating rts/dist/build/libHSrts_thr.a
347ar: creating rts/dist/build/libHSrts_thr_debug.a
348ar: creating rts/dist/build/libHSrts_thr_l.a
349/usr/bin/ld.gold: error: rts/dist/build/HeapStackCheck.dyn_o: requires unsupported dynamic reloc 11; recompile with -fPIC
350/usr/bin/ld.gold: error: rts/dist/build/PrimOps.dyn_o: requires unsupported dynamic reloc 11; recompile with -fPIC
351collect2: error: ld returned 1 exit status
352`gcc' failed in phase `Linker'. (Exit code: 1)
353make[1]: *** [rts/dist/build/libHSrts-ghc8.5.20180612.so] Error 1
354make[1]: *** Waiting for unfinished jobs....
355/var/drydock/workingcopy-121262/repo/glasgow-haskell-compiler/docs/users_guide/glasgow_exts.rst:2193: WARNING: Could not lex literal_block as "haskell". Highlighting skipped.
356/var/drydock/workingcopy-121262/repo/glasgow-haskell-compiler/docs/users_guide/glasgow_exts.rst:2213: WARNING: Could not lex literal_block as "haskell". Highlighting skipped.
357/var/drydock/workingcopy-121262/repo/glasgow-haskell-compiler/docs/users_guide/glasgow_exts.rst:3754: WARNING: Could not lex literal_block as "haskell". Highlighting skipped.
358/var/drydock/workingcopy-121262/repo/glasgow-haskell-compiler/docs/users_guide/glasgow_exts.rst:8640: WARNING: Could not lex literal_block as "haskell". Highlighting skipped.
359/var/drydock/workingcopy-121262/repo/glasgow-haskell-compiler/docs/users_guide/glasgow_exts.rst:8653: WARNING: Could not lex literal_block as "haskell". Highlighting skipped.
360/var/drydock/workingcopy-121262/repo/glasgow-haskell-compiler/docs/users_guide/glasgow_exts.rst:10742: WARNING: Could not lex literal_block as "haskell". Highlighting skipped.
361/var/drydock/workingcopy-121262/repo/glasgow-haskell-compiler/docs/users_guide/glasgow_exts.rst:12077: WARNING: Could not lex literal_block as "haskell". Highlighting skipped.
362/var/drydock/workingcopy-121262/repo/glasgow-haskell-compiler/docs/users_guide/glasgow_exts.rst:12093: WARNING: Could not lex literal_block as "haskell". Highlighting skipped.
363/var/drydock/workingcopy-121262/repo/glasgow-haskell-compiler/docs/users_guide/glasgow_exts.rst:12110: WARNING: Could not lex literal_block as "haskell". Highlighting skipped.
364/var/drydock/workingcopy-121262/repo/glasgow-haskell-compiler/docs/users_guide/glasgow_exts.rst:12333: WARNING: Could not lex literal_block as "haskell". Highlighting skipped.
365/var/drydock/workingcopy-121262/repo/glasgow-haskell-compiler/docs/users_guide/separate_compilation.rst:611: WARNING: Could not lex literal_block as "haskell". Highlighting skipped.
366/var/drydock/workingcopy-121262/repo/glasgow-haskell-compiler/docs/users_guide/glasgow_exts.rst:10238: WARNING: undefined label: pattern signature equivalent pattern-equiv-form (if the link has no caption the label must precede a section header)
367make: *** [all] Error 2
368

Build Log 275761 (remote - stdout)
25 - 50 - 100 - Unlimited Lines

3784writing output... [ 69%] runtime_control
3785writing output... [ 71%] safe_haskell
3786writing output... [ 74%] separate_compilation
3787writing output... [ 76%] shared_libs
3788writing output... [ 79%] sooner
3789writing output... [ 82%] usage
3790writing output... [ 84%] using
3791writing output... [ 87%] using-concurrent
3792writing output... [ 89%] using-optimisation
3793writing output... [ 92%] using-warnings
3794writing output... [ 94%] utils
3795writing output... [ 97%] what_glasgow_exts_does
3796writing output... [100%] win32-dlls
3797
3798generating indices... genindex
3799writing additional pages... search opensearch
3800copying images... [100%] images/prof_scc.svg
3801
3802copying static files... done
3803copying extra files... done
3804dumping search index in English (code: en) ... done
3805dumping object inventory... done
3806build succeeded, 16 warnings.
3807Makefile:122: recipe for target 'all' failed
3808

Drydock: Prepare tree

When
Completed at Jun 12 2018, 10:26 PM · Built for 3 s
Status
Passed

Build Log 275760 (remote - stderr)
25 - 50 - 100 - Unlimited Lines

1+ git clean -qxfd
2+ git submodule sync
3+ git submodule update --init --recursive
4+ git submodule foreach -q git clean -qxfd
5

Build Log 275759 (remote - stdout)
25 - 50 - 100 - Unlimited Lines

9Synchronizing submodule url for 'libraries/deepseq'
10Synchronizing submodule url for 'libraries/directory'
11Synchronizing submodule url for 'libraries/filepath'
12Synchronizing submodule url for 'libraries/haskeline'
13Synchronizing submodule url for 'libraries/hpc'
14Synchronizing submodule url for 'libraries/integer-gmp/gmp/gmp-tarballs'
15Synchronizing submodule url for 'libraries/mtl'
16Synchronizing submodule url for 'libraries/parallel'
17Synchronizing submodule url for 'libraries/parsec'
18Synchronizing submodule url for 'libraries/pretty'
19Synchronizing submodule url for 'libraries/process'
20Synchronizing submodule url for 'libraries/random'
21Synchronizing submodule url for 'libraries/stm'
22Synchronizing submodule url for 'libraries/terminfo'
23Synchronizing submodule url for 'libraries/text'
24Synchronizing submodule url for 'libraries/time'
25Synchronizing submodule url for 'libraries/transformers'
26Synchronizing submodule url for 'libraries/unix'
27Synchronizing submodule url for 'libraries/xhtml'
28Synchronizing submodule url for 'nofib'
29Synchronizing submodule url for 'utils/haddock'
30Synchronizing submodule url for 'utils/hsc2hs'
31Submodule path 'hadrian': checked out '7c3c45f4539af8e75764a1c100dfbb35a86f4be3'
32Submodule path 'libraries/Cabal': checked out 'cbdb135bdadab9595f1a80be4c65453b49a9dde2'
33

Build Working Copy

When
Completed at Jun 12 2018, 10:26 PM · Built for 15 h, 6 m
Status
Passed
Description

Lease a working copy for Linux/amd64 builds.