Build 47692

Properties

Drydock: Build

When
Completed at Jun 25 2018, 11:53 PM · Built for 22 m, 6 s
Status
Failed
Description

Run the build.

Build Log 280069 (remote - stderr)
25 - 50 - 100 - Unlimited Lines

36217 | cmpq _large_alloc_lim,%rcx
363 | ^
364
365/var/folders/3y/qjvrbynj45j_z4jt_l1k1qg00000gv/T/ghc483_0/ghc_4.s:507:2: error:
366 error: 32-bit absolute addressing is not supported in 64-bit mode
367 movq _stg_arg_bitmaps(%rdx),%rdx
368 ^
369 |
370507 | movq _stg_arg_bitmaps(%rdx),%rdx
371 | ^
372`gcc' failed in phase `Assembler'. (Exit code: 1)
373make[1]: *** [rts/dist/build/HeapStackCheck.o] Error 1
374make[1]: *** Waiting for unfinished jobs....
375
376/var/folders/3y/qjvrbynj45j_z4jt_l1k1qg00000gv/T/ghc484_0/ghc_4.s:1843:2: error:
377 error: 32-bit absolute addressing is not supported in 64-bit mode
378 cmpq $_stg_WEAK_info,%rbx
379 ^
380 |
3811843 | cmpq $_stg_WEAK_info,%rbx
382 | ^
383`gcc' failed in phase `Assembler'. (Exit code: 1)
384make[1]: *** [rts/dist/build/PrimOps.o] Error 1
385make: *** [all] Error 2
386

Build Log 280068 (remote - stdout)
25 - 50 - 100 - Unlimited Lines

2175 rts_dist_HC rts/dist/build/StaticPtrTable.o
2176 rts_dist_HC rts/dist/build/Stats.o
2177 rts_dist_HC rts/dist/build/StgCRun.o
2178 rts_dist_HC rts/dist/build/StgPrimFloat.o
2179 rts_dist_HC rts/dist/build/Task.o
2180 rts_dist_HC rts/dist/build/ThreadLabels.o
2181 rts_dist_HC rts/dist/build/ThreadPaused.o
2182 rts_dist_HC rts/dist/build/Threads.o
2183 rts_dist_HC rts/dist/build/Ticky.o
2184 rts_dist_HC rts/dist/build/Timer.o
2185 rts_dist_HC rts/dist/build/TopHandler.o
2186 rts_dist_HC rts/dist/build/Trace.o
2187 rts_dist_HC rts/dist/build/WSDeque.o
2188 rts_dist_HC rts/dist/build/Weak.o
2189 rts_dist_HC rts/dist/build/fs.o
2190 rts_dist_HC rts/dist/build/xxhash.o
2191 rts_dist_HC rts/dist/build/Apply.o
2192 rts_dist_HC rts/dist/build/Compact.o
2193 rts_dist_HC rts/dist/build/Exception.o
2194 rts_dist_HC rts/dist/build/HeapStackCheck.o
2195 rts_dist_HC rts/dist/build/PrimOps.o
2196 rts_dist_HC rts/dist/build/StgMiscClosures.o
2197 rts_dist_HC rts/dist/build/StgStartup.o
2198 rts_dist_HC rts/dist/build/StgStdThunks.o
2199

Drydock: Prepare tree

When
Completed at Jun 25 2018, 11:31 PM · Built for 11 s
Status
Passed

Build Log 280067 (remote - stderr)
25 - 50 - 100 - Unlimited Lines

1+ git clean -qxfd
2+ git submodule sync
3+ git submodule update --init --recursive
4+ git submodule foreach -q git clean -qxfd
5

Build Log 280066 (remote - stdout)
25 - 50 - 100 - Unlimited Lines

9Synchronizing submodule url for 'libraries/deepseq'
10Synchronizing submodule url for 'libraries/directory'
11Synchronizing submodule url for 'libraries/filepath'
12Synchronizing submodule url for 'libraries/haskeline'
13Synchronizing submodule url for 'libraries/hpc'
14Synchronizing submodule url for 'libraries/integer-gmp/gmp/gmp-tarballs'
15Synchronizing submodule url for 'libraries/mtl'
16Synchronizing submodule url for 'libraries/parallel'
17Synchronizing submodule url for 'libraries/parsec'
18Synchronizing submodule url for 'libraries/pretty'
19Synchronizing submodule url for 'libraries/process'
20Synchronizing submodule url for 'libraries/random'
21Synchronizing submodule url for 'libraries/stm'
22Synchronizing submodule url for 'libraries/terminfo'
23Synchronizing submodule url for 'libraries/text'
24Synchronizing submodule url for 'libraries/time'
25Synchronizing submodule url for 'libraries/transformers'
26Synchronizing submodule url for 'libraries/unix'
27Synchronizing submodule url for 'libraries/xhtml'
28Synchronizing submodule url for 'nofib'
29Synchronizing submodule url for 'utils/haddock'
30Synchronizing submodule url for 'utils/hsc2hs'
31Submodule path 'hadrian': checked out '7c3c45f4539af8e75764a1c100dfbb35a86f4be3'
32Submodule path 'libraries/Cabal': checked out 'cbdb135bdadab9595f1a80be4c65453b49a9dde2'
33

Lease Working Copy

When
Completed at Jun 25 2018, 11:31 PM · Built for 1 w, 6 d
Status
Passed
Description

Lease a working copy for OSX/amd64 builds.