Build 46293

Properties

Drydock: Build

When
Completed at Jun 4 2018, 10:16 AM · Built for 2 d, 9 h
Status
Failed

Build Log 272902 (remote - stderr)
25 - 50 - 100 - Unlimited Lines

512 Data.Sequence.Internal, Data.Set.Internal, Data.Tree,
513 Text.PrettyPrint.Annotated.HughesPJ, Text.PrettyPrint.HughesPJ,
514 Data.Text, Data.Text.Lazy]
515 []
516Warning: -rtsopts and -with-rtsopts have no effect with -no-hs-main.
517 Call hs_init_ghc() from your main() function to set these options.
518C:\msys64\var\drydock\workingcopy-121273\repo\glasgow-haskell-compiler\inplace\mingw\bin\ar.exe: creating compiler/stage2/build/libHSghc-8.5.a
519Warning: -rtsopts and -with-rtsopts have no effect with -no-hs-main.
520 Call hs_init_ghc() from your main() function to set these options.
521C:\msys64\var\drydock\workingcopy-121273\repo\glasgow-haskell-compiler\inplace\mingw\bin\ar.exe: creating libraries/parallel/dist-install/build/libHSparallel-3.2.1.1.a
522C:\msys64\var\drydock\workingcopy-121273\repo\glasgow-haskell-compiler\inplace\mingw\bin\ar.exe: creating libraries/random/dist-install/build/libHSrandom-1.1.a
523Warning: include-dirs: C:\msys64\var\drydock\workingcopy-121273\repo\glasgow-haskell-compiler\compiler\stage2\build\utils doesn't exist or isn't a directory
524Warning: include-dirs: C:\msys64\var\drydock\workingcopy-121273\repo\glasgow-haskell-compiler\compiler\stage2\build\../rts/dist/build doesn't exist or isn't a directory
525Warning: include-dirs: C:\msys64\var\drydock\workingcopy-121273\repo\glasgow-haskell-compiler\compiler\stage2\build\stage2 doesn't exist or isn't a directory
526Warning: include-dirs: C:\msys64\var\drydock\workingcopy-121273\repo\glasgow-haskell-compiler\libraries\haskeline\dist-install\build\includes doesn't exist or isn't a directory
527Warning: include-dirs: C:\msys64\var\drydock\workingcopy-121273\repo\glasgow-haskell-compiler\libraries\text\dist-install\build\include doesn't exist or isn't a directory
528Warning: include-dirs: C:\msys64\var\drydock\workingcopy-121273\repo\glasgow-haskell-compiler\libraries\Win32\dist-install\build\include doesn't exist or isn't a directory
529Warning: include-dirs: C:\msys64\var\drydock\workingcopy-121273\repo\glasgow-haskell-compiler\libraries\containers\dist-install\build\include doesn't exist or isn't a directory
530Warning: include-dirs: C:\msys64\var\drydock\workingcopy-121273\repo\glasgow-haskell-compiler\libraries\bytestring\dist-install\build\include doesn't exist or isn't a directory
531rts-1.0: Warning: .:479:1: The field "hugs-options" is deprecated. hugs isn't supported anymore
532make[3]: *** [ghc.mk:1004: install_packages] Terminated
533make[2]: *** [Makefile:127: install] Terminated
534make[1]: *** [ghc.mk:1127: windows-binary-dist-prep] Terminated
535make: *** [Makefile:145: binary-dist-prep] Terminated
536

Build Log 272901 (remote - stdout)
25 - 50 - 100 - Unlimited Lines

7074Installing library in C:/msys64/var/drydock/workingcopy-121273/repo/glasgow-haskell-compiler/bindistprep/ghc-8.5.20180525/lib\process-1.6.3.0
7075Installing library in C:/msys64/var/drydock/workingcopy-121273/repo/glasgow-haskell-compiler/bindistprep/ghc-8.5.20180525/lib\hpc-0.6.0.3
7076Installing library in C:/msys64/var/drydock/workingcopy-121273/repo/glasgow-haskell-compiler/bindistprep/ghc-8.5.20180525/lib\pretty-1.1.3.6
7077Installing library in C:/msys64/var/drydock/workingcopy-121273/repo/glasgow-haskell-compiler/bindistprep/ghc-8.5.20180525/lib\binary-0.8.5.1
7078Installing library in C:/msys64/var/drydock/workingcopy-121273/repo/glasgow-haskell-compiler/bindistprep/ghc-8.5.20180525/lib\text-1.2.3.0
7079Installing library in C:/msys64/var/drydock/workingcopy-121273/repo/glasgow-haskell-compiler/bindistprep/ghc-8.5.20180525/lib\transformers-0.5.5.0
7080Installing library in C:/msys64/var/drydock/workingcopy-121273/repo/glasgow-haskell-compiler/bindistprep/ghc-8.5.20180525/lib\mtl-2.2.2
7081Installing library in C:/msys64/var/drydock/workingcopy-121273/repo/glasgow-haskell-compiler/bindistprep/ghc-8.5.20180525/lib\parsec-3.1.13.0.0.0.0.0
7082Installing library in C:/msys64/var/drydock/workingcopy-121273/repo/glasgow-haskell-compiler/bindistprep/ghc-8.5.20180525/lib\Cabal-2.3.0.0
7083Installing library in C:/msys64/var/drydock/workingcopy-121273/repo/glasgow-haskell-compiler/bindistprep/ghc-8.5.20180525/lib\ghc-boot-th-8.5
7084Installing library in C:/msys64/var/drydock/workingcopy-121273/repo/glasgow-haskell-compiler/bindistprep/ghc-8.5.20180525/lib\ghc-boot-8.5
7085Installing library in C:/msys64/var/drydock/workingcopy-121273/repo/glasgow-haskell-compiler/bindistprep/ghc-8.5.20180525/lib\template-haskell-2.14.0.0
7086Installing library in C:/msys64/var/drydock/workingcopy-121273/repo/glasgow-haskell-compiler/bindistprep/ghc-8.5.20180525/lib\ghc-compact-0.1.0.0
7087Installing library in C:/msys64/var/drydock/workingcopy-121273/repo/glasgow-haskell-compiler/bindistprep/ghc-8.5.20180525/lib\ghc-heap-8.5
7088Installing library in C:/msys64/var/drydock/workingcopy-121273/repo/glasgow-haskell-compiler/bindistprep/ghc-8.5.20180525/lib\xhtml-3000.2.2
7089Installing library in C:/msys64/var/drydock/workingcopy-121273/repo/glasgow-haskell-compiler/bindistprep/ghc-8.5.20180525/lib\stm-2.4.5.0
7090Installing library in C:/msys64/var/drydock/workingcopy-121273/repo/glasgow-haskell-compiler/bindistprep/ghc-8.5.20180525/lib\haskeline-0.7.4.2
7091Installing library in C:/msys64/var/drydock/workingcopy-121273/repo/glasgow-haskell-compiler/bindistprep/ghc-8.5.20180525/lib\ghci-8.5
7092Installing library in C:/msys64/var/drydock/workingcopy-121273/repo/glasgow-haskell-compiler/bindistprep/ghc-8.5.20180525/lib\ghc-8.5
7093Installing library in C:/msys64/var/drydock/workingcopy-121273/repo/glasgow-haskell-compiler/bindistprep/ghc-8.5.20180525/lib\parallel-3.2.1.1
7094Installing library in C:/msys64/var/drydock/workingcopy-121273/repo/glasgow-haskell-compiler/bindistprep/ghc-8.5.20180525/lib\random-1.1
7095Reading package info from "rts/dist/package.conf.install" ... done.
7096Registering library for ghc-prim-0.5.3..
7097Registering library for integer-gmp-1.0.2.0..
7098

Build Log 272618 (remote - stderr)
25 - 50 - 100 - Unlimited Lines

512 Data.Sequence.Internal, Data.Set.Internal, Data.Tree,
513 Text.PrettyPrint.Annotated.HughesPJ, Text.PrettyPrint.HughesPJ,
514 Data.Text, Data.Text.Lazy]
515 []
516Warning: -rtsopts and -with-rtsopts have no effect with -no-hs-main.
517 Call hs_init_ghc() from your main() function to set these options.
518C:\msys64\var\drydock\workingcopy-121273\repo\glasgow-haskell-compiler\inplace\mingw\bin\ar.exe: creating compiler/stage2/build/libHSghc-8.5.a
519Warning: -rtsopts and -with-rtsopts have no effect with -no-hs-main.
520 Call hs_init_ghc() from your main() function to set these options.
521C:\msys64\var\drydock\workingcopy-121273\repo\glasgow-haskell-compiler\inplace\mingw\bin\ar.exe: creating libraries/parallel/dist-install/build/libHSparallel-3.2.1.1.a
522C:\msys64\var\drydock\workingcopy-121273\repo\glasgow-haskell-compiler\inplace\mingw\bin\ar.exe: creating libraries/random/dist-install/build/libHSrandom-1.1.a
523Warning: include-dirs: C:\msys64\var\drydock\workingcopy-121273\repo\glasgow-haskell-compiler\compiler\stage2\build\utils doesn't exist or isn't a directory
524Warning: include-dirs: C:\msys64\var\drydock\workingcopy-121273\repo\glasgow-haskell-compiler\compiler\stage2\build\../rts/dist/build doesn't exist or isn't a directory
525Warning: include-dirs: C:\msys64\var\drydock\workingcopy-121273\repo\glasgow-haskell-compiler\compiler\stage2\build\stage2 doesn't exist or isn't a directory
526Warning: include-dirs: C:\msys64\var\drydock\workingcopy-121273\repo\glasgow-haskell-compiler\libraries\haskeline\dist-install\build\includes doesn't exist or isn't a directory
527Warning: include-dirs: C:\msys64\var\drydock\workingcopy-121273\repo\glasgow-haskell-compiler\libraries\text\dist-install\build\include doesn't exist or isn't a directory
528Warning: include-dirs: C:\msys64\var\drydock\workingcopy-121273\repo\glasgow-haskell-compiler\libraries\Win32\dist-install\build\include doesn't exist or isn't a directory
529Warning: include-dirs: C:\msys64\var\drydock\workingcopy-121273\repo\glasgow-haskell-compiler\libraries\containers\dist-install\build\include doesn't exist or isn't a directory
530Warning: include-dirs: C:\msys64\var\drydock\workingcopy-121273\repo\glasgow-haskell-compiler\libraries\bytestring\dist-install\build\include doesn't exist or isn't a directory
531rts-1.0: Warning: .:479:1: The field "hugs-options" is deprecated. hugs isn't supported anymore
532make[3]: *** [ghc.mk:1004: install_packages] Terminated
533make[2]: *** [Makefile:127: install] Terminated
534make[1]: *** [ghc.mk:1127: windows-binary-dist-prep] Terminated
535make: *** [Makefile:145: binary-dist-prep] Terminated
536

Build Log 272617 (remote - stdout)
25 - 50 - 100 - Unlimited Lines

7074Installing library in C:/msys64/var/drydock/workingcopy-121273/repo/glasgow-haskell-compiler/bindistprep/ghc-8.5.20180525/lib\process-1.6.3.0
7075Installing library in C:/msys64/var/drydock/workingcopy-121273/repo/glasgow-haskell-compiler/bindistprep/ghc-8.5.20180525/lib\hpc-0.6.0.3
7076Installing library in C:/msys64/var/drydock/workingcopy-121273/repo/glasgow-haskell-compiler/bindistprep/ghc-8.5.20180525/lib\pretty-1.1.3.6
7077Installing library in C:/msys64/var/drydock/workingcopy-121273/repo/glasgow-haskell-compiler/bindistprep/ghc-8.5.20180525/lib\binary-0.8.5.1
7078Installing library in C:/msys64/var/drydock/workingcopy-121273/repo/glasgow-haskell-compiler/bindistprep/ghc-8.5.20180525/lib\text-1.2.3.0
7079Installing library in C:/msys64/var/drydock/workingcopy-121273/repo/glasgow-haskell-compiler/bindistprep/ghc-8.5.20180525/lib\transformers-0.5.5.0
7080Installing library in C:/msys64/var/drydock/workingcopy-121273/repo/glasgow-haskell-compiler/bindistprep/ghc-8.5.20180525/lib\mtl-2.2.2
7081Installing library in C:/msys64/var/drydock/workingcopy-121273/repo/glasgow-haskell-compiler/bindistprep/ghc-8.5.20180525/lib\parsec-3.1.13.0.0.0.0.0
7082Installing library in C:/msys64/var/drydock/workingcopy-121273/repo/glasgow-haskell-compiler/bindistprep/ghc-8.5.20180525/lib\Cabal-2.3.0.0
7083Installing library in C:/msys64/var/drydock/workingcopy-121273/repo/glasgow-haskell-compiler/bindistprep/ghc-8.5.20180525/lib\ghc-boot-th-8.5
7084Installing library in C:/msys64/var/drydock/workingcopy-121273/repo/glasgow-haskell-compiler/bindistprep/ghc-8.5.20180525/lib\ghc-boot-8.5
7085Installing library in C:/msys64/var/drydock/workingcopy-121273/repo/glasgow-haskell-compiler/bindistprep/ghc-8.5.20180525/lib\template-haskell-2.14.0.0
7086Installing library in C:/msys64/var/drydock/workingcopy-121273/repo/glasgow-haskell-compiler/bindistprep/ghc-8.5.20180525/lib\ghc-compact-0.1.0.0
7087Installing library in C:/msys64/var/drydock/workingcopy-121273/repo/glasgow-haskell-compiler/bindistprep/ghc-8.5.20180525/lib\ghc-heap-8.5
7088Installing library in C:/msys64/var/drydock/workingcopy-121273/repo/glasgow-haskell-compiler/bindistprep/ghc-8.5.20180525/lib\xhtml-3000.2.2
7089Installing library in C:/msys64/var/drydock/workingcopy-121273/repo/glasgow-haskell-compiler/bindistprep/ghc-8.5.20180525/lib\stm-2.4.5.0
7090Installing library in C:/msys64/var/drydock/workingcopy-121273/repo/glasgow-haskell-compiler/bindistprep/ghc-8.5.20180525/lib\haskeline-0.7.4.2
7091Installing library in C:/msys64/var/drydock/workingcopy-121273/repo/glasgow-haskell-compiler/bindistprep/ghc-8.5.20180525/lib\ghci-8.5
7092Installing library in C:/msys64/var/drydock/workingcopy-121273/repo/glasgow-haskell-compiler/bindistprep/ghc-8.5.20180525/lib\ghc-8.5
7093Installing library in C:/msys64/var/drydock/workingcopy-121273/repo/glasgow-haskell-compiler/bindistprep/ghc-8.5.20180525/lib\parallel-3.2.1.1
7094Installing library in C:/msys64/var/drydock/workingcopy-121273/repo/glasgow-haskell-compiler/bindistprep/ghc-8.5.20180525/lib\random-1.1
7095Reading package info from "rts/dist/package.conf.install" ... done.
7096Registering library for ghc-prim-0.5.3..
7097Registering library for integer-gmp-1.0.2.0..
7098

Build Log 272353 (remote - stderr)
25 - 50 - 100 - Unlimited Lines

638 Data.Sequence.Internal, Data.Set.Internal, Data.Tree,
639 Text.PrettyPrint.Annotated.HughesPJ, Text.PrettyPrint.HughesPJ,
640 Data.Text, Data.Text.Lazy]
641 []
642Warning: -rtsopts and -with-rtsopts have no effect with -no-hs-main.
643 Call hs_init_ghc() from your main() function to set these options.
644C:\msys64\var\drydock\workingcopy-121273\repo\glasgow-haskell-compiler\inplace\mingw\bin\ar.exe: creating compiler/stage2/build/libHSghc-8.5.a
645Warning: -rtsopts and -with-rtsopts have no effect with -no-hs-main.
646 Call hs_init_ghc() from your main() function to set these options.
647C:\msys64\var\drydock\workingcopy-121273\repo\glasgow-haskell-compiler\inplace\mingw\bin\ar.exe: creating libraries/parallel/dist-install/build/libHSparallel-3.2.1.1.a
648C:\msys64\var\drydock\workingcopy-121273\repo\glasgow-haskell-compiler\inplace\mingw\bin\ar.exe: creating libraries/random/dist-install/build/libHSrandom-1.1.a
649Warning: include-dirs: C:\msys64\var\drydock\workingcopy-121273\repo\glasgow-haskell-compiler\compiler\stage2\build\utils doesn't exist or isn't a directory
650Warning: include-dirs: C:\msys64\var\drydock\workingcopy-121273\repo\glasgow-haskell-compiler\compiler\stage2\build\../rts/dist/build doesn't exist or isn't a directory
651Warning: include-dirs: C:\msys64\var\drydock\workingcopy-121273\repo\glasgow-haskell-compiler\compiler\stage2\build\stage2 doesn't exist or isn't a directory
652Warning: include-dirs: C:\msys64\var\drydock\workingcopy-121273\repo\glasgow-haskell-compiler\libraries\haskeline\dist-install\build\includes doesn't exist or isn't a directory
653Warning: include-dirs: C:\msys64\var\drydock\workingcopy-121273\repo\glasgow-haskell-compiler\libraries\text\dist-install\build\include doesn't exist or isn't a directory
654Warning: include-dirs: C:\msys64\var\drydock\workingcopy-121273\repo\glasgow-haskell-compiler\libraries\Win32\dist-install\build\include doesn't exist or isn't a directory
655Warning: include-dirs: C:\msys64\var\drydock\workingcopy-121273\repo\glasgow-haskell-compiler\libraries\containers\dist-install\build\include doesn't exist or isn't a directory
656Warning: include-dirs: C:\msys64\var\drydock\workingcopy-121273\repo\glasgow-haskell-compiler\libraries\bytestring\dist-install\build\include doesn't exist or isn't a directory
657rts-1.0: Warning: .:479:1: The field "hugs-options" is deprecated. hugs isn't supported anymore
658make[3]: *** [ghc.mk:1004: install_packages] Terminated
659make[2]: *** [Makefile:127: install] Terminated
660make[1]: *** [ghc.mk:1127: windows-binary-dist-prep] Terminated
661make: *** [Makefile:145: binary-dist-prep] Terminated
662

Build Log 272352 (remote - stdout)
25 - 50 - 100 - Unlimited Lines

7088Installing library in C:/msys64/var/drydock/workingcopy-121273/repo/glasgow-haskell-compiler/bindistprep/ghc-8.5.20180525/lib\transformers-0.5.5.0
7089Installing library in C:/msys64/var/drydock/workingcopy-121273/repo/glasgow-haskell-compiler/bindistprep/ghc-8.5.20180525/lib\mtl-2.2.2
7090Installing library in C:/msys64/var/drydock/workingcopy-121273/repo/glasgow-haskell-compiler/bindistprep/ghc-8.5.20180525/lib\parsec-3.1.13.0.0.0.0.0
7091Installing library in C:/msys64/var/drydock/workingcopy-121273/repo/glasgow-haskell-compiler/bindistprep/ghc-8.5.20180525/lib\Cabal-2.3.0.0
7092Installing library in C:/msys64/var/drydock/workingcopy-121273/repo/glasgow-haskell-compiler/bindistprep/ghc-8.5.20180525/lib\ghc-boot-th-8.5
7093Installing library in C:/msys64/var/drydock/workingcopy-121273/repo/glasgow-haskell-compiler/bindistprep/ghc-8.5.20180525/lib\ghc-boot-8.5
7094Installing library in C:/msys64/var/drydock/workingcopy-121273/repo/glasgow-haskell-compiler/bindistprep/ghc-8.5.20180525/lib\template-haskell-2.14.0.0
7095Installing library in C:/msys64/var/drydock/workingcopy-121273/repo/glasgow-haskell-compiler/bindistprep/ghc-8.5.20180525/lib\ghc-compact-0.1.0.0
7096Installing library in C:/msys64/var/drydock/workingcopy-121273/repo/glasgow-haskell-compiler/bindistprep/ghc-8.5.20180525/lib\ghc-heap-8.5
7097Installing library in C:/msys64/var/drydock/workingcopy-121273/repo/glasgow-haskell-compiler/bindistprep/ghc-8.5.20180525/lib\xhtml-3000.2.2
7098Installing library in C:/msys64/var/drydock/workingcopy-121273/repo/glasgow-haskell-compiler/bindistprep/ghc-8.5.20180525/lib\stm-2.4.5.0
7099Installing library in C:/msys64/var/drydock/workingcopy-121273/repo/glasgow-haskell-compiler/bindistprep/ghc-8.5.20180525/lib\haskeline-0.7.4.2
7100Installing library in C:/msys64/var/drydock/workingcopy-121273/repo/glasgow-haskell-compiler/bindistprep/ghc-8.5.20180525/lib\ghci-8.5
7101Installing library in C:/msys64/var/drydock/workingcopy-121273/repo/glasgow-haskell-compiler/bindistprep/ghc-8.5.20180525/lib\ghc-8.5
7102Installing library in C:/msys64/var/drydock/workingcopy-121273/repo/glasgow-haskell-compiler/bindistprep/ghc-8.5.20180525/lib\parallel-3.2.1.1
7103Installing library in C:/msys64/var/drydock/workingcopy-121273/repo/glasgow-haskell-compiler/bindistprep/ghc-8.5.20180525/lib\random-1.1
7104Reading package info from "rts/dist/package.conf.install" ... done.
7105Registering library for ghc-prim-0.5.3..
7106Registering library for integer-gmp-1.0.2.0..
7107Registering library for base-4.12.0.0..
7108Registering library for filepath-1.4.2..
7109Registering library for array-0.5.2.0..
7110Registering library for deepseq-1.4.4.0..
7111Registering library for bytestring-0.10.8.2..
7112

Drydock: Prepare tree

When
Completed at Jun 2 2018, 12:50 AM · Built for 43 s
Status
Passed

Build Log 272351 (remote - stderr)
25 - 50 - 100 - Unlimited Lines

1+ git clean -qxfd
2+ git submodule foreach git checkout .
3+ git submodule foreach git clean -qxfd
4+ git submodule sync
5+ git submodule update --init --recursive
6+ git submodule foreach -q git clean -qxfd
7

Build Log 272350 (remote - stdout)
25 - 50 - 100 - Unlimited Lines

78Synchronizing submodule url for 'libraries/directory'
79Synchronizing submodule url for 'libraries/dph'
80Synchronizing submodule url for 'libraries/filepath'
81Synchronizing submodule url for 'libraries/haskeline'
82Synchronizing submodule url for 'libraries/hpc'
83Synchronizing submodule url for 'libraries/integer-gmp/gmp/gmp-tarballs'
84Synchronizing submodule url for 'libraries/mtl'
85Synchronizing submodule url for 'libraries/parallel'
86Synchronizing submodule url for 'libraries/parsec'
87Synchronizing submodule url for 'libraries/pretty'
88Synchronizing submodule url for 'libraries/primitive'
89Synchronizing submodule url for 'libraries/process'
90Synchronizing submodule url for 'libraries/random'
91Synchronizing submodule url for 'libraries/stm'
92Synchronizing submodule url for 'libraries/terminfo'
93Synchronizing submodule url for 'libraries/text'
94Synchronizing submodule url for 'libraries/time'
95Synchronizing submodule url for 'libraries/transformers'
96Synchronizing submodule url for 'libraries/unix'
97Synchronizing submodule url for 'libraries/vector'
98Synchronizing submodule url for 'libraries/xhtml'
99Synchronizing submodule url for 'nofib'
100Synchronizing submodule url for 'utils/haddock'
101Synchronizing submodule url for 'utils/hsc2hs'
102

Lease Working Copy

When
Completed at Jun 2 2018, 12:49 AM · Built for 1 w, 9 h
Status
Passed