Build 46176

Properties

Drydock: Build

When
Completed at Jun 11 2018, 12:47 AM · Built for 1 h, 19 m
Status
Failed

Build Log 275195 (remote - stderr)
25 - 50 - 100 - Unlimited Lines

650C:\msys64\var\drydock\workingcopy-121273\repo\glasgow-haskell-compiler\inplace\mingw\bin\ar.exe: creating libraries/random/dist-install/build/libHSrandom-1.1.a
651Warning: include-dirs: C:\msys64\var\drydock\workingcopy-121273\repo\glasgow-haskell-compiler\compiler\stage2\build\utils doesn't exist or isn't a directory
652Warning: include-dirs: C:\msys64\var\drydock\workingcopy-121273\repo\glasgow-haskell-compiler\compiler\stage2\build\../rts/dist/build doesn't exist or isn't a directory
653Warning: include-dirs: C:\msys64\var\drydock\workingcopy-121273\repo\glasgow-haskell-compiler\compiler\stage2\build\stage2 doesn't exist or isn't a directory
654Warning: include-dirs: C:\msys64\var\drydock\workingcopy-121273\repo\glasgow-haskell-compiler\libraries\haskeline\dist-install\build\includes doesn't exist or isn't a directory
655Warning: include-dirs: C:\msys64\var\drydock\workingcopy-121273\repo\glasgow-haskell-compiler\libraries\text\dist-install\build\include doesn't exist or isn't a directory
656Warning: include-dirs: C:\msys64\var\drydock\workingcopy-121273\repo\glasgow-haskell-compiler\libraries\Win32\dist-install\build\include doesn't exist or isn't a directory
657Warning: include-dirs: C:\msys64\var\drydock\workingcopy-121273\repo\glasgow-haskell-compiler\libraries\containers\dist-install\build\include doesn't exist or isn't a directory
658Warning: include-dirs: C:\msys64\var\drydock\workingcopy-121273\repo\glasgow-haskell-compiler\libraries\bytestring\dist-install\build\include doesn't exist or isn't a directory
659rts-1.0: Warning: .:479:1: The field "hugs-options" is deprecated. hugs isn't supported anymore
660ghc-cabal.exe:
661'C:/msys64/var/drydock/workingcopy-121273/repo/glasgow-haskell-compiler/bindistprep/ghc-8.5.20180523/bin/ghc.exe'
662exited with an error:
663ghc.exe: internal error: evacuate: strange closure type 603981884
664(GHC version 8.5.20180523 for x86_64_unknown_mingw32)
665Please report this as a GHC bug: http://www.haskell.org/ghc/reportabug
666
667This application has requested the Runtime to terminate it in an unusual way.
668Please contact the application's support team for more information.
669
670make[3]: *** [ghc.mk:1004: install_packages] Error 1
671make[2]: *** [Makefile:127: install] Error 2
672make[1]: *** [ghc.mk:1127: windows-binary-dist-prep] Error 2
673make: *** [Makefile:145: binary-dist-prep] Error 2
674

Build Log 275194 (remote - stdout)
25 - 50 - 100 - Unlimited Lines

7051Installing library in C:/msys64/var/drydock/workingcopy-121273/repo/glasgow-haskell-compiler/bindistprep/ghc-8.5.20180523/lib\process-1.6.3.0
7052Installing library in C:/msys64/var/drydock/workingcopy-121273/repo/glasgow-haskell-compiler/bindistprep/ghc-8.5.20180523/lib\hpc-0.6.0.3
7053Installing library in C:/msys64/var/drydock/workingcopy-121273/repo/glasgow-haskell-compiler/bindistprep/ghc-8.5.20180523/lib\pretty-1.1.3.6
7054Installing library in C:/msys64/var/drydock/workingcopy-121273/repo/glasgow-haskell-compiler/bindistprep/ghc-8.5.20180523/lib\binary-0.8.5.1
7055Installing library in C:/msys64/var/drydock/workingcopy-121273/repo/glasgow-haskell-compiler/bindistprep/ghc-8.5.20180523/lib\text-1.2.3.0
7056Installing library in C:/msys64/var/drydock/workingcopy-121273/repo/glasgow-haskell-compiler/bindistprep/ghc-8.5.20180523/lib\transformers-0.5.5.0
7057Installing library in C:/msys64/var/drydock/workingcopy-121273/repo/glasgow-haskell-compiler/bindistprep/ghc-8.5.20180523/lib\mtl-2.2.2
7058Installing library in C:/msys64/var/drydock/workingcopy-121273/repo/glasgow-haskell-compiler/bindistprep/ghc-8.5.20180523/lib\parsec-3.1.13.0.0.0.0.0
7059Installing library in C:/msys64/var/drydock/workingcopy-121273/repo/glasgow-haskell-compiler/bindistprep/ghc-8.5.20180523/lib\Cabal-2.3.0.0
7060Installing library in C:/msys64/var/drydock/workingcopy-121273/repo/glasgow-haskell-compiler/bindistprep/ghc-8.5.20180523/lib\ghc-boot-th-8.5
7061Installing library in C:/msys64/var/drydock/workingcopy-121273/repo/glasgow-haskell-compiler/bindistprep/ghc-8.5.20180523/lib\ghc-boot-8.5
7062Installing library in C:/msys64/var/drydock/workingcopy-121273/repo/glasgow-haskell-compiler/bindistprep/ghc-8.5.20180523/lib\template-haskell-2.14.0.0
7063Installing library in C:/msys64/var/drydock/workingcopy-121273/repo/glasgow-haskell-compiler/bindistprep/ghc-8.5.20180523/lib\ghc-compact-0.1.0.0
7064Installing library in C:/msys64/var/drydock/workingcopy-121273/repo/glasgow-haskell-compiler/bindistprep/ghc-8.5.20180523/lib\ghc-heap-8.5
7065Installing library in C:/msys64/var/drydock/workingcopy-121273/repo/glasgow-haskell-compiler/bindistprep/ghc-8.5.20180523/lib\xhtml-3000.2.2
7066Installing library in C:/msys64/var/drydock/workingcopy-121273/repo/glasgow-haskell-compiler/bindistprep/ghc-8.5.20180523/lib\stm-2.4.5.0
7067Installing library in C:/msys64/var/drydock/workingcopy-121273/repo/glasgow-haskell-compiler/bindistprep/ghc-8.5.20180523/lib\haskeline-0.7.4.2
7068Installing library in C:/msys64/var/drydock/workingcopy-121273/repo/glasgow-haskell-compiler/bindistprep/ghc-8.5.20180523/lib\ghci-8.5
7069Installing library in C:/msys64/var/drydock/workingcopy-121273/repo/glasgow-haskell-compiler/bindistprep/ghc-8.5.20180523/lib\ghc-8.5
7070Installing library in C:/msys64/var/drydock/workingcopy-121273/repo/glasgow-haskell-compiler/bindistprep/ghc-8.5.20180523/lib\parallel-3.2.1.1
7071Installing library in C:/msys64/var/drydock/workingcopy-121273/repo/glasgow-haskell-compiler/bindistprep/ghc-8.5.20180523/lib\random-1.1
7072Reading package info from "rts/dist/package.conf.install" ... done.
7073Registering library for ghc-prim-0.5.3..
7074Registering library for integer-gmp-1.0.2.0..
7075

Drydock: Prepare tree

When
Completed at Jun 10 2018, 11:28 PM · Built for 1 m, 6 s
Status
Passed

Build Log 275193 (remote - stderr)
25 - 50 - 100 - Unlimited Lines

1+ git clean -qxfd
2+ git submodule foreach git checkout .
3+ git submodule foreach git clean -qxfd
4+ git submodule sync
5+ git submodule update --init --recursive
6+ git submodule foreach -q git clean -qxfd
7

Build Log 275192 (remote - stdout)
25 - 50 - 100 - Unlimited Lines

79Synchronizing submodule url for 'libraries/dph'
80Synchronizing submodule url for 'libraries/filepath'
81Synchronizing submodule url for 'libraries/haskeline'
82Synchronizing submodule url for 'libraries/hpc'
83Synchronizing submodule url for 'libraries/integer-gmp/gmp/gmp-tarballs'
84Synchronizing submodule url for 'libraries/mtl'
85Synchronizing submodule url for 'libraries/parallel'
86Synchronizing submodule url for 'libraries/parsec'
87Synchronizing submodule url for 'libraries/pretty'
88Synchronizing submodule url for 'libraries/primitive'
89Synchronizing submodule url for 'libraries/process'
90Synchronizing submodule url for 'libraries/random'
91Synchronizing submodule url for 'libraries/stm'
92Synchronizing submodule url for 'libraries/terminfo'
93Synchronizing submodule url for 'libraries/text'
94Synchronizing submodule url for 'libraries/time'
95Synchronizing submodule url for 'libraries/transformers'
96Synchronizing submodule url for 'libraries/unix'
97Synchronizing submodule url for 'libraries/vector'
98Synchronizing submodule url for 'libraries/xhtml'
99Synchronizing submodule url for 'nofib'
100Synchronizing submodule url for 'utils/haddock'
101Synchronizing submodule url for 'utils/hsc2hs'
102Submodule path 'utils/haddock': checked out '46ff2306f580c44915a6f3adb652f02b7f4edfe9'
103

Lease Working Copy

When
Completed at Jun 10 2018, 11:26 PM · Built for 2 w, 4 d
Status
Passed