Build 46167

Drydock: Build

When
Completed at Jun 21 2018, 3:58 PM · Built for 1 h, 18 m
Status
Failed

Build Log 278845 (remote - stderr)
25 - 50 - 100 - Unlimited Lines

644C:\msys64\var\drydock\workingcopy-121273\repo\glasgow-haskell-compiler\inplace\mingw\bin\ar.exe: creating libraries/random/dist-install/build/libHSrandom-1.1.a
645Warning: include-dirs: C:\msys64\var\drydock\workingcopy-121273\repo\glasgow-haskell-compiler\compiler\stage2\build\utils doesn't exist or isn't a directory
646Warning: include-dirs: C:\msys64\var\drydock\workingcopy-121273\repo\glasgow-haskell-compiler\compiler\stage2\build\../rts/dist/build doesn't exist or isn't a directory
647Warning: include-dirs: C:\msys64\var\drydock\workingcopy-121273\repo\glasgow-haskell-compiler\compiler\stage2\build\stage2 doesn't exist or isn't a directory
648Warning: include-dirs: C:\msys64\var\drydock\workingcopy-121273\repo\glasgow-haskell-compiler\libraries\haskeline\dist-install\build\includes doesn't exist or isn't a directory
649Warning: include-dirs: C:\msys64\var\drydock\workingcopy-121273\repo\glasgow-haskell-compiler\libraries\text\dist-install\build\include doesn't exist or isn't a directory
650Warning: include-dirs: C:\msys64\var\drydock\workingcopy-121273\repo\glasgow-haskell-compiler\libraries\Win32\dist-install\build\include doesn't exist or isn't a directory
651Warning: include-dirs: C:\msys64\var\drydock\workingcopy-121273\repo\glasgow-haskell-compiler\libraries\containers\dist-install\build\include doesn't exist or isn't a directory
652Warning: include-dirs: C:\msys64\var\drydock\workingcopy-121273\repo\glasgow-haskell-compiler\libraries\bytestring\dist-install\build\include doesn't exist or isn't a directory
653rts-1.0: Warning: .:479:1: The field "hugs-options" is deprecated. hugs isn't supported anymore
654ghc-cabal.exe:
655'C:/msys64/var/drydock/workingcopy-121273/repo/glasgow-haskell-compiler/bindistprep/ghc-8.5.20180523/bin/ghc.exe'
656exited with an error:
657ghc.exe: internal error: evacuate: strange closure type 1241
658(GHC version 8.5.20180523 for x86_64_unknown_mingw32)
659Please report this as a GHC bug: http://www.haskell.org/ghc/reportabug
660
661This application has requested the Runtime to terminate it in an unusual way.
662Please contact the application's support team for more information.
663
664make[3]: *** [ghc.mk:1004: install_packages] Error 1
665make[2]: *** [Makefile:127: install] Error 2
666make[1]: *** [ghc.mk:1127: windows-binary-dist-prep] Error 2
667make: *** [Makefile:145: binary-dist-prep] Error 2
668

Build Log 278844 (remote - stdout)
25 - 50 - 100 - Unlimited Lines

7064Installing library in C:/msys64/var/drydock/workingcopy-121273/repo/glasgow-haskell-compiler/bindistprep/ghc-8.5.20180523/lib\process-1.6.3.0
7065Installing library in C:/msys64/var/drydock/workingcopy-121273/repo/glasgow-haskell-compiler/bindistprep/ghc-8.5.20180523/lib\hpc-0.6.0.3
7066Installing library in C:/msys64/var/drydock/workingcopy-121273/repo/glasgow-haskell-compiler/bindistprep/ghc-8.5.20180523/lib\pretty-1.1.3.6
7067Installing library in C:/msys64/var/drydock/workingcopy-121273/repo/glasgow-haskell-compiler/bindistprep/ghc-8.5.20180523/lib\binary-0.8.5.1
7068Installing library in C:/msys64/var/drydock/workingcopy-121273/repo/glasgow-haskell-compiler/bindistprep/ghc-8.5.20180523/lib\text-1.2.3.0
7069Installing library in C:/msys64/var/drydock/workingcopy-121273/repo/glasgow-haskell-compiler/bindistprep/ghc-8.5.20180523/lib\transformers-0.5.5.0
7070Installing library in C:/msys64/var/drydock/workingcopy-121273/repo/glasgow-haskell-compiler/bindistprep/ghc-8.5.20180523/lib\mtl-2.2.2
7071Installing library in C:/msys64/var/drydock/workingcopy-121273/repo/glasgow-haskell-compiler/bindistprep/ghc-8.5.20180523/lib\parsec-3.1.13.0.0.0.0.0
7072Installing library in C:/msys64/var/drydock/workingcopy-121273/repo/glasgow-haskell-compiler/bindistprep/ghc-8.5.20180523/lib\Cabal-2.3.0.0
7073Installing library in C:/msys64/var/drydock/workingcopy-121273/repo/glasgow-haskell-compiler/bindistprep/ghc-8.5.20180523/lib\ghc-boot-th-8.5
7074Installing library in C:/msys64/var/drydock/workingcopy-121273/repo/glasgow-haskell-compiler/bindistprep/ghc-8.5.20180523/lib\ghc-boot-8.5
7075Installing library in C:/msys64/var/drydock/workingcopy-121273/repo/glasgow-haskell-compiler/bindistprep/ghc-8.5.20180523/lib\template-haskell-2.14.0.0
7076Installing library in C:/msys64/var/drydock/workingcopy-121273/repo/glasgow-haskell-compiler/bindistprep/ghc-8.5.20180523/lib\ghc-compact-0.1.0.0
7077Installing library in C:/msys64/var/drydock/workingcopy-121273/repo/glasgow-haskell-compiler/bindistprep/ghc-8.5.20180523/lib\ghc-heap-8.5
7078Installing library in C:/msys64/var/drydock/workingcopy-121273/repo/glasgow-haskell-compiler/bindistprep/ghc-8.5.20180523/lib\xhtml-3000.2.2
7079Installing library in C:/msys64/var/drydock/workingcopy-121273/repo/glasgow-haskell-compiler/bindistprep/ghc-8.5.20180523/lib\stm-2.4.5.0
7080Installing library in C:/msys64/var/drydock/workingcopy-121273/repo/glasgow-haskell-compiler/bindistprep/ghc-8.5.20180523/lib\haskeline-0.7.4.2
7081Installing library in C:/msys64/var/drydock/workingcopy-121273/repo/glasgow-haskell-compiler/bindistprep/ghc-8.5.20180523/lib\ghci-8.5
7082Installing library in C:/msys64/var/drydock/workingcopy-121273/repo/glasgow-haskell-compiler/bindistprep/ghc-8.5.20180523/lib\ghc-8.5
7083Installing library in C:/msys64/var/drydock/workingcopy-121273/repo/glasgow-haskell-compiler/bindistprep/ghc-8.5.20180523/lib\parallel-3.2.1.1
7084Installing library in C:/msys64/var/drydock/workingcopy-121273/repo/glasgow-haskell-compiler/bindistprep/ghc-8.5.20180523/lib\random-1.1
7085Reading package info from "rts/dist/package.conf.install" ... done.
7086Registering library for ghc-prim-0.5.3..
7087Registering library for integer-gmp-1.0.2.0..
7088

Drydock: Prepare tree

When
Completed at Jun 21 2018, 2:39 PM · Built for 1 m, 2 s
Status
Passed

Build Log 278843 (remote - stderr)
25 - 50 - 100 - Unlimited Lines

1+ git clean -qxfd
2+ git submodule foreach git checkout .
3+ git submodule foreach git clean -qxfd
4+ git submodule sync
5+ git submodule update --init --recursive
6+ git submodule foreach -q git clean -qxfd
7

Build Log 278842 (remote - stdout)
25 - 50 - 100 - Unlimited Lines

84Synchronizing submodule url for 'libraries/mtl'
85Synchronizing submodule url for 'libraries/parallel'
86Synchronizing submodule url for 'libraries/parsec'
87Synchronizing submodule url for 'libraries/pretty'
88Synchronizing submodule url for 'libraries/primitive'
89Synchronizing submodule url for 'libraries/process'
90Synchronizing submodule url for 'libraries/random'
91Synchronizing submodule url for 'libraries/stm'
92Synchronizing submodule url for 'libraries/terminfo'
93Synchronizing submodule url for 'libraries/text'
94Synchronizing submodule url for 'libraries/time'
95Synchronizing submodule url for 'libraries/transformers'
96Synchronizing submodule url for 'libraries/unix'
97Synchronizing submodule url for 'libraries/vector'
98Synchronizing submodule url for 'libraries/xhtml'
99Synchronizing submodule url for 'nofib'
100Synchronizing submodule url for 'utils/haddock'
101Synchronizing submodule url for 'utils/hsc2hs'
102Submodule path 'hadrian': checked out '7c3c45f4539af8e75764a1c100dfbb35a86f4be3'
103Submodule path 'libraries/Cabal': checked out 'cbdb135bdadab9595f1a80be4c65453b49a9dde2'
104Submodule path 'libraries/binary': checked out 'd4a030ab448191f664fc734bfbee61450a6fa5af'
105Submodule path 'libraries/haskeline': checked out '481b890e8616d9e85da69173d5079ad49f9fb83d'
106Submodule path 'libraries/stm': checked out '33a36c33de150f562a98803e2fc332f07bb29457'
107Submodule path 'utils/haddock': checked out '46ff2306f580c44915a6f3adb652f02b7f4edfe9'
108

Lease Working Copy

When
Completed at Jun 21 2018, 2:38 PM · Built for 4 w, 1 d
Status
Passed